activemq-dev mailing list archives

Site index · List index
Message view « Date » · « Thread »
Top « Date » · « Thread »
From Apache Jenkins Server <jenk...@builds.apache.org>
Subject Build failed in Jenkins: ActiveMQ-Java7 » ActiveMQ :: Core #15
Date Thu, 27 Sep 2012 02:13:37 GMT
See <https://builds.apache.org/job/ActiveMQ-Java7/org.apache.activemq$activemq-core/15/changes>

Changes:

[tabish] fix and tests for: https://issues.apache.org/jira/browse/AMQ-4083

Ensure that client ack mode sends acks for expired messages.

------------------------------------------
[...truncated 158 lines...]
Tests run: 1, Failures: 0, Errors: 0, Skipped: 0, Time elapsed: 1.747 sec
Running org.apache.activemq.JmsQueueSendReceiveUsingTwoSessionsTest
Tests run: 1, Failures: 0, Errors: 0, Skipped: 0, Time elapsed: 1.851 sec
Running org.apache.activemq.JmsQueueTopicCompositeSendReceiveTest
Tests run: 1, Failures: 0, Errors: 0, Skipped: 0, Time elapsed: 1.77 sec
Running org.apache.activemq.JmsQueueTransactionTest
Tests run: 17, Failures: 0, Errors: 0, Skipped: 0, Time elapsed: 22.182 sec
Running org.apache.activemq.JmsQueueWildcardSendReceiveTest
Tests run: 4, Failures: 0, Errors: 0, Skipped: 0, Time elapsed: 2.526 sec
Running org.apache.activemq.JmsRedeliveredTest
Tests run: 18, Failures: 0, Errors: 0, Skipped: 0, Time elapsed: 13.476 sec
Running org.apache.activemq.JmsRollbackRedeliveryTest
Tests run: 9, Failures: 0, Errors: 0, Skipped: 0, Time elapsed: 10.962 sec
Running org.apache.activemq.JmsSendReceiveWithMessageExpirationTest
Tests run: 5, Failures: 1, Errors: 0, Skipped: 0, Time elapsed: 18.162 sec <<< FAILURE!
testConsumeExpiredQueueAndDlq(org.apache.activemq.JmsSendReceiveWithMessageExpirationTest)
 Time elapsed: 3670 sec  <<< FAILURE!
junit.framework.AssertionFailedError: got dlq messages expected:<99> but was:<100>
	at junit.framework.Assert.fail(Assert.java:50)
	at junit.framework.Assert.failNotEquals(Assert.java:287)
	at junit.framework.Assert.assertEquals(Assert.java:67)
	at junit.framework.Assert.assertEquals(Assert.java:199)
	at org.apache.activemq.JmsSendReceiveWithMessageExpirationTest.testConsumeExpiredQueueAndDlq(JmsSendReceiveWithMessageExpirationTest.java:161)
	at sun.reflect.NativeMethodAccessorImpl.invoke0(Native Method)
	at sun.reflect.NativeMethodAccessorImpl.invoke(NativeMethodAccessorImpl.java:57)
	at sun.reflect.DelegatingMethodAccessorImpl.invoke(DelegatingMethodAccessorImpl.java:43)
	at java.lang.reflect.Method.invoke(Method.java:601)
	at junit.framework.TestCase.runTest(TestCase.java:168)
	at junit.framework.TestCase.runBare(TestCase.java:134)
	at org.apache.activemq.CombinationTestSupport.runBare(CombinationTestSupport.java:90)
	at org.apache.activemq.CombinationTestSupport.runBare(CombinationTestSupport.java:96)
	at junit.framework.TestResult$1.protect(TestResult.java:110)
	at junit.framework.TestResult.runProtected(TestResult.java:128)
	at junit.framework.TestResult.run(TestResult.java:113)
	at junit.framework.TestCase.run(TestCase.java:124)
	at junit.framework.TestSuite.runTest(TestSuite.java:243)
	at junit.framework.TestSuite.run(TestSuite.java:238)
	at org.junit.internal.runners.JUnit38ClassRunner.run(JUnit38ClassRunner.java:83)
	at org.apache.maven.surefire.junit4.JUnit4Provider.execute(JUnit4Provider.java:252)
	at org.apache.maven.surefire.junit4.JUnit4Provider.executeTestSet(JUnit4Provider.java:141)
	at org.apache.maven.surefire.junit4.JUnit4Provider.invoke(JUnit4Provider.java:112)
	at sun.reflect.NativeMethodAccessorImpl.invoke0(Native Method)
	at sun.reflect.NativeMethodAccessorImpl.invoke(NativeMethodAccessorImpl.java:57)
	at sun.reflect.DelegatingMethodAccessorImpl.invoke(DelegatingMethodAccessorImpl.java:43)
	at java.lang.reflect.Method.invoke(Method.java:601)
	at org.apache.maven.surefire.util.ReflectionUtils.invokeMethodWithArray(ReflectionUtils.java:189)
	at org.apache.maven.surefire.booter.ProviderFactory$ProviderProxy.invoke(ProviderFactory.java:165)
	at org.apache.maven.surefire.booter.ProviderFactory.invokeProvider(ProviderFactory.java:85)
	at org.apache.maven.surefire.booter.ForkedBooter.runSuitesInProcess(ForkedBooter.java:115)
	at org.apache.maven.surefire.booter.ForkedBooter.main(ForkedBooter.java:75)

Running org.apache.activemq.JmsSendWithAsyncCallbackTest
Tests run: 1, Failures: 0, Errors: 0, Skipped: 0, Time elapsed: 2.865 sec
Running org.apache.activemq.JmsSessionRecoverTest
Tests run: 6, Failures: 0, Errors: 0, Skipped: 0, Time elapsed: 7.372 sec
Running org.apache.activemq.JmsTempDestinationTest
Tests run: 8, Failures: 0, Errors: 0, Skipped: 0, Time elapsed: 38.269 sec
Running org.apache.activemq.JmsTopicCompositeSendReceiveTest
Tests run: 1, Failures: 0, Errors: 0, Skipped: 0, Time elapsed: 1.747 sec
Running org.apache.activemq.JmsTopicRedeliverTest
Tests run: 1, Failures: 0, Errors: 0, Skipped: 0, Time elapsed: 1.657 sec
Running org.apache.activemq.JmsTopicRequestReplyTest
Tests run: 2, Failures: 0, Errors: 0, Skipped: 0, Time elapsed: 0.793 sec
Running org.apache.activemq.JmsTopicSelectorTest
Tests run: 3, Failures: 0, Errors: 0, Skipped: 0, Time elapsed: 8.789 sec
Running org.apache.activemq.JmsTopicSendReceiveSubscriberTest
Tests run: 1, Failures: 0, Errors: 0, Skipped: 0, Time elapsed: 0.717 sec
Running org.apache.activemq.JmsTopicSendReceiveTest
Tests run: 1, Failures: 0, Errors: 0, Skipped: 0, Time elapsed: 0.708 sec
Running org.apache.activemq.JmsTopicSendReceiveWithTwoConnectionsTest
Tests run: 1, Failures: 0, Errors: 0, Skipped: 0, Time elapsed: 0.744 sec
Running org.apache.activemq.JmsTopicSendReceiveWithTwoConnectionsWithJMXTest
Tests run: 1, Failures: 0, Errors: 0, Skipped: 0, Time elapsed: 0.719 sec
Running org.apache.activemq.JmsTopicSendSameMessageTest
Tests run: 1, Failures: 0, Errors: 0, Skipped: 0, Time elapsed: 0.721 sec
Running org.apache.activemq.JmsTopicTransactionTest
Tests run: 14, Failures: 0, Errors: 0, Skipped: 0, Time elapsed: 20.627 sec
Running org.apache.activemq.JmsTopicWildcardSendReceiveTest
Tests run: 4, Failures: 0, Errors: 0, Skipped: 0, Time elapsed: 1.909 sec
Running org.apache.activemq.LargeStreamletTest
Tests run: 1, Failures: 0, Errors: 0, Skipped: 0, Time elapsed: 1.61 sec
Running org.apache.activemq.MessageEvictionTest
Tests run: 3, Failures: 0, Errors: 0, Skipped: 0, Time elapsed: 96.008 sec
Running org.apache.activemq.MessageListenerRedeliveryTest
Tests run: 4, Failures: 0, Errors: 0, Skipped: 0, Time elapsed: 16.952 sec
Running org.apache.activemq.MessageTransformationTest
Tests run: 2, Failures: 0, Errors: 0, Skipped: 0, Time elapsed: 0.175 sec
Running org.apache.activemq.OnePrefetchAsyncConsumerTest
Tests run: 1, Failures: 0, Errors: 0, Skipped: 0, Time elapsed: 6.606 sec
Running org.apache.activemq.OptimizedAckTest
Tests run: 3, Failures: 0, Errors: 0, Skipped: 0, Time elapsed: 15.836 sec
Running org.apache.activemq.PerDestinationStoreLimitTest
Tests run: 2, Failures: 0, Errors: 0, Skipped: 0, Time elapsed: 43.564 sec
Running org.apache.activemq.ProducerFlowControlSendFailTest
Tests run: 7, Failures: 0, Errors: 0, Skipped: 0, Time elapsed: 18.488 sec
Running org.apache.activemq.ProducerFlowControlTest
Tests run: 6, Failures: 0, Errors: 0, Skipped: 0, Time elapsed: 26.028 sec
Running org.apache.activemq.QueueConsumerPriorityTest
Tests run: 1, Failures: 0, Errors: 0, Skipped: 0, Time elapsed: 5.673 sec
Running org.apache.activemq.ReconnectWithSameClientIDTest
Tests run: 2, Failures: 0, Errors: 0, Skipped: 0, Time elapsed: 4.821 sec
Running org.apache.activemq.RedeliveryPolicyTest
Tests run: 10, Failures: 0, Errors: 0, Skipped: 0, Time elapsed: 15.197 sec
Running org.apache.activemq.RemoveDestinationTest
Tests run: 2, Failures: 0, Errors: 0, Skipped: 0, Time elapsed: 20.216 sec
Running org.apache.activemq.TimeStampTest
Tests run: 1, Failures: 0, Errors: 0, Skipped: 0, Time elapsed: 4.552 sec
Running org.apache.activemq.TransactionContextTest
Tests run: 2, Failures: 0, Errors: 0, Skipped: 0, Time elapsed: 2.477 sec
Running org.apache.activemq.ZeroPrefetchConsumerTest
Tests run: 11, Failures: 0, Errors: 0, Skipped: 0, Time elapsed: 22.739 sec
Running org.apache.activemq.advisory.ConsumerListenerTest
Tests run: 2, Failures: 0, Errors: 0, Skipped: 0, Time elapsed: 0.755 sec
Running org.apache.activemq.advisory.DestinationListenerTest
Tests run: 3, Failures: 0, Errors: 0, Skipped: 0, Time elapsed: 7.901 sec
Running org.apache.activemq.advisory.MasterSlaveTempQueueMemoryTest
Tests run: 6, Failures: 0, Errors: 0, Skipped: 0, Time elapsed: 40.625 sec
Running org.apache.activemq.advisory.ProducerListenerTest
Tests run: 2, Failures: 0, Errors: 0, Skipped: 0, Time elapsed: 0.743 sec
Running org.apache.activemq.advisory.TempDestDeleteTest
Tests run: 2, Failures: 0, Errors: 0, Skipped: 0, Time elapsed: 0.773 sec
Running org.apache.activemq.advisory.TempDestLoadTest
Tests run: 2, Failures: 0, Errors: 0, Skipped: 0, Time elapsed: 18.244 sec
Running org.apache.activemq.advisory.TempQueueMemoryTest
Tests run: 2, Failures: 0, Errors: 0, Skipped: 0, Time elapsed: 20.27 sec
Running org.apache.activemq.blob.BlobTransferPolicyUriTest
Tests run: 1, Failures: 0, Errors: 0, Skipped: 0, Time elapsed: 0.177 sec
Running org.apache.activemq.blob.FTPBlobDownloadStrategyTest
Tests run: 3, Failures: 0, Errors: 0, Skipped: 0, Time elapsed: 1.77 sec
Running org.apache.activemq.blob.FTPBlobTest
Tests run: 1, Failures: 0, Errors: 0, Skipped: 0, Time elapsed: 1.997 sec
Running org.apache.activemq.blob.FTPBlobUploadStrategyTest
Tests run: 2, Failures: 0, Errors: 0, Skipped: 0, Time elapsed: 0.954 sec
Running org.apache.activemq.blob.FilesystemBlobTest
Tests run: 1, Failures: 0, Errors: 0, Skipped: 0, Time elapsed: 1.683 sec
Running org.apache.activemq.broker.BrokerRedeliveryTest
Tests run: 1, Failures: 0, Errors: 0, Skipped: 0, Time elapsed: 9.124 sec
Running org.apache.activemq.broker.BrokerServiceTest
Tests run: 5, Failures: 0, Errors: 0, Skipped: 0, Time elapsed: 4.634 sec
Running org.apache.activemq.broker.BrokerTest
Tests run: 129, Failures: 0, Errors: 0, Skipped: 0, Time elapsed: 21.435 sec
Running org.apache.activemq.broker.ConcurrentConnectSimulationTest
Tests run: 1, Failures: 0, Errors: 0, Skipped: 0, Time elapsed: 0.586 sec
Running org.apache.activemq.broker.CreateDestinationsOnStartupViaXBeanTest
Tests run: 1, Failures: 0, Errors: 0, Skipped: 0, Time elapsed: 2.238 sec
Running org.apache.activemq.broker.DedicatedTaskRunnerBrokerTest
Tests run: 129, Failures: 0, Errors: 0, Skipped: 0, Time elapsed: 21.45 sec
Running org.apache.activemq.broker.DoubleSubscriptionTest
Tests run: 1, Failures: 0, Errors: 0, Skipped: 0, Time elapsed: 2.535 sec
Running org.apache.activemq.broker.DurablePersistentFalseRestartTest
Tests run: 1, Failures: 0, Errors: 0, Skipped: 0, Time elapsed: 6.724 sec
Running org.apache.activemq.broker.JdbcXARecoveryBrokerTest
Tests run: 16, Failures: 0, Errors: 0, Skipped: 0, Time elapsed: 132.524 sec
Running org.apache.activemq.broker.MessageExpirationTest
Tests run: 13, Failures: 0, Errors: 0, Skipped: 0, Time elapsed: 23.152 sec
Running org.apache.activemq.broker.OutOfOrderXMLTest
Tests run: 1, Failures: 0, Errors: 0, Skipped: 0, Time elapsed: 1.483 sec
Running org.apache.activemq.broker.QueueMbeanRestartTest
Tests run: 2, Failures: 0, Errors: 0, Skipped: 0, Time elapsed: 14.69 sec
Running org.apache.activemq.broker.QueueSubscriptionTest
Tests run: 8, Failures: 0, Errors: 0, Skipped: 0, Time elapsed: 3.495 sec
Running org.apache.activemq.broker.ReconnectWithJMXEnabledTest
Tests run: 1, Failures: 0, Errors: 0, Skipped: 0, Time elapsed: 4.628 sec
Running org.apache.activemq.broker.RecoveryBrokerTest
Tests run: 9, Failures: 0, Errors: 0, Skipped: 0, Time elapsed: 32.917 sec
Running org.apache.activemq.broker.RedeliveryRestartTest
Tests run: 2, Failures: 0, Errors: 0, Skipped: 0, Time elapsed: 12.33 sec
Running org.apache.activemq.broker.SpringTest
Tests run: 1, Failures: 0, Errors: 0, Skipped: 0, Time elapsed: 2.746 sec
Running org.apache.activemq.broker.TopicSubscriptionTest
Tests run: 8, Failures: 0, Errors: 0, Skipped: 0, Time elapsed: 4.292 sec
Running org.apache.activemq.broker.XARecoveryBrokerTest
Tests run: 16, Failures: 0, Errors: 0, Skipped: 0, Time elapsed: 73.393 sec
Running org.apache.activemq.broker.advisory.AdvisoryBrokerTest
Tests run: 6, Failures: 0, Errors: 0, Skipped: 0, Time elapsed: 0.85 sec
Running org.apache.activemq.broker.advisory.AdvisoryDuplexNetworkBridgeTest
Tests run: 2, Failures: 0, Errors: 0, Skipped: 0, Time elapsed: 11.739 sec
Running org.apache.activemq.broker.advisory.AdvisoryJmxTest
Tests run: 1, Failures: 0, Errors: 0, Skipped: 0, Time elapsed: 0.704 sec
Running org.apache.activemq.broker.advisory.AdvisoryNetworkBridgeTest
Tests run: 2, Failures: 0, Errors: 0, Skipped: 0, Time elapsed: 10.876 sec
Running org.apache.activemq.broker.ft.DbRestartJDBCQueueMasterSlaveLeaseQuiesceTest
Running org.apache.activemq.broker.ft.DbRestartJDBCQueueMasterSlaveLeaseTest
Tests run: 2, Failures: 0, Errors: 0, Skipped: 0, Time elapsed: 80.394 sec
Running org.apache.activemq.broker.ft.DbRestartJDBCQueueMasterSlaveTest
Running org.apache.activemq.broker.ft.JDBCQueueMasterSlaveTest
Tests run: 2, Failures: 0, Errors: 0, Skipped: 0, Time elapsed: 164.621 sec
Running org.apache.activemq.broker.ft.MasterSlaveProducerFlowControlTest
Tests run: 6, Failures: 0, Errors: 0, Skipped: 0, Time elapsed: 26.381 sec
Running org.apache.activemq.broker.ft.MasterSlaveSlaveDieTest
Tests run: 1, Failures: 0, Errors: 0, Skipped: 0, Time elapsed: 2.734 sec
Running org.apache.activemq.broker.ft.MasterSlaveSlaveShutdownTest
Tests run: 1, Failures: 0, Errors: 0, Skipped: 0, Time elapsed: 33.136 sec
Running org.apache.activemq.broker.ft.QueueMasterSlaveSingleUrlTest
Tests run: 2, Failures: 1, Errors: 0, Skipped: 0, Time elapsed: 55.288 sec <<< FAILURE!
testVirtualTopicFailover(org.apache.activemq.broker.ft.QueueMasterSlaveSingleUrlTest)  Time
elapsed: 30747 sec  <<< FAILURE!
junit.framework.AssertionFailedError: slave started
	at junit.framework.Assert.fail(Assert.java:50)
	at junit.framework.Assert.assertTrue(Assert.java:20)
	at org.apache.activemq.broker.ft.QueueMasterSlaveTest.testVirtualTopicFailover(QueueMasterSlaveTest.java:125)
	at sun.reflect.NativeMethodAccessorImpl.invoke0(Native Method)
	at sun.reflect.NativeMethodAccessorImpl.invoke(NativeMethodAccessorImpl.java:57)
	at sun.reflect.DelegatingMethodAccessorImpl.invoke(DelegatingMethodAccessorImpl.java:43)
	at java.lang.reflect.Method.invoke(Method.java:601)
	at junit.framework.TestCase.runTest(TestCase.java:168)
	at junit.framework.TestCase.runBare(TestCase.java:134)
	at org.apache.activemq.CombinationTestSupport.runBare(CombinationTestSupport.java:90)
	at org.apache.activemq.CombinationTestSupport.runBare(CombinationTestSupport.java:96)
	at junit.framework.TestResult$1.protect(TestResult.java:110)
	at junit.framework.TestResult.runProtected(TestResult.java:128)
	at junit.framework.TestResult.run(TestResult.java:113)
	at junit.framework.TestCase.run(TestCase.java:124)
	at junit.framework.TestSuite.runTest(TestSuite.java:243)
	at junit.framework.TestSuite.run(TestSuite.java:238)
	at org.junit.internal.runners.JUnit38ClassRunner.run(JUnit38ClassRunner.java:83)
	at org.apache.maven.surefire.junit4.JUnit4Provider.execute(JUnit4Provider.java:252)
	at org.apache.maven.surefire.junit4.JUnit4Provider.executeTestSet(JUnit4Provider.java:141)
	at org.apache.maven.surefire.junit4.JUnit4Provider.invoke(JUnit4Provider.java:112)
	at sun.reflect.NativeMethodAccessorImpl.invoke0(Native Method)
	at sun.reflect.NativeMethodAccessorImpl.invoke(NativeMethodAccessorImpl.java:57)
	at sun.reflect.DelegatingMethodAccessorImpl.invoke(DelegatingMethodAccessorImpl.java:43)
	at java.lang.reflect.Method.invoke(Method.java:601)
	at org.apache.maven.surefire.util.ReflectionUtils.invokeMethodWithArray(ReflectionUtils.java:189)
	at org.apache.maven.surefire.booter.ProviderFactory$ProviderProxy.invoke(ProviderFactory.java:165)
	at org.apache.maven.surefire.booter.ProviderFactory.invokeProvider(ProviderFactory.java:85)
	at org.apache.maven.surefire.booter.ForkedBooter.runSuitesInProcess(ForkedBooter.java:115)
	at org.apache.maven.surefire.booter.ForkedBooter.main(ForkedBooter.java:75)

Running org.apache.activemq.broker.ft.QueueMasterSlaveTest
Tests run: 2, Failures: 0, Errors: 0, Skipped: 0, Time elapsed: 55.882 sec
Running org.apache.activemq.broker.ft.QueueMasterSlaveTestUsingSharedFileTest
Tests run: 2, Failures: 0, Errors: 0, Skipped: 0, Time elapsed: 34.685 sec
Running org.apache.activemq.broker.ft.QueueMasterSlaveUsingMasterConnectorElementCompositeQueueTest
Tests run: 2, Failures: 0, Errors: 0, Skipped: 0, Time elapsed: 75.441 sec
Running org.apache.activemq.broker.ft.QueueMasterSlaveUsingMasterConnectorElementTest
Tests run: 2, Failures: 0, Errors: 0, Skipped: 0, Time elapsed: 92.518 sec
Running org.apache.activemq.broker.ft.TopicMasterSlaveTest
Tests run: 2, Failures: 0, Errors: 0, Skipped: 0, Time elapsed: 122.979 sec
Running org.apache.activemq.broker.ft.TransactedTopicMasterSlaveTest

Results :

Failed tests:   testConsumeExpiredQueueAndDlq(org.apache.activemq.JmsSendReceiveWithMessageExpirationTest):
got dlq messages expected:<99> but was:<100>
  testVirtualTopicFailover(org.apache.activemq.broker.ft.QueueMasterSlaveSingleUrlTest): slave
started

Tests run: 927, Failures: 2, Errors: 0, Skipped: 0

mojoFailed org.apache.maven.plugins:maven-surefire-plugin:2.12.3(default-test)
[JENKINS] Recording test results
projectFailed org.apache.activemq:activemq-core:5.7-SNAPSHOT

Mime
View raw message