activemq-dev mailing list archives

Site index · List index
Message view « Date » · « Thread »
Top « Date » · « Thread »
From Apache Jenkins Server <jenk...@builds.apache.org>
Subject Build failed in Jenkins: ActiveMQ-Trunk-Deploy #538
Date Fri, 01 Jun 2012 07:14:55 GMT
See <https://builds.apache.org/job/ActiveMQ-Trunk-Deploy/538/changes>

Changes:

[tabish] apply fix for: https://issues.apache.org/jira/browse/AMQ-3865

[tabish] apply patch for: https://issues.apache.org/jira/browse/AMQ-3857

[tabish] fix for: https://issues.apache.org/jira/browse/AMQ-3836

Make a best effort to find the correct destination name even if space padded before falling
back to the fallback conversion config.

[tabish] fix for: https://issues.apache.org/jira/browse/AMQ-3871

Fix the addMessageFirst and values methods in OrderedPendingList and add tests for both OrderedPendingList
and PrioritizedPendingList along with a test case to show the bad behavior for re-delivered
in-flight non-persistent messages with durable subscribers.

[tabish] Fix for: https://issues.apache.org/jira/browse/AMQ-3841

Make the call to adapter.getDestinations() only once.

------------------------------------------
[...truncated 16209 lines...]
Generating <https://builds.apache.org/job/ActiveMQ-Trunk-Deploy/ws/deploy/activemq-web-console/target/apidocs/org/apache/activemq/web/controller//class-use/DeleteSubscriber.html...>
Generating <https://builds.apache.org/job/ActiveMQ-Trunk-Deploy/ws/deploy/activemq-web-console/target/apidocs/org/apache/activemq/web/controller//class-use/DeleteDestination.html...>
Generating <https://builds.apache.org/job/ActiveMQ-Trunk-Deploy/ws/deploy/activemq-web-console/target/apidocs/org/apache/activemq/web/controller//class-use/CreateSubscriber.html...>
Generating <https://builds.apache.org/job/ActiveMQ-Trunk-Deploy/ws/deploy/activemq-web-console/target/apidocs/org/apache/activemq/web/controller//class-use/DeleteMessage.html...>
Generating <https://builds.apache.org/job/ActiveMQ-Trunk-Deploy/ws/deploy/activemq-web-console/target/apidocs/org/apache/activemq/web/controller//class-use/CreateDestination.html...>
Generating <https://builds.apache.org/job/ActiveMQ-Trunk-Deploy/ws/deploy/activemq-web-console/target/apidocs/org/apache/activemq/web/controller//class-use/CopyMessage.html...>
Generating <https://builds.apache.org/job/ActiveMQ-Trunk-Deploy/ws/deploy/activemq-web-console/target/apidocs/org/apache/activemq/web//package-use.html...>
Generating <https://builds.apache.org/job/ActiveMQ-Trunk-Deploy/ws/deploy/activemq-web-console/target/apidocs/org/apache/activemq/web/controller//package-use.html...>
Generating <https://builds.apache.org/job/ActiveMQ-Trunk-Deploy/ws/deploy/activemq-web-console/target/apidocs/org/apache/activemq/web/filter//package-use.html...>
Generating <https://builds.apache.org/job/ActiveMQ-Trunk-Deploy/ws/deploy/activemq-web-console/target/apidocs/org/apache/activemq/web/handler//package-use.html...>
Building index for all the packages and classes...
Generating <https://builds.apache.org/job/ActiveMQ-Trunk-Deploy/ws/deploy/activemq-web-console/target/apidocs/overview-tree.html...>
Generating <https://builds.apache.org/job/ActiveMQ-Trunk-Deploy/ws/deploy/activemq-web-console/target/apidocs/index-all.html...>
Generating <https://builds.apache.org/job/ActiveMQ-Trunk-Deploy/ws/deploy/activemq-web-console/target/apidocs/deprecated-list.html...>
Building index for all classes...
Generating <https://builds.apache.org/job/ActiveMQ-Trunk-Deploy/ws/deploy/activemq-web-console/target/apidocs/allclasses-frame.html...>
Generating <https://builds.apache.org/job/ActiveMQ-Trunk-Deploy/ws/deploy/activemq-web-console/target/apidocs/allclasses-noframe.html...>
Generating <https://builds.apache.org/job/ActiveMQ-Trunk-Deploy/ws/deploy/activemq-web-console/target/apidocs/index.html...>
Generating <https://builds.apache.org/job/ActiveMQ-Trunk-Deploy/ws/deploy/activemq-web-console/target/apidocs/overview-summary.html...>
Generating <https://builds.apache.org/job/ActiveMQ-Trunk-Deploy/ws/deploy/activemq-web-console/target/apidocs/help-doc.html...>
[INFO] Building jar: <https://builds.apache.org/job/ActiveMQ-Trunk-Deploy/ws/deploy/activemq-web-console/target/activemq-web-console-5.7-SNAPSHOT-javadoc.jar>
[INFO] [ianal:verify-legal-files {execution: default}]
[INFO] Checking legal files in: activemq-web-console-5.7-SNAPSHOT.war
[INFO] Checking legal files in: activemq-web-console-5.7-SNAPSHOT-sources.jar
[INFO] Checking legal files in: activemq-web-console-5.7-SNAPSHOT-javadoc.jar
[INFO] [install:install {execution: default-install}]
[INFO] Installing <https://builds.apache.org/job/ActiveMQ-Trunk-Deploy/ws/deploy/activemq-web-console/target/activemq-web-console-5.7-SNAPSHOT.war>
to <https://builds.apache.org/job/ActiveMQ-Trunk-Deploy/ws/.repository/org/apache/activemq/activemq-web-console/5.7-SNAPSHOT/activemq-web-console-5.7-SNAPSHOT.war>
[INFO] Installing <https://builds.apache.org/job/ActiveMQ-Trunk-Deploy/ws/deploy/activemq-web-console/target/activemq-web-console-5.7-SNAPSHOT-sources.jar>
to <https://builds.apache.org/job/ActiveMQ-Trunk-Deploy/ws/.repository/org/apache/activemq/activemq-web-console/5.7-SNAPSHOT/activemq-web-console-5.7-SNAPSHOT-sources.jar>
[INFO] Installing <https://builds.apache.org/job/ActiveMQ-Trunk-Deploy/ws/deploy/activemq-web-console/target/activemq-web-console-5.7-SNAPSHOT-javadoc.jar>
to <https://builds.apache.org/job/ActiveMQ-Trunk-Deploy/ws/.repository/org/apache/activemq/activemq-web-console/5.7-SNAPSHOT/activemq-web-console-5.7-SNAPSHOT-javadoc.jar>
[INFO] [deploy:deploy {execution: default-deploy}]
[INFO] Retrieving previous build number from apache.snapshots.https
[WARNING] *** CHECKSUM FAILED - Checksum failed on download: local = '88fd507612fc0af6e69bdcd7b3c62edb2dcdf9e8';
remote = 'e63f302daca71c45bbd61b2b82d438c2a8b587ea' - RETRYING
[WARNING] *** CHECKSUM FAILED - Checksum failed on download: local = '88fd507612fc0af6e69bdcd7b3c62edb2dcdf9e8';
remote = 'e63f302daca71c45bbd61b2b82d438c2a8b587ea' - IGNORING
Uploading: https://repository.apache.org/content/repositories/snapshots/org/apache/activemq/activemq-web-console/5.7-SNAPSHOT/activemq-web-console-5.7-SNAPSHOT.war
39902K uploaded  (activemq-web-console-5.7-SNAPSHOT.war)
[INFO] Retrieving previous metadata from apache.snapshots.https
[INFO] Uploading repository metadata for: 'artifact org.apache.activemq:activemq-web-console'
[INFO] Retrieving previous metadata from apache.snapshots.https
[WARNING] *** CHECKSUM FAILED - Checksum failed on download: local = '88fd507612fc0af6e69bdcd7b3c62edb2dcdf9e8';
remote = 'e63f302daca71c45bbd61b2b82d438c2a8b587ea' - RETRYING
[WARNING] *** CHECKSUM FAILED - Checksum failed on download: local = '88fd507612fc0af6e69bdcd7b3c62edb2dcdf9e8';
remote = 'e63f302daca71c45bbd61b2b82d438c2a8b587ea' - IGNORING
[INFO] Uploading repository metadata for: 'snapshot org.apache.activemq:activemq-web-console:5.7-SNAPSHOT'
[INFO] Uploading project information for activemq-web-console 5.7-SNAPSHOT
[INFO] Retrieving previous build number from apache.snapshots.https
Uploading: https://repository.apache.org/content/repositories/snapshots/org/apache/activemq/activemq-web-console/5.7-SNAPSHOT/activemq-web-console-5.7-SNAPSHOT-sources.jar
26K uploaded  (activemq-web-console-5.7-SNAPSHOT-sources.jar)
[INFO] Retrieving previous build number from apache.snapshots.https
Uploading: https://repository.apache.org/content/repositories/snapshots/org/apache/activemq/activemq-web-console/5.7-SNAPSHOT/activemq-web-console-5.7-SNAPSHOT-javadoc.jar
139K uploaded  (activemq-web-console-5.7-SNAPSHOT-javadoc.jar)
[JENKINS] Archiving <https://builds.apache.org/job/ActiveMQ-Trunk-Deploy/ws/deploy/activemq-web-console/target/activemq-web-console-5.7-SNAPSHOT-sources.jar>
to /home/hudson/hudson/jobs/ActiveMQ-Trunk-Deploy/modules/org.apache.activemq$activemq-web-console/builds/2012-06-01_05-57-55/archive/org.apache.activemq/activemq-web-console/5.7-SNAPSHOT/activemq-web-console-5.7-SNAPSHOT-sources.jar
[JENKINS] Archiving <https://builds.apache.org/job/ActiveMQ-Trunk-Deploy/ws/deploy/activemq-web-console/target/activemq-web-console-5.7-SNAPSHOT-javadoc.jar>
to /home/hudson/hudson/jobs/ActiveMQ-Trunk-Deploy/modules/org.apache.activemq$activemq-web-console/builds/2012-06-01_05-57-55/archive/org.apache.activemq/activemq-web-console/5.7-SNAPSHOT/activemq-web-console-5.7-SNAPSHOT-javadoc.jar
[INFO] ------------------------------------------------------------------------
[INFO] Building ActiveMQ :: Assembly
[INFO]    task-segment: [clean, deploy]
[INFO] ------------------------------------------------------------------------
[INFO] [clean:clean {execution: default-clean}]
Downloading: http://repository.apache.org/snapshots/org/apache/activemq/activemq-camel/5.7-SNAPSHOT/activemq-camel-5.7-SNAPSHOT.jar
Downloading: http://repository.apache.org/snapshots/org/apache/activemq/activemq-core/5.7-SNAPSHOT/activemq-core-5.7-SNAPSHOT.jar
Downloading: http://repository.apache.org/snapshots/org/apache/activemq/kahadb/5.7-SNAPSHOT/kahadb-5.7-SNAPSHOT.jar
Downloading: http://repository.apache.org/snapshots/org/apache/activemq/activemq-console/5.7-SNAPSHOT/activemq-console-5.7-SNAPSHOT.jar
Downloading: http://repository.apache.org/snapshots/org/apache/activemq/activemq-pool/5.7-SNAPSHOT/activemq-pool-5.7-SNAPSHOT.jar
Downloading: http://repository.apache.org/snapshots/org/apache/activemq/activemq-web/5.7-SNAPSHOT/activemq-web-5.7-SNAPSHOT.jar
Downloading: http://repository.apache.org/snapshots/org/apache/activemq/activemq-jaas/5.7-SNAPSHOT/activemq-jaas-5.7-SNAPSHOT.jar
Downloading: http://repository.apache.org/snapshots/org/apache/activemq/activemq-spring/5.7-SNAPSHOT/activemq-spring-5.7-SNAPSHOT.jar
[INFO] [enforcer:enforce {execution: default}]
[INFO] [bundle:cleanVersions {execution: cleanVersions}]
[INFO] [remote-resources:process {execution: default}]
[JENKINS] Recording test results[INFO] [resources:copy-resources {execution: copy-conf}]
[INFO] Using 'UTF-8' encoding to copy filtered resources.
[INFO] Copying 15 resources
[INFO] Copying 16 resources
[INFO] [surefire:test {execution: validate-config}]
[INFO] No tests to run.
[INFO] Surefire report directory: <https://builds.apache.org/job/ActiveMQ-Trunk-Deploy/ws/deploy/assembly/target/surefire-reports>

-------------------------------------------------------
 T E S T S
-------------------------------------------------------

-------------------------------------------------------
 T E S T S
-------------------------------------------------------

Results :

Tests run: 0, Failures: 0, Errors: 0, Skipped: 0

[INFO] [site:attach-descriptor {execution: default-attach-descriptor}]
[INFO] Preparing source:jar
[WARNING] Removing: jar from forked lifecycle, to prevent recursive invocation.

[JENKINS] Archiving <https://builds.apache.org/job/ActiveMQ-Trunk-Deploy/ws/deploy/assembly/pom.xml>
to /home/hudson/hudson/jobs/ActiveMQ-Trunk-Deploy/modules/org.apache.activemq$apache-activemq/builds/2012-06-01_05-57-55/archive/org.apache.activemq/apache-activemq/5.7-SNAPSHOT/apache-activemq-5.7-SNAPSHOT.pom
[INFO] [enforcer:enforce {execution: default}]
[INFO] [bundle:cleanVersions {execution: cleanVersions}]
[INFO] [source:jar {execution: attach-sources}]
[INFO] [javadoc:jar {execution: attach-javadocs}]
[INFO] Not executing Javadoc as the project is not a Java classpath-capable package
[INFO] [dependency:unpack-dependencies {execution: unpack}]
[INFO] Unpacking <https://builds.apache.org/job/ActiveMQ-Trunk-Deploy/ws/.repository/org/apache/activemq/activemq-console/5.7-SNAPSHOT/activemq-console-5.7-SNAPSHOT.jarto>
 <https://builds.apache.org/job/ActiveMQ-Trunk-Deploy/ws/deploy/assembly/target/classes>
with Includes null and excludes:null
[INFO] [assembly:attached {execution: unix-bin}]
[INFO] Reading assembly descriptor: src/main/descriptors/unix-bin.xml
[WARNING] Cannot include project artifact: org.apache.activemq:apache-activemq:pom:5.7-SNAPSHOT;
it doesn't have an associated file or directory.
[WARNING] Cannot include project artifact: org.apache.activemq:apache-activemq:pom:5.7-SNAPSHOT;
it doesn't have an associated file or directory.
[WARNING] Cannot include project artifact: org.apache.activemq:apache-activemq:pom:5.7-SNAPSHOT;
it doesn't have an associated file or directory.
[WARNING] Cannot include project artifact: org.apache.activemq:apache-activemq:pom:5.7-SNAPSHOT;
it doesn't have an associated file or directory.
[WARNING] Cannot include project artifact: org.apache.activemq:apache-activemq:pom:5.7-SNAPSHOT;
it doesn't have an associated file or directory.
[WARNING] The following patterns were never triggered in this artifact inclusion filter:
o  'org.fusesource.commonman:commons-management'

[INFO] apache-activemq-5.7-SNAPSHOT/webapps/admin/WEB-INF already added, skipping
[INFO] Building tar : <https://builds.apache.org/job/ActiveMQ-Trunk-Deploy/ws/deploy/assembly/target/apache-activemq-5.7-SNAPSHOT-bin.tar.gz>
[INFO] apache-activemq-5.7-SNAPSHOT/webapps/admin/WEB-INF already added, skipping
[INFO] [assembly:attached {execution: windows-bin}]
[INFO] Reading assembly descriptor: src/main/descriptors/windows-bin.xml
[WARNING] Cannot include project artifact: org.apache.activemq:apache-activemq:pom:5.7-SNAPSHOT;
it doesn't have an associated file or directory.
[WARNING] Cannot include project artifact: org.apache.activemq:apache-activemq:pom:5.7-SNAPSHOT;
it doesn't have an associated file or directory.
[WARNING] Cannot include project artifact: org.apache.activemq:apache-activemq:pom:5.7-SNAPSHOT;
it doesn't have an associated file or directory.
[WARNING] Cannot include project artifact: org.apache.activemq:apache-activemq:pom:5.7-SNAPSHOT;
it doesn't have an associated file or directory.
[WARNING] Cannot include project artifact: org.apache.activemq:apache-activemq:pom:5.7-SNAPSHOT;
it doesn't have an associated file or directory.
[WARNING] The following patterns were never triggered in this artifact inclusion filter:
o  'org.fusesource.commonman:commons-management'

[INFO] apache-activemq-5.7-SNAPSHOT/webapps/admin/WEB-INF already added, skipping
[INFO] Building zip: <https://builds.apache.org/job/ActiveMQ-Trunk-Deploy/ws/deploy/assembly/target/apache-activemq-5.7-SNAPSHOT-bin.zip>
[INFO] apache-activemq-5.7-SNAPSHOT/webapps/admin/WEB-INF already added, skipping
[INFO] [ianal:verify-legal-files {execution: default}]
[INFO] Checking legal files in: apache-activemq-5.7-SNAPSHOT-bin.zip
[INFO] [install:install {execution: default-install}]
[INFO] Installing <https://builds.apache.org/job/ActiveMQ-Trunk-Deploy/ws/deploy/assembly/pom.xml>
to <https://builds.apache.org/job/ActiveMQ-Trunk-Deploy/ws/.repository/org/apache/activemq/apache-activemq/5.7-SNAPSHOT/apache-activemq-5.7-SNAPSHOT.pom>
[INFO] Installing <https://builds.apache.org/job/ActiveMQ-Trunk-Deploy/ws/deploy/assembly/target/apache-activemq-5.7-SNAPSHOT-bin.tar.gz>
to <https://builds.apache.org/job/ActiveMQ-Trunk-Deploy/ws/.repository/org/apache/activemq/apache-activemq/5.7-SNAPSHOT/apache-activemq-5.7-SNAPSHOT-bin.tar.gz>
[INFO] Installing <https://builds.apache.org/job/ActiveMQ-Trunk-Deploy/ws/deploy/assembly/target/apache-activemq-5.7-SNAPSHOT-bin.zip>
to <https://builds.apache.org/job/ActiveMQ-Trunk-Deploy/ws/.repository/org/apache/activemq/apache-activemq/5.7-SNAPSHOT/apache-activemq-5.7-SNAPSHOT-bin.zip>
[INFO] [deploy:deploy {execution: default-deploy}]
[INFO] Retrieving previous build number from apache.snapshots.https
[WARNING] *** CHECKSUM FAILED - Checksum failed on download: local = 'd58faa98612e4d7f0dfa17892b53f113d1c1fc03';
remote = '0d7837ef8c7912b905f9f5670ca26643e5ca1cc2' - RETRYING
[WARNING] *** CHECKSUM FAILED - Checksum failed on download: local = 'd58faa98612e4d7f0dfa17892b53f113d1c1fc03';
remote = '0d7837ef8c7912b905f9f5670ca26643e5ca1cc2' - IGNORING
Uploading: https://repository.apache.org/content/repositories/snapshots/org/apache/activemq/apache-activemq/5.7-SNAPSHOT/apache-activemq-5.7-SNAPSHOT.pom
13K uploaded  (apache-activemq-5.7-SNAPSHOT.pom)
[INFO] Retrieving previous metadata from apache.snapshots.https
[WARNING] *** CHECKSUM FAILED - Checksum failed on download: local = 'd58faa98612e4d7f0dfa17892b53f113d1c1fc03';
remote = '0d7837ef8c7912b905f9f5670ca26643e5ca1cc2' - RETRYING
[WARNING] *** CHECKSUM FAILED - Checksum failed on download: local = 'd58faa98612e4d7f0dfa17892b53f113d1c1fc03';
remote = '0d7837ef8c7912b905f9f5670ca26643e5ca1cc2' - IGNORING
[INFO] Uploading repository metadata for: 'snapshot org.apache.activemq:apache-activemq:5.7-SNAPSHOT'
[INFO] Retrieving previous metadata from apache.snapshots.https
[INFO] Uploading repository metadata for: 'artifact org.apache.activemq:apache-activemq'
[INFO] Retrieving previous build number from apache.snapshots.https
Uploading: https://repository.apache.org/content/repositories/snapshots/org/apache/activemq/apache-activemq/5.7-SNAPSHOT/apache-activemq-5.7-SNAPSHOT-bin.tar.gz
47921K uploaded  (apache-activemq-5.7-SNAPSHOT-bin.tar.gz)
[INFO] Retrieving previous build number from apache.snapshots.https
Uploading: https://repository.apache.org/content/repositories/snapshots/org/apache/activemq/apache-activemq/5.7-SNAPSHOT/apache-activemq-5.7-SNAPSHOT-bin.zip
[JENKINS] Archiving <https://builds.apache.org/job/ActiveMQ-Trunk-Deploy/ws/deploy/assembly/target/apache-activemq-5.7-SNAPSHOT-bin.tar.gz>
to /home/hudson/hudson/jobs/ActiveMQ-Trunk-Deploy/modules/org.apache.activemq$apache-activemq/builds/2012-06-01_05-57-55/archive/org.apache.activemq/apache-activemq/5.7-SNAPSHOT/apache-activemq-5.7-SNAPSHOT-bin.tar.gz
[JENKINS] Archiving <https://builds.apache.org/job/ActiveMQ-Trunk-Deploy/ws/deploy/assembly/target/apache-activemq-5.7-SNAPSHOT-bin.zip>
to /home/hudson/hudson/jobs/ActiveMQ-Trunk-Deploy/modules/org.apache.activemq$apache-activemq/builds/2012-06-01_05-57-55/archive/org.apache.activemq/apache-activemq/5.7-SNAPSHOT/apache-activemq-5.7-SNAPSHOT-bin.zip
[INFO] 
[INFO] 
[INFO] ------------------------------------------------------------------------
[INFO] Reactor Summary:
[INFO] ------------------------------------------------------------------------
[INFO] ActiveMQ .............................................. SUCCESS [25.634s]
[INFO] ActiveMQ :: KahaDB .................................... SUCCESS [30.074s]
[INFO] ActiveMQ :: JAAS ...................................... SUCCESS [22.030s]
[INFO] Openwire Generator .................................... SUCCESS [20.628s]
[INFO] ActiveMQ :: jmdns 1.0 ................................. SUCCESS [15.880s]
[INFO] ActiveMQ :: Core ...................................... SUCCESS [2:12.357s]
[INFO] ActiveMQ :: RA ........................................ SUCCESS [24.760s]
[INFO] ActiveMQ :: Pool ...................................... SUCCESS [24.308s]
[INFO] ActiveMQ :: Spring .................................... SUCCESS [20.576s]
[INFO] ActiveMQ :: Camel ..................................... SUCCESS [27.322s]
[INFO] ActiveMQ :: Console ................................... SUCCESS [23.797s]
[INFO] ActiveMQ :: Optional .................................. SUCCESS [34.969s]
[INFO] ActiveMQ :: Jar Bundle ................................ SUCCESS [38.730s]
[INFO] ActiveMQ :: File Server ............................... SUCCESS [18.660s]
[INFO] ActiveMQ :: Blueprint ................................. SUCCESS [6.161s]
[INFO] ActiveMQ :: Apache Karaf .............................. SUCCESS [25.251s]
[INFO] ActiveMQ :: RAR ....................................... SUCCESS [8:10.109s]
[INFO] ActiveMQ :: Run Jar ................................... SUCCESS [15.694s]
[INFO] ActiveMQ Tooling ...................................... SUCCESS [11.332s]
[INFO] ActiveMQ :: Memory Usage Test Plugin .................. SUCCESS [31.979s]
[INFO] ActiveMQ :: Performance Test Plugin ................... SUCCESS [30.795s]
[INFO] ActiveMQ :: StartUp Plugin ............................ SUCCESS [29.844s]
[INFO] ActiveMQ :: Web ....................................... SUCCESS [35.012s]
[INFO] ActiveMQ :: Web Demo .................................. SUCCESS [17:25.391s]
[INFO] ActiveMQ :: XMPP ...................................... SUCCESS [46.883s]
[INFO] ActiveMQ :: Web Console ............................... SUCCESS [14:50.948s]
[INFO] ActiveMQ :: Assembly .................................. FAILED [5:36.219s]
[INFO] ------------------------------------------------------------------------
[INFO] Error for project: ActiveMQ :: Assembly (during deploy)
[INFO] ------------------------------------------------------------------------
[INFO] Error deploying artifact: Failed to transfer file: https://repository.apache.org/content/repositories/snapshots/org/apache/activemq/apache-activemq/5.7-SNAPSHOT/apache-activemq-5.7-SNAPSHOT-bin.zip.
Return code is: 502

[INFO] ------------------------------------------------------------------------
[INFO] Trace
org.apache.maven.lifecycle.LifecycleExecutionException: Error deploying artifact: Failed to
transfer file: https://repository.apache.org/content/repositories/snapshots/org/apache/activemq/apache-activemq/5.7-SNAPSHOT/apache-activemq-5.7-SNAPSHOT-bin.zip.
Return code is: 502
	at org.apache.maven.lifecycle.DefaultLifecycleExecutor.executeGoals(DefaultLifecycleExecutor.java:719)
	at org.apache.maven.lifecycle.DefaultLifecycleExecutor.executeGoalWithLifecycle(DefaultLifecycleExecutor.java:556)
	at org.apache.maven.lifecycle.DefaultLifecycleExecutor.executeGoal(DefaultLifecycleExecutor.java:535)
	at org.apache.maven.lifecycle.DefaultLifecycleExecutor.executeGoalAndHandleFailures(DefaultLifecycleExecutor.java:387)
	at org.apache.maven.lifecycle.DefaultLifecycleExecutor.executeTaskSegments(DefaultLifecycleExecutor.java:348)
	at org.apache.maven.lifecycle.DefaultLifecycleExecutor.execute(DefaultLifecycleExecutor.java:180)
	at org.apache.maven.lifecycle.LifecycleExecutorInterceptor.execute(LifecycleExecutorInterceptor.java:65)
	at org.apache.maven.DefaultMaven.doExecute(DefaultMaven.java:328)
	at org.apache.maven.DefaultMaven.execute(DefaultMaven.java:138)
	at org.apache.maven.cli.MavenCli.main(MavenCli.java:362)
	at sun.reflect.NativeMethodAccessorImpl.invoke0(Native Method)
	at sun.reflect.NativeMethodAccessorImpl.invoke(NativeMethodAccessorImpl.java:39)
	at sun.reflect.DelegatingMethodAccessorImpl.invoke(DelegatingMethodAccessorImpl.java:25)
	at java.lang.reflect.Method.invoke(Method.java:597)
	at org.codehaus.classworlds.Launcher.launchEnhanced(Launcher.java:315)
	at org.codehaus.classworlds.Launcher.launch(Launcher.java:255)
	at hudson.maven.agent.Main.launch(Main.java:185)
	at hudson.maven.MavenBuilder.call(MavenBuilder.java:151)
	at hudson.maven.Maven2Builder.call(Maven2Builder.java:77)
	at hudson.maven.Maven2Builder.call(Maven2Builder.java:53)
	at hudson.remoting.UserRequest.perform(UserRequest.java:118)
	at hudson.remoting.UserRequest.perform(UserRequest.java:48)
	at hudson.remoting.Request$2.run(Request.java:287)
	at hudson.remoting.InterceptingExecutorService$1.call(InterceptingExecutorService.java:72)
	at java.util.concurrent.FutureTask$Sync.innerRun(FutureTask.java:303)
	at java.util.concurrent.FutureTask.run(FutureTask.java:138)
	at java.util.concurrent.ThreadPoolExecutor$Worker.runTask(ThreadPoolExecutor.java:886)
	at java.util.concurrent.ThreadPoolExecutor$Worker.run(ThreadPoolExecutor.java:908)
	at java.lang.Thread.run(Thread.java:662)
Caused by: org.apache.maven.plugin.MojoExecutionException: Error deploying artifact: Failed
to transfer file: https://repository.apache.org/content/repositories/snapshots/org/apache/activemq/apache-activemq/5.7-SNAPSHOT/apache-activemq-5.7-SNAPSHOT-bin.zip.
Return code is: 502
	at org.apache.maven.plugin.deploy.DeployMojo.execute(DeployMojo.java:189)
	at org.apache.maven.plugin.DefaultPluginManager.executeMojo(DefaultPluginManager.java:490)
	at hudson.maven.agent.PluginManagerInterceptor.executeMojo(PluginManagerInterceptor.java:182)
	at org.apache.maven.lifecycle.DefaultLifecycleExecutor.executeGoals(DefaultLifecycleExecutor.java:694)
	... 28 more
Caused by: org.apache.maven.artifact.deployer.ArtifactDeploymentException: Error deploying
artifact: Failed to transfer file: https://repository.apache.org/content/repositories/snapshots/org/apache/activemq/apache-activemq/5.7-SNAPSHOT/apache-activemq-5.7-SNAPSHOT-bin.zip.
Return code is: 502
	at org.apache.maven.artifact.deployer.DefaultArtifactDeployer.deploy(DefaultArtifactDeployer.java:121)
	at org.apache.maven.plugin.deploy.DeployMojo.execute(DeployMojo.java:184)
	... 31 more
Caused by: org.apache.maven.wagon.TransferFailedException: Failed to transfer file: https://repository.apache.org/content/repositories/snapshots/org/apache/activemq/apache-activemq/5.7-SNAPSHOT/apache-activemq-5.7-SNAPSHOT-bin.zip.
Return code is: 502
	at org.apache.maven.wagon.providers.http.LightweightHttpWagon.finishPutTransfer(LightweightHttpWagon.java:205)
	at org.apache.maven.wagon.AbstractWagon.putTransfer(AbstractWagon.java:413)
	at org.apache.maven.wagon.AbstractWagon.transfer(AbstractWagon.java:392)
	at org.apache.maven.wagon.AbstractWagon.putTransfer(AbstractWagon.java:365)
	at org.apache.maven.wagon.StreamWagon.put(StreamWagon.java:163)
	at org.apache.maven.artifact.manager.DefaultWagonManager.putRemoteFile(DefaultWagonManager.java:317)
	at org.apache.maven.artifact.manager.DefaultWagonManager.putArtifact(DefaultWagonManager.java:227)
	at org.apache.maven.artifact.deployer.DefaultArtifactDeployer.deploy(DefaultArtifactDeployer.java:107)
	... 32 more
[INFO] ------------------------------------------------------------------------
[INFO] BUILD ERRORS
[INFO] ------------------------------------------------------------------------
[INFO] Total time: 76 minutes 21 seconds
[INFO] Finished at: Fri Jun 01 07:14:39 UTC 2012
[INFO] Final Memory: 217M/1730M
[INFO] ------------------------------------------------------------------------
Waiting for Jenkins to finish collecting data
channel stopped

Mime
View raw message