activemq-dev mailing list archives

Site index · List index
Message view « Date » · « Thread »
Top « Date » · « Thread »
From Apache Jenkins Server <jenk...@builds.apache.org>
Subject Build failed in Jenkins: ActiveMQ #977
Date Sat, 09 Jun 2012 00:41:56 GMT
See <https://builds.apache.org/job/ActiveMQ/977/changes>

Changes:

[tabish] fix for: https://issues.apache.org/jira/browse/AMQ-3877

[rajdavies] patch applied for https://issues.apache.org/jira/browse/AMQ-3867

------------------------------------------
[...truncated 9177 lines...]
(type "javacc" with no arguments for help)
Reading from file <https://builds.apache.org/job/ActiveMQ/ws/activemq-core/src/main/grammar/SelectorParser.jj>
. . .
Warning: Line 26, Column 3: Bad option name "OPTIMIZE_TOKEN_MANAGER".  Option setting will
be ignored.
Note: UNICODE_INPUT option is specified. Please make sure you create the parser/lexer using
a Reader with the correct character encoding.
File "TokenMgrError.java" does not exist.  Will create one.
File "ParseException.java" does not exist.  Will create one.
File "Token.java" does not exist.  Will create one.
File "SimpleCharStream.java" does not exist.  Will create one.
Parser generated with 0 errors and 1 warnings.
[INFO] Processed 1 grammar
Downloading: http://repository.apache.org/snapshots/org/apache/maven/maven-profile/2.0/maven-profile-2.0.pom
[INFO] Unable to find resource 'org.apache.maven:maven-profile:pom:2.0' in repository apache.snapshots
(https://repository.apache.org/content/repositories/snapshots/)
Downloading: http://repository.springsource.com/maven/bundles/external/org/apache/maven/maven-profile/2.0/maven-profile-2.0.pom
[INFO] Unable to find resource 'org.apache.maven:maven-profile:pom:2.0' in repository com.springsource.repository.bundles.external
(http://repository.springsource.com/maven/bundles/external)
Downloading: http://repo1.maven.org/maven2/org/apache/maven/maven-profile/2.0/maven-profile-2.0.pom

Downloading: http://repository.apache.org/snapshots/org/apache/maven/maven-model/2.0/maven-model-2.0.pom
[INFO] Unable to find resource 'org.apache.maven:maven-model:pom:2.0' in repository apache.snapshots
(https://repository.apache.org/content/repositories/snapshots/)
Downloading: http://repository.springsource.com/maven/bundles/external/org/apache/maven/maven-model/2.0/maven-model-2.0.pom
[INFO] Unable to find resource 'org.apache.maven:maven-model:pom:2.0' in repository com.springsource.repository.bundles.external
(http://repository.springsource.com/maven/bundles/external)
Downloading: http://repo1.maven.org/maven2/org/apache/maven/maven-model/2.0/maven-model-2.0.pom

Downloading: http://repository.apache.org/snapshots/junit/junit/4.4/junit-4.4.pom
[INFO] Unable to find resource 'junit:junit:pom:4.4' in repository apache.snapshots (https://repository.apache.org/content/repositories/snapshots/)
Downloading: http://repository.springsource.com/maven/bundles/external/junit/junit/4.4/junit-4.4.pom
[INFO] Unable to find resource 'junit:junit:pom:4.4' in repository com.springsource.repository.bundles.external
(http://repository.springsource.com/maven/bundles/external)
Downloading: http://repo1.maven.org/maven2/junit/junit/4.4/junit-4.4.pom

Downloading: http://repository.apache.org/snapshots/org/apache/maven/maven-repository-metadata/2.0/maven-repository-metadata-2.0.pom
[INFO] Unable to find resource 'org.apache.maven:maven-repository-metadata:pom:2.0' in repository
apache.snapshots (https://repository.apache.org/content/repositories/snapshots/)
Downloading: http://repository.springsource.com/maven/bundles/external/org/apache/maven/maven-repository-metadata/2.0/maven-repository-metadata-2.0.pom
[INFO] Unable to find resource 'org.apache.maven:maven-repository-metadata:pom:2.0' in repository
com.springsource.repository.bundles.external (http://repository.springsource.com/maven/bundles/external)
Downloading: http://repo1.maven.org/maven2/org/apache/maven/maven-repository-metadata/2.0/maven-repository-metadata-2.0.pom

Downloading: http://repository.apache.org/snapshots/org/apache/maven/wagon/wagon-provider-api/1.0-alpha-5/wagon-provider-api-1.0-alpha-5.pom
[INFO] Unable to find resource 'org.apache.maven.wagon:wagon-provider-api:pom:1.0-alpha-5'
in repository apache.snapshots (https://repository.apache.org/content/repositories/snapshots/)
Downloading: http://repository.springsource.com/maven/bundles/external/org/apache/maven/wagon/wagon-provider-api/1.0-alpha-5/wagon-provider-api-1.0-alpha-5.pom
[INFO] Unable to find resource 'org.apache.maven.wagon:wagon-provider-api:pom:1.0-alpha-5'
in repository com.springsource.repository.bundles.external (http://repository.springsource.com/maven/bundles/external)
Downloading: http://repo1.maven.org/maven2/org/apache/maven/wagon/wagon-provider-api/1.0-alpha-5/wagon-provider-api-1.0-alpha-5.pom

[INFO] [activemq-protobuf:compile {execution: default}]
[INFO] Compiling: <https://builds.apache.org/job/ActiveMQ/ws/activemq-core/src/main/proto/journal-data.proto>
[INFO] [remote-resources:process {execution: default}]
[INFO] [resources:resources {execution: default-resources}]
[INFO] Using 'UTF-8' encoding to copy filtered resources.
[INFO] Copying 62 resources
[INFO] Copying 1 resource
[INFO] Copying 3 resources
[INFO] [compiler:compile {execution: default-compile}]
[INFO] Compiling 1530 source files to <https://builds.apache.org/job/ActiveMQ/ws/activemq-core/target/classes>
Downloading: http://repository.apache.org/snapshots/org/springframework/spring-beans/2.0.5/spring-beans-2.0.5.pom
[INFO] Unable to find resource 'org.springframework:spring-beans:pom:2.0.5' in repository
apache.snapshots (https://repository.apache.org/content/repositories/snapshots/)
Downloading: http://repo1.maven.org/maven2/org/springframework/spring-beans/2.0.5/spring-beans-2.0.5.pom

Downloading: http://repository.apache.org/snapshots/org/springframework/spring-core/2.0.5/spring-core-2.0.5.pom
[INFO] Unable to find resource 'org.springframework:spring-core:pom:2.0.5' in repository apache.snapshots
(https://repository.apache.org/content/repositories/snapshots/)
Downloading: http://repository.springsource.com/maven/bundles/external/org/springframework/spring-core/2.0.5/spring-core-2.0.5.pom
[INFO] Unable to find resource 'org.springframework:spring-core:pom:2.0.5' in repository com.springsource.repository.bundles.external
(http://repository.springsource.com/maven/bundles/external)
Downloading: http://repo1.maven.org/maven2/org/springframework/spring-core/2.0.5/spring-core-2.0.5.pom

Downloading: http://repository.apache.org/snapshots/org/springframework/spring-context/2.0.5/spring-context-2.0.5.pom
[INFO] Unable to find resource 'org.springframework:spring-context:pom:2.0.5' in repository
apache.snapshots (https://repository.apache.org/content/repositories/snapshots/)
Downloading: http://repo1.maven.org/maven2/org/springframework/spring-context/2.0.5/spring-context-2.0.5.pom

Downloading: http://repository.apache.org/snapshots/org/springframework/spring-beans/2.5.6/spring-beans-2.5.6.pom
[INFO] Unable to find resource 'org.springframework:spring-beans:pom:2.5.6' in repository
apache.snapshots (https://repository.apache.org/content/repositories/snapshots/)
Downloading: http://repository.springsource.com/maven/bundles/external/org/springframework/spring-beans/2.5.6/spring-beans-2.5.6.pom
[INFO] Unable to find resource 'org.springframework:spring-beans:pom:2.5.6' in repository
com.springsource.repository.bundles.external (http://repository.springsource.com/maven/bundles/external)
Downloading: http://repo1.maven.org/maven2/org/springframework/spring-beans/2.5.6/spring-beans-2.5.6.pom

Downloading: http://repository.apache.org/snapshots/org/codehaus/plexus/plexus-archiver/1.0-alpha-5/plexus-archiver-1.0-alpha-5.pom
[INFO] Unable to find resource 'org.codehaus.plexus:plexus-archiver:pom:1.0-alpha-5' in repository
apache.snapshots (https://repository.apache.org/content/repositories/snapshots/)
Downloading: http://repo1.maven.org/maven2/org/codehaus/plexus/plexus-archiver/1.0-alpha-5/plexus-archiver-1.0-alpha-5.pom

Downloading: http://repository.apache.org/snapshots/org/apache/maven/maven-archiver/2.0/maven-archiver-2.0.pom
[INFO] Unable to find resource 'org.apache.maven:maven-archiver:pom:2.0' in repository apache.snapshots
(https://repository.apache.org/content/repositories/snapshots/)
Downloading: http://repo1.maven.org/maven2/org/apache/maven/maven-archiver/2.0/maven-archiver-2.0.pom

Downloading: http://repository.apache.org/snapshots/org/codehaus/plexus/plexus-archiver/1.0-alpha-3/plexus-archiver-1.0-alpha-3.pom
[INFO] Unable to find resource 'org.codehaus.plexus:plexus-archiver:pom:1.0-alpha-3' in repository
apache.snapshots (https://repository.apache.org/content/repositories/snapshots/)
Downloading: http://repository.springsource.com/maven/bundles/external/org/codehaus/plexus/plexus-archiver/1.0-alpha-3/plexus-archiver-1.0-alpha-3.pom
[INFO] Unable to find resource 'org.codehaus.plexus:plexus-archiver:pom:1.0-alpha-3' in repository
com.springsource.repository.bundles.external (http://repository.springsource.com/maven/bundles/external)
Downloading: http://repo1.maven.org/maven2/org/codehaus/plexus/plexus-archiver/1.0-alpha-3/plexus-archiver-1.0-alpha-3.pom

Downloading: http://repository.apache.org/snapshots/jmock/jmock/1.0.0/jmock-1.0.0.pom
[INFO] Unable to find resource 'jmock:jmock:pom:1.0.0' in repository apache.snapshots (https://repository.apache.org/content/repositories/snapshots/)
Downloading: http://repository.springsource.com/maven/bundles/external/jmock/jmock/1.0.0/jmock-1.0.0.pom
[INFO] Unable to find resource 'jmock:jmock:pom:1.0.0' in repository com.springsource.repository.bundles.external
(http://repository.springsource.com/maven/bundles/external)
Downloading: http://repo1.maven.org/maven2/jmock/jmock/1.0.0/jmock-1.0.0.pom

Downloading: http://repository.apache.org/snapshots/org/springframework/spring-beans/2.0.5/spring-beans-2.0.5.jar
Downloading: http://repository.apache.org/snapshots/jmock/jmock/1.0.0/jmock-1.0.0.jar
Downloading: http://repository.apache.org/snapshots/commons-logging/commons-logging/1.0.3/commons-logging-1.0.3.jar
Downloading: http://repository.apache.org/snapshots/org/apache/maven/maven-archiver/2.0/maven-archiver-2.0.jar
Downloading: http://repository.apache.org/snapshots/junit/junit/3.8.1/junit-3.8.1.jar
[INFO] Unable to find resource 'jmock:jmock:jar:1.0.0' in repository apache.snapshots (https://repository.apache.org/content/repositories/snapshots/)
Downloading: http://repository.springsource.com/maven/bundles/external/jmock/jmock/1.0.0/jmock-1.0.0.jar
[INFO] Unable to find resource 'junit:junit:jar:3.8.1' in repository apache.snapshots (https://repository.apache.org/content/repositories/snapshots/)
[INFO] Unable to find resource 'org.springframework:spring-beans:jar:2.0.5' in repository
apache.snapshots (https://repository.apache.org/content/repositories/snapshots/)
Downloading: http://repository.springsource.com/maven/bundles/external/junit/junit/3.8.1/junit-3.8.1.jar
Downloading: http://repo1.maven.org/maven2/org/springframework/spring-beans/2.0.5/spring-beans-2.0.5.jar
[INFO] Unable to find resource 'org.apache.maven:maven-archiver:jar:2.0' in repository apache.snapshots
(https://repository.apache.org/content/repositories/snapshots/)
Downloading: http://repo1.maven.org/maven2/org/apache/maven/maven-archiver/2.0/maven-archiver-2.0.jar
[INFO] Unable to find resource 'commons-logging:commons-logging:jar:1.0.3' in repository apache.snapshots
(https://repository.apache.org/content/repositories/snapshots/)
Downloading: http://repository.springsource.com/maven/bundles/external/commons-logging/commons-logging/1.0.3/commons-logging-1.0.3.jar
[INFO] Unable to find resource 'junit:junit:jar:3.8.1' in repository com.springsource.repository.bundles.external
(http://repository.springsource.com/maven/bundles/external)
Downloading: http://repo1.maven.org/maven2/junit/junit/3.8.1/junit-3.8.1.jar
[INFO] Unable to find resource 'jmock:jmock:jar:1.0.0' in repository com.springsource.repository.bundles.external
(http://repository.springsource.com/maven/bundles/external)
Downloading: http://repo1.maven.org/maven2/jmock/jmock/1.0.0/jmock-1.0.0.jar
[INFO] Unable to find resource 'commons-logging:commons-logging:jar:1.0.3' in repository com.springsource.repository.bundles.external
(http://repository.springsource.com/maven/bundles/external)
Downloading: http://repo1.maven.org/maven2/commons-logging/commons-logging/1.0.3/commons-logging-1.0.3.jar





Downloading: http://repository.apache.org/snapshots/ant/ant/1.6.5/ant-1.6.5.jar
[INFO] Unable to find resource 'ant:ant:jar:1.6.5' in repository apache.snapshots (https://repository.apache.org/content/repositories/snapshots/)
Downloading: http://repo1.maven.org/maven2/ant/ant/1.6.5/ant-1.6.5.jar
Downloading: http://repository.apache.org/snapshots/org/codehaus/plexus/plexus-archiver/1.0-alpha-5/plexus-archiver-1.0-alpha-5.jar
[INFO] Unable to find resource 'org.codehaus.plexus:plexus-archiver:jar:1.0-alpha-5' in repository
apache.snapshots (https://repository.apache.org/content/repositories/snapshots/)
Downloading: http://repo1.maven.org/maven2/org/codehaus/plexus/plexus-archiver/1.0-alpha-5/plexus-archiver-1.0-alpha-5.jar
Downloading: http://repository.apache.org/snapshots/org/springframework/spring-core/2.0.5/spring-core-2.0.5.jar
[INFO] Unable to find resource 'org.springframework:spring-core:jar:2.0.5' in repository apache.snapshots
(https://repository.apache.org/content/repositories/snapshots/)
Downloading: http://repository.springsource.com/maven/bundles/external/org/springframework/spring-core/2.0.5/spring-core-2.0.5.jar
[INFO] Unable to find resource 'org.springframework:spring-core:jar:2.0.5' in repository com.springsource.repository.bundles.external
(http://repository.springsource.com/maven/bundles/external)
Downloading: http://repo1.maven.org/maven2/org/springframework/spring-core/2.0.5/spring-core-2.0.5.jar



Downloading: http://repository.apache.org/snapshots/org/springframework/spring-context/2.0.5/spring-context-2.0.5.jar
[INFO] Unable to find resource 'org.springframework:spring-context:jar:2.0.5' in repository
apache.snapshots (https://repository.apache.org/content/repositories/snapshots/)
Downloading: http://repo1.maven.org/maven2/org/springframework/spring-context/2.0.5/spring-context-2.0.5.jar

[INFO] [xbean:mapping {execution: default}]
[JENKINS] Archiving <https://builds.apache.org/job/ActiveMQ/ws/activemq-core/pom.xml>
to /home/hudson/hudson/jobs/ActiveMQ/modules/org.apache.activemq$activemq-core/builds/2012-06-09_00-25-42/archive/org.apache.activemq/activemq-core/5.7-SNAPSHOT/activemq-core-5.7-SNAPSHOT.pom
[INFO] ------------------------------------------------------------------------
[ERROR] FATAL ERROR
[INFO] ------------------------------------------------------------------------
[INFO] com.thoughtworks.qdox.parser.ParseException: syntax error @[23,35] in <https://builds.apache.org/job/ActiveMQ/ws/activemq-core/src/main/java/org/apache/activemq/broker/jmx/AsyncAnnotatedMBean.java>
[INFO] ------------------------------------------------------------------------
[INFO] Trace
com.thoughtworks.qdox.parser.ParseException: syntax error @[23,35] in <https://builds.apache.org/job/ActiveMQ/ws/activemq-core/src/main/java/org/apache/activemq/broker/jmx/AsyncAnnotatedMBean.java>
	at org.apache.xbean.maven.XBeanMojo.execute(XBeanMojo.java:219)
	at org.apache.maven.plugin.DefaultPluginManager.executeMojo(DefaultPluginManager.java:490)
	at hudson.maven.agent.PluginManagerInterceptor.executeMojo(PluginManagerInterceptor.java:182)
	at org.apache.maven.lifecycle.DefaultLifecycleExecutor.executeGoals(DefaultLifecycleExecutor.java:694)
	at org.apache.maven.lifecycle.DefaultLifecycleExecutor.executeGoalWithLifecycle(DefaultLifecycleExecutor.java:556)
	at org.apache.maven.lifecycle.DefaultLifecycleExecutor.executeGoal(DefaultLifecycleExecutor.java:535)
	at org.apache.maven.lifecycle.DefaultLifecycleExecutor.executeGoalAndHandleFailures(DefaultLifecycleExecutor.java:387)
	at org.apache.maven.lifecycle.DefaultLifecycleExecutor.executeTaskSegments(DefaultLifecycleExecutor.java:348)
	at org.apache.maven.lifecycle.DefaultLifecycleExecutor.execute(DefaultLifecycleExecutor.java:180)
	at org.apache.maven.lifecycle.LifecycleExecutorInterceptor.execute(LifecycleExecutorInterceptor.java:65)
	at org.apache.maven.DefaultMaven.doExecute(DefaultMaven.java:328)
	at org.apache.maven.DefaultMaven.execute(DefaultMaven.java:138)
	at org.apache.maven.cli.MavenCli.main(MavenCli.java:362)
	at sun.reflect.NativeMethodAccessorImpl.invoke0(Native Method)
	at sun.reflect.NativeMethodAccessorImpl.invoke(NativeMethodAccessorImpl.java:39)
	at sun.reflect.DelegatingMethodAccessorImpl.invoke(DelegatingMethodAccessorImpl.java:25)
	at java.lang.reflect.Method.invoke(Method.java:597)
	at org.codehaus.classworlds.Launcher.launchEnhanced(Launcher.java:315)
	at org.codehaus.classworlds.Launcher.launch(Launcher.java:255)
	at hudson.maven.agent.Main.launch(Main.java:185)
	at hudson.maven.MavenBuilder.call(MavenBuilder.java:151)
	at hudson.maven.Maven2Builder.call(Maven2Builder.java:77)
	at hudson.maven.Maven2Builder.call(Maven2Builder.java:53)
	at hudson.remoting.UserRequest.perform(UserRequest.java:118)
	at hudson.remoting.UserRequest.perform(UserRequest.java:48)
	at hudson.remoting.Request$2.run(Request.java:287)
	at hudson.remoting.InterceptingExecutorService$1.call(InterceptingExecutorService.java:72)
	at java.util.concurrent.FutureTask$Sync.innerRun(FutureTask.java:303)
	at java.util.concurrent.FutureTask.run(FutureTask.java:138)
	at java.util.concurrent.ThreadPoolExecutor$Worker.runTask(ThreadPoolExecutor.java:886)
	at java.util.concurrent.ThreadPoolExecutor$Worker.run(ThreadPoolExecutor.java:908)
	at java.lang.Thread.run(Thread.java:662)
Caused by: com.thoughtworks.qdox.parser.ParseException: syntax error @[23,35] in <https://builds.apache.org/job/ActiveMQ/ws/activemq-core/src/main/java/org/apache/activemq/broker/jmx/AsyncAnnotatedMBean.java>
	at com.thoughtworks.qdox.parser.impl.Parser.yyerror(Parser.java:716)
	at com.thoughtworks.qdox.parser.impl.Parser.yyparse(Parser.java:826)
	at com.thoughtworks.qdox.parser.impl.Parser.parse(Parser.java:697)
	at com.thoughtworks.qdox.JavaDocBuilder.addSource(JavaDocBuilder.java:300)
	at com.thoughtworks.qdox.JavaDocBuilder.addSource(JavaDocBuilder.java:316)
	at com.thoughtworks.qdox.JavaDocBuilder.addSource(JavaDocBuilder.java:312)
	at org.apache.xbean.spring.generator.QdoxMappingLoader.listAllFileNames(QdoxMappingLoader.java:533)
	at org.apache.xbean.spring.generator.QdoxMappingLoader.listAllFileNames(QdoxMappingLoader.java:531)
	at org.apache.xbean.spring.generator.QdoxMappingLoader.listAllFileNames(QdoxMappingLoader.java:531)
	at org.apache.xbean.spring.generator.QdoxMappingLoader.listAllFileNames(QdoxMappingLoader.java:531)
	at org.apache.xbean.spring.generator.QdoxMappingLoader.listAllFileNames(QdoxMappingLoader.java:531)
	at org.apache.xbean.spring.generator.QdoxMappingLoader.listAllFileNames(QdoxMappingLoader.java:531)
	at org.apache.xbean.spring.generator.QdoxMappingLoader.getSourceFiles(QdoxMappingLoader.java:516)
	at org.apache.xbean.spring.generator.QdoxMappingLoader.loadNamespaces(QdoxMappingLoader.java:92)
	at org.apache.xbean.maven.XBeanMojo.execute(XBeanMojo.java:190)
	... 31 more
--- Nested Exception ---
com.thoughtworks.qdox.parser.ParseException: syntax error @[23,35] in <https://builds.apache.org/job/ActiveMQ/ws/activemq-core/src/main/java/org/apache/activemq/broker/jmx/AsyncAnnotatedMBean.java>
	at com.thoughtworks.qdox.parser.impl.Parser.yyerror(Parser.java:716)
	at com.thoughtworks.qdox.parser.impl.Parser.yyparse(Parser.java:826)
	at com.thoughtworks.qdox.parser.impl.Parser.parse(Parser.java:697)
	at com.thoughtworks.qdox.JavaDocBuilder.addSource(JavaDocBuilder.java:300)
	at com.thoughtworks.qdox.JavaDocBuilder.addSource(JavaDocBuilder.java:316)
	at com.thoughtworks.qdox.JavaDocBuilder.addSource(JavaDocBuilder.java:312)
	at org.apache.xbean.spring.generator.QdoxMappingLoader.listAllFileNames(QdoxMappingLoader.java:533)
	at org.apache.xbean.spring.generator.QdoxMappingLoader.listAllFileNames(QdoxMappingLoader.java:531)
	at org.apache.xbean.spring.generator.QdoxMappingLoader.listAllFileNames(QdoxMappingLoader.java:531)
	at org.apache.xbean.spring.generator.QdoxMappingLoader.listAllFileNames(QdoxMappingLoader.java:531)
	at org.apache.xbean.spring.generator.QdoxMappingLoader.listAllFileNames(QdoxMappingLoader.java:531)
	at org.apache.xbean.spring.generator.QdoxMappingLoader.listAllFileNames(QdoxMappingLoader.java:531)
	at org.apache.xbean.spring.generator.QdoxMappingLoader.getSourceFiles(QdoxMappingLoader.java:516)
	at org.apache.xbean.spring.generator.QdoxMappingLoader.loadNamespaces(QdoxMappingLoader.java:92)
	at org.apache.xbean.maven.XBeanMojo.execute(XBeanMojo.java:190)
	at org.apache.maven.plugin.DefaultPluginManager.executeMojo(DefaultPluginManager.java:490)
	at hudson.maven.agent.PluginManagerInterceptor.executeMojo(PluginManagerInterceptor.java:182)
	at org.apache.maven.lifecycle.DefaultLifecycleExecutor.executeGoals(DefaultLifecycleExecutor.java:694)
	at org.apache.maven.lifecycle.DefaultLifecycleExecutor.executeGoalWithLifecycle(DefaultLifecycleExecutor.java:556)
	at org.apache.maven.lifecycle.DefaultLifecycleExecutor.executeGoal(DefaultLifecycleExecutor.java:535)
	at org.apache.maven.lifecycle.DefaultLifecycleExecutor.executeGoalAndHandleFailures(DefaultLifecycleExecutor.java:387)
	at org.apache.maven.lifecycle.DefaultLifecycleExecutor.executeTaskSegments(DefaultLifecycleExecutor.java:348)
	at org.apache.maven.lifecycle.DefaultLifecycleExecutor.execute(DefaultLifecycleExecutor.java:180)
	at org.apache.maven.lifecycle.LifecycleExecutorInterceptor.execute(LifecycleExecutorInterceptor.java:65)
	at org.apache.maven.DefaultMaven.doExecute(DefaultMaven.java:328)
	at org.apache.maven.DefaultMaven.execute(DefaultMaven.java:138)
	at org.apache.maven.cli.MavenCli.main(MavenCli.java:362)
	at sun.reflect.NativeMethodAccessorImpl.invoke0(Native Method)
	at sun.reflect.NativeMethodAccessorImpl.invoke(NativeMethodAccessorImpl.java:39)
	at sun.reflect.DelegatingMethodAccessorImpl.invoke(DelegatingMethodAccessorImpl.java:25)
	at java.lang.reflect.Method.invoke(Method.java:597)
	at org.codehaus.classworlds.Launcher.launchEnhanced(Launcher.java:315)
	at org.codehaus.classworlds.Launcher.launch(Launcher.java:255)
	at hudson.maven.agent.Main.launch(Main.java:185)
	at hudson.maven.MavenBuilder.call(MavenBuilder.java:151)
	at hudson.maven.Maven2Builder.call(Maven2Builder.java:77)
	at hudson.maven.Maven2Builder.call(Maven2Builder.java:53)
	at hudson.remoting.UserRequest.perform(UserRequest.java:118)
	at hudson.remoting.UserRequest.perform(UserRequest.java:48)
	at hudson.remoting.Request$2.run(Request.java:287)
	at hudson.remoting.InterceptingExecutorService$1.call(InterceptingExecutorService.java:72)
	at java.util.concurrent.FutureTask$Sync.innerRun(FutureTask.java:303)
	at java.util.concurrent.FutureTask.run(FutureTask.java:138)
	at java.util.concurrent.ThreadPoolExecutor$Worker.runTask(ThreadPoolExecutor.java:886)
	at java.util.concurrent.ThreadPoolExecutor$Worker.run(ThreadPoolExecutor.java:908)
	at java.lang.Thread.run(Thread.java:662)
[INFO] ------------------------------------------------------------------------
[INFO] Total time: 15 minutes 47 seconds
[INFO] Finished at: Sat Jun 09 00:41:53 UTC 2012
[INFO] Final Memory: 150M/1080M
[INFO] ------------------------------------------------------------------------
Waiting for Jenkins to finish collecting data
channel stopped
[locks-and-latches] Releasing all the locks
[locks-and-latches] All the locks released

Mime
View raw message