activemq-dev mailing list archives

Site index · List index
Message view « Date » · « Thread »
Top « Date » · « Thread »
From Apache Jenkins Server <jenk...@builds.apache.org>
Subject Build failed in Jenkins: ActiveMQ-5.3-Deploy #20
Date Fri, 08 Jun 2012 03:05:00 GMT
See <https://builds.apache.org/job/ActiveMQ-5.3-Deploy/20/>

------------------------------------------
[...truncated 16941 lines...]
Downloading: http://repo1.maven.org/maven2/org/apache/activemq/activemq-all/5.3.2/activemq-all-5.3.2.pom

Downloading: http://download.java.net/maven/2/org/apache/activemq/activemq-fileserver/5.3.2/activemq-fileserver-5.3.2.pom
[INFO] Unable to find resource 'org.apache.activemq:activemq-fileserver:pom:5.3.2' in repository
java.net.maven2 (http://download.java.net/maven/2)
Downloading: http://repository.springsource.com/maven/bundles/external/org/apache/activemq/activemq-fileserver/5.3.2/activemq-fileserver-5.3.2.pom
[INFO] Unable to find resource 'org.apache.activemq:activemq-fileserver:pom:5.3.2' in repository
com.springsource.repository.bundles.external (http://repository.springsource.com/maven/bundles/external)
Downloading: http://repo1.maven.org/maven2/org/apache/activemq/activemq-fileserver/5.3.2/activemq-fileserver-5.3.2.pom

Downloading: http://download.java.net/maven/2/org/apache/activemq/activemq-xmpp/5.3.2/activemq-xmpp-5.3.2.pom
[INFO] Unable to find resource 'org.apache.activemq:activemq-xmpp:pom:5.3.2' in repository
java.net.maven2 (http://download.java.net/maven/2)
Downloading: http://repository.springsource.com/maven/bundles/external/org/apache/activemq/activemq-xmpp/5.3.2/activemq-xmpp-5.3.2.pom
[INFO] Unable to find resource 'org.apache.activemq:activemq-xmpp:pom:5.3.2' in repository
com.springsource.repository.bundles.external (http://repository.springsource.com/maven/bundles/external)
Downloading: http://repo1.maven.org/maven2/org/apache/activemq/activemq-xmpp/5.3.2/activemq-xmpp-5.3.2.pom

Downloading: http://download.java.net/maven/2/org/apache/activemq/activemq-web-demo/5.3.2/activemq-web-demo-5.3.2.pom
[INFO] Unable to find resource 'org.apache.activemq:activemq-web-demo:pom:5.3.2' in repository
java.net.maven2 (http://download.java.net/maven/2)
Downloading: http://repository.springsource.com/maven/bundles/external/org/apache/activemq/activemq-web-demo/5.3.2/activemq-web-demo-5.3.2.pom
[INFO] Unable to find resource 'org.apache.activemq:activemq-web-demo:pom:5.3.2' in repository
com.springsource.repository.bundles.external (http://repository.springsource.com/maven/bundles/external)
Downloading: http://repo1.maven.org/maven2/org/apache/activemq/activemq-web-demo/5.3.2/activemq-web-demo-5.3.2.pom

Downloading: http://download.java.net/maven/2/org/apache/activemq/activemq-web-console/5.3.2/activemq-web-console-5.3.2.pom
[INFO] Unable to find resource 'org.apache.activemq:activemq-web-console:pom:5.3.2' in repository
java.net.maven2 (http://download.java.net/maven/2)
Downloading: http://repository.springsource.com/maven/bundles/external/org/apache/activemq/activemq-web-console/5.3.2/activemq-web-console-5.3.2.pom
[INFO] Unable to find resource 'org.apache.activemq:activemq-web-console:pom:5.3.2' in repository
com.springsource.repository.bundles.external (http://repository.springsource.com/maven/bundles/external)
Downloading: http://repo1.maven.org/maven2/org/apache/activemq/activemq-web-console/5.3.2/activemq-web-console-5.3.2.pom

Downloading: http://download.java.net/maven/2/org/apache/activemq/activemq-rar/5.3.2/activemq-rar-5.3.2.pom
[INFO] Unable to find resource 'org.apache.activemq:activemq-rar:pom:5.3.2' in repository
java.net.maven2 (http://download.java.net/maven/2)
Downloading: http://repository.springsource.com/maven/bundles/external/org/apache/activemq/activemq-rar/5.3.2/activemq-rar-5.3.2.pom
[INFO] Unable to find resource 'org.apache.activemq:activemq-rar:pom:5.3.2' in repository
com.springsource.repository.bundles.external (http://repository.springsource.com/maven/bundles/external)
Downloading: http://repo1.maven.org/maven2/org/apache/activemq/activemq-rar/5.3.2/activemq-rar-5.3.2.pom

Downloading: http://download.java.net/maven/2/org/apache/activemq/activemq-run/5.3.2/activemq-run-5.3.2.pom
[INFO] Unable to find resource 'org.apache.activemq:activemq-run:pom:5.3.2' in repository
java.net.maven2 (http://download.java.net/maven/2)
Downloading: http://repository.springsource.com/maven/bundles/external/org/apache/activemq/activemq-run/5.3.2/activemq-run-5.3.2.pom
[INFO] Unable to find resource 'org.apache.activemq:activemq-run:pom:5.3.2' in repository
com.springsource.repository.bundles.external (http://repository.springsource.com/maven/bundles/external)
Downloading: http://repo1.maven.org/maven2/org/apache/activemq/activemq-run/5.3.2/activemq-run-5.3.2.pom

Downloading: http://download.java.net/maven/2/org/apache/camel/camel-jetty/2.2.0/camel-jetty-2.2.0.pom
[INFO] Unable to find resource 'org.apache.camel:camel-jetty:pom:2.2.0' in repository java.net.maven2
(http://download.java.net/maven/2)
Downloading: http://repository.springsource.com/maven/bundles/external/org/apache/camel/camel-jetty/2.2.0/camel-jetty-2.2.0.pom
[INFO] Unable to find resource 'org.apache.camel:camel-jetty:pom:2.2.0' in repository com.springsource.repository.bundles.external
(http://repository.springsource.com/maven/bundles/external)
Downloading: http://repo1.maven.org/maven2/org/apache/camel/camel-jetty/2.2.0/camel-jetty-2.2.0.pom

Downloading: http://download.java.net/maven/2/org/apache/camel/camel-http/2.2.0/camel-http-2.2.0.pom
[INFO] Unable to find resource 'org.apache.camel:camel-http:pom:2.2.0' in repository java.net.maven2
(http://download.java.net/maven/2)
Downloading: http://repository.springsource.com/maven/bundles/external/org/apache/camel/camel-http/2.2.0/camel-http-2.2.0.pom
[INFO] Unable to find resource 'org.apache.camel:camel-http:pom:2.2.0' in repository com.springsource.repository.bundles.external
(http://repository.springsource.com/maven/bundles/external)
Downloading: http://repo1.maven.org/maven2/org/apache/camel/camel-http/2.2.0/camel-http-2.2.0.pom

Downloading: http://download.java.net/maven/2/org/apache/geronimo/specs/geronimo-servlet_2.4_spec/1.1.1/geronimo-servlet_2.4_spec-1.1.1.pom
[INFO] Unable to find resource 'org.apache.geronimo.specs:geronimo-servlet_2.4_spec:pom:1.1.1'
in repository java.net.maven2 (http://download.java.net/maven/2)
Downloading: http://repository.springsource.com/maven/bundles/external/org/apache/geronimo/specs/geronimo-servlet_2.4_spec/1.1.1/geronimo-servlet_2.4_spec-1.1.1.pom
[INFO] Unable to find resource 'org.apache.geronimo.specs:geronimo-servlet_2.4_spec:pom:1.1.1'
in repository com.springsource.repository.bundles.external (http://repository.springsource.com/maven/bundles/external)
Downloading: http://repo1.maven.org/maven2/org/apache/geronimo/specs/geronimo-servlet_2.4_spec/1.1.1/geronimo-servlet_2.4_spec-1.1.1.pom

Downloading: http://download.java.net/maven/2/org/mortbay/jetty/jetty-client/6.1.22/jetty-client-6.1.22.pom
[INFO] Unable to find resource 'org.mortbay.jetty:jetty-client:pom:6.1.22' in repository java.net.maven2
(http://download.java.net/maven/2)
Downloading: http://repository.springsource.com/maven/bundles/external/org/mortbay/jetty/jetty-client/6.1.22/jetty-client-6.1.22.pom
[INFO] Unable to find resource 'org.mortbay.jetty:jetty-client:pom:6.1.22' in repository com.springsource.repository.bundles.external
(http://repository.springsource.com/maven/bundles/external)
Downloading: http://repo1.maven.org/maven2/org/mortbay/jetty/jetty-client/6.1.22/jetty-client-6.1.22.pom

Downloading: http://download.java.net/maven/2/org/mortbay/jetty/project/6.1.22/project-6.1.22.pom
[INFO] Unable to find resource 'org.mortbay.jetty:project:pom:6.1.22' in repository java.net.maven2
(http://download.java.net/maven/2)
Downloading: http://repository.springsource.com/maven/bundles/external/org/mortbay/jetty/project/6.1.22/project-6.1.22.pom
[INFO] Unable to find resource 'org.mortbay.jetty:project:pom:6.1.22' in repository com.springsource.repository.bundles.external
(http://repository.springsource.com/maven/bundles/external)
Downloading: http://repo1.maven.org/maven2/org/mortbay/jetty/project/6.1.22/project-6.1.22.pom

Downloading: http://download.java.net/maven/2/org/mortbay/jetty/jetty-parent/8/jetty-parent-8.pom
[INFO] Unable to find resource 'org.mortbay.jetty:jetty-parent:pom:8' in repository java.net.maven2
(http://download.java.net/maven/2)
Downloading: http://repository.springsource.com/maven/bundles/external/org/mortbay/jetty/jetty-parent/8/jetty-parent-8.pom
[INFO] Unable to find resource 'org.mortbay.jetty:jetty-parent:pom:8' in repository com.springsource.repository.bundles.external
(http://repository.springsource.com/maven/bundles/external)
Downloading: http://repo1.maven.org/maven2/org/mortbay/jetty/jetty-parent/8/jetty-parent-8.pom

Downloading: http://download.java.net/maven/2/org/eclipse/jetty/jetty-parent/9/jetty-parent-9.pom
[INFO] Unable to find resource 'org.eclipse.jetty:jetty-parent:pom:9' in repository java.net.maven2
(http://download.java.net/maven/2)
Downloading: http://repository.springsource.com/maven/bundles/external/org/eclipse/jetty/jetty-parent/9/jetty-parent-9.pom
[INFO] Unable to find resource 'org.eclipse.jetty:jetty-parent:pom:9' in repository com.springsource.repository.bundles.external
(http://repository.springsource.com/maven/bundles/external)
Downloading: http://repo1.maven.org/maven2/org/eclipse/jetty/jetty-parent/9/jetty-parent-9.pom

Downloading: http://download.java.net/maven/2/org/mortbay/jetty/jetty-sslengine/6.1.22/jetty-sslengine-6.1.22.pom
[INFO] Unable to find resource 'org.mortbay.jetty:jetty-sslengine:pom:6.1.22' in repository
java.net.maven2 (http://download.java.net/maven/2)
Downloading: http://repository.springsource.com/maven/bundles/external/org/mortbay/jetty/jetty-sslengine/6.1.22/jetty-sslengine-6.1.22.pom
[INFO] Unable to find resource 'org.mortbay.jetty:jetty-sslengine:pom:6.1.22' in repository
com.springsource.repository.bundles.external (http://repository.springsource.com/maven/bundles/external)
Downloading: http://download.java.net/maven/2/org/mortbay/jetty/jetty-sslengine/6.1.22/jetty-sslengine-6.1.22.pom
[INFO] Unable to find resource 'org.mortbay.jetty:jetty-sslengine:pom:6.1.22' in repository
java.net (http://download.java.net/maven/2)
Downloading: http://download.java.net/maven/1/org.mortbay.jetty/poms/jetty-sslengine-6.1.22.pom
[INFO] Unable to find resource 'org.mortbay.jetty:jetty-sslengine:pom:6.1.22' in repository
m1.java.net (http://download.java.net/maven/1)
Downloading: http://repo1.maven.org/maven2/org/mortbay/jetty/jetty-sslengine/6.1.22/jetty-sslengine-6.1.22.pom

Downloading: http://download.java.net/maven/2/org/mortbay/jetty/jetty-util5/6.1.22/jetty-util5-6.1.22.pom
[INFO] Unable to find resource 'org.mortbay.jetty:jetty-util5:pom:6.1.22' in repository java.net.maven2
(http://download.java.net/maven/2)
Downloading: http://repository.springsource.com/maven/bundles/external/org/mortbay/jetty/jetty-util5/6.1.22/jetty-util5-6.1.22.pom
[INFO] Unable to find resource 'org.mortbay.jetty:jetty-util5:pom:6.1.22' in repository com.springsource.repository.bundles.external
(http://repository.springsource.com/maven/bundles/external)
Downloading: http://download.java.net/maven/2/org/mortbay/jetty/jetty-util5/6.1.22/jetty-util5-6.1.22.pom
[INFO] Unable to find resource 'org.mortbay.jetty:jetty-util5:pom:6.1.22' in repository java.net
(http://download.java.net/maven/2)
Downloading: http://download.java.net/maven/1/org.mortbay.jetty/poms/jetty-util5-6.1.22.pom
[INFO] Unable to find resource 'org.mortbay.jetty:jetty-util5:pom:6.1.22' in repository m1.java.net
(http://download.java.net/maven/1)
Downloading: http://repo1.maven.org/maven2/org/mortbay/jetty/jetty-util5/6.1.22/jetty-util5-6.1.22.pom

Downloading: http://download.java.net/maven/2/org/apache/camel/camel-web/2.2.0/camel-web-2.2.0.pom
[INFO] Unable to find resource 'org.apache.camel:camel-web:pom:2.2.0' in repository java.net.maven2
(http://download.java.net/maven/2)
Downloading: http://repository.springsource.com/maven/bundles/external/org/apache/camel/camel-web/2.2.0/camel-web-2.2.0.pom
[INFO] Unable to find resource 'org.apache.camel:camel-web:pom:2.2.0' in repository com.springsource.repository.bundles.external
(http://repository.springsource.com/maven/bundles/external)
Downloading: http://repo1.maven.org/maven2/org/apache/camel/camel-web/2.2.0/camel-web-2.2.0.pom

Downloading: http://download.java.net/maven/2//org/apache/camel/components/2.2.0/components-2.2.0.pom
[INFO] Unable to find resource 'org.apache.camel:components:pom:2.2.0' in repository java.net.m2
(http://download.java.net/maven/2/)
Downloading: http://maven.glassfish.org/content/groups/glassfish/org/apache/camel/components/2.2.0/components-2.2.0.pom
185b downloaded  (components-2.2.0.pom)
[WARNING] *** CHECKSUM FAILED - Checksum failed on download: local = '6c9fd3d150b8a5f0ca676f49b8ed603793cabebb';
remote = '<html>
<head><title>301' - RETRYING
Downloading: http://maven.glassfish.org/content/groups/glassfish/org/apache/camel/components/2.2.0/components-2.2.0.pom
185b downloaded  (components-2.2.0.pom)
[WARNING] *** CHECKSUM FAILED - Checksum failed on download: local = '6c9fd3d150b8a5f0ca676f49b8ed603793cabebb';
remote = '<html>
<head><title>301' - IGNORING
[JENKINS] Archiving <https://builds.apache.org/job/ActiveMQ-5.3-Deploy/ws/trunk/assembly/pom.xml>
to /home/hudson/hudson/jobs/ActiveMQ-5.3-Deploy/modules/org.apache.activemq$apache-activemq/builds/2012-06-08_02-38-15/archive/org.apache.activemq/apache-activemq/5.3.3-SNAPSHOT/apache-activemq-5.3.3-SNAPSHOT.pom
[INFO] 
[INFO] 
[INFO] ------------------------------------------------------------------------
[INFO] Reactor Summary:
[INFO] ------------------------------------------------------------------------
[INFO] ActiveMQ .............................................. SUCCESS [2:52.581s]
[INFO] ActiveMQ :: KahaDB .................................... SUCCESS [37.692s]
[INFO] ActiveMQ :: JAAS ...................................... SUCCESS [1:03.290s]
[INFO] Openwire Generator .................................... SUCCESS [24.412s]
[INFO] ActiveMQ :: jmdns 1.0 ................................. SUCCESS [17.373s]
[INFO] ActiveMQ :: Core ...................................... SUCCESS [5:55.747s]
[INFO] ActiveMQ :: RA ........................................ SUCCESS [31.498s]
[INFO] ActiveMQ :: Pool ...................................... SUCCESS [26.497s]
[INFO] ActiveMQ :: Camel ..................................... SUCCESS [33.986s]
[INFO] ActiveMQ :: Console ................................... SUCCESS [24.266s]
[INFO] ActiveMQ :: Optional .................................. SUCCESS [43.070s]
[INFO] ActiveMQ :: Jar Bundle ................................ SUCCESS [16.773s]
[INFO] ActiveMQ :: File Server ............................... SUCCESS [53.552s]
[INFO] ActiveMQ :: Apache Karaf .............................. SUCCESS [8.226s]
[INFO] ActiveMQ :: RAR ....................................... SUCCESS [42.652s]
[INFO] ActiveMQ :: Run Jar ................................... SUCCESS [5.774s]
[INFO] ActiveMQ Tooling ...................................... SUCCESS [3.621s]
[INFO] ActiveMQ :: Memory Usage Test Plugin .................. SUCCESS [43.978s]
[INFO] ActiveMQ :: Performance Test Plugin ................... SUCCESS [19.141s]
[INFO] ActiveMQ :: StartUp Plugin ............................ SUCCESS [21.691s]
[INFO] ActiveMQ :: Web ....................................... SUCCESS [43.318s]
[INFO] ActiveMQ :: Web Demo .................................. SUCCESS [1:36.639s]
[INFO] ActiveMQ :: XMPP ...................................... SUCCESS [46.251s]
[INFO] ActiveMQ :: Web Console ............................... SUCCESS [2:11.762s]
[INFO] ActiveMQ :: Assembly .................................. FAILED [12.145s]
[INFO] ------------------------------------------------------------------------
[INFO] Error for project: ActiveMQ :: Assembly (during deploy)
[INFO] ------------------------------------------------------------------------
[INFO] Error building POM (may not be this project's POM).


Project ID: null:camel-web:war:null

Reason: Cannot find parent: org.apache.camel:components for project: null:camel-web:war:null
for project null:camel-web:war:null


[INFO] ------------------------------------------------------------------------
[INFO] Trace
org.apache.maven.lifecycle.LifecycleExecutionException: Unable to get dependency information:
Unable to read the metadata file for artifact 'org.apache.camel:camel-web:war': Cannot find
parent: org.apache.camel:components for project: null:camel-web:war:null for project null:camel-web:war:null
  org.apache.camel:camel-web:war:2.2.0

from the specified remote repositories:
  central (http://repo1.maven.org/maven2),
  com.springsource.repository.bundles.external (http://repository.springsource.com/maven/bundles/external),
  java.net.maven2 (http://download.java.net/maven/2),
  apache.snapshots (http://repository.apache.org/snapshots)

Path to dependency: 
	1) org.apache.activemq:apache-activemq:pom:5.3.3-SNAPSHOT


	at org.apache.maven.lifecycle.DefaultLifecycleExecutor.executeGoals(DefaultLifecycleExecutor.java:711)
	at org.apache.maven.lifecycle.DefaultLifecycleExecutor.executeGoalWithLifecycle(DefaultLifecycleExecutor.java:556)
	at org.apache.maven.lifecycle.DefaultLifecycleExecutor.executeGoal(DefaultLifecycleExecutor.java:535)
	at org.apache.maven.lifecycle.DefaultLifecycleExecutor.executeGoalAndHandleFailures(DefaultLifecycleExecutor.java:387)
	at org.apache.maven.lifecycle.DefaultLifecycleExecutor.executeTaskSegments(DefaultLifecycleExecutor.java:348)
	at org.apache.maven.lifecycle.DefaultLifecycleExecutor.execute(DefaultLifecycleExecutor.java:180)
	at org.apache.maven.lifecycle.LifecycleExecutorInterceptor.execute(LifecycleExecutorInterceptor.java:65)
	at org.apache.maven.DefaultMaven.doExecute(DefaultMaven.java:328)
	at org.apache.maven.DefaultMaven.execute(DefaultMaven.java:138)
	at org.apache.maven.cli.MavenCli.main(MavenCli.java:362)
	at sun.reflect.NativeMethodAccessorImpl.invoke0(Native Method)
	at sun.reflect.NativeMethodAccessorImpl.invoke(NativeMethodAccessorImpl.java:39)
	at sun.reflect.DelegatingMethodAccessorImpl.invoke(DelegatingMethodAccessorImpl.java:25)
	at java.lang.reflect.Method.invoke(Method.java:592)
	at org.codehaus.classworlds.Launcher.launchEnhanced(Launcher.java:315)
	at org.codehaus.classworlds.Launcher.launch(Launcher.java:255)
	at hudson.maven.agent.Main.launch(Main.java:185)
	at hudson.maven.MavenBuilder.call(MavenBuilder.java:151)
	at hudson.maven.Maven2Builder.call(Maven2Builder.java:77)
	at hudson.maven.Maven2Builder.call(Maven2Builder.java:53)
	at hudson.remoting.UserRequest.perform(UserRequest.java:118)
	at hudson.remoting.UserRequest.perform(UserRequest.java:48)
	at hudson.remoting.Request$2.run(Request.java:287)
	at hudson.remoting.InterceptingExecutorService$1.call(InterceptingExecutorService.java:72)
	at java.util.concurrent.FutureTask$Sync.innerRun(FutureTask.java:269)
	at java.util.concurrent.FutureTask.run(FutureTask.java:123)
	at java.util.concurrent.ThreadPoolExecutor$Worker.runTask(ThreadPoolExecutor.java:651)
	at java.util.concurrent.ThreadPoolExecutor$Worker.run(ThreadPoolExecutor.java:676)
	at java.lang.Thread.run(Thread.java:595)
Caused by: org.apache.maven.artifact.resolver.ArtifactResolutionException: Unable to get dependency
information: Unable to read the metadata file for artifact 'org.apache.camel:camel-web:war':
Cannot find parent: org.apache.camel:components for project: null:camel-web:war:null for project
null:camel-web:war:null
  org.apache.camel:camel-web:war:2.2.0

from the specified remote repositories:
  central (http://repo1.maven.org/maven2),
  com.springsource.repository.bundles.external (http://repository.springsource.com/maven/bundles/external),
  java.net.maven2 (http://download.java.net/maven/2),
  apache.snapshots (http://repository.apache.org/snapshots)

Path to dependency: 
	1) org.apache.activemq:apache-activemq:pom:5.3.3-SNAPSHOT


	at org.apache.maven.artifact.resolver.DefaultArtifactCollector.recurse(DefaultArtifactCollector.java:430)
	at org.apache.maven.artifact.resolver.DefaultArtifactCollector.collect(DefaultArtifactCollector.java:74)
	at org.apache.maven.artifact.resolver.DefaultArtifactResolver.resolveTransitively(DefaultArtifactResolver.java:316)
	at org.apache.maven.artifact.resolver.DefaultArtifactResolver.resolveTransitively(DefaultArtifactResolver.java:304)
	at org.apache.maven.plugin.DefaultPluginManager.resolveTransitiveDependencies(DefaultPluginManager.java:1499)
	at org.apache.maven.plugin.DefaultPluginManager.executeMojo(DefaultPluginManager.java:442)
	at hudson.maven.agent.PluginManagerInterceptor.executeMojo(PluginManagerInterceptor.java:182)
	at org.apache.maven.lifecycle.DefaultLifecycleExecutor.executeGoals(DefaultLifecycleExecutor.java:694)
	... 28 more
Caused by: org.apache.maven.artifact.metadata.ArtifactMetadataRetrievalException: Unable to
read the metadata file for artifact 'org.apache.camel:camel-web:war': Cannot find parent:
org.apache.camel:components for project: null:camel-web:war:null for project null:camel-web:war:null
	at org.apache.maven.project.artifact.MavenMetadataSource.retrieveRelocatedProject(MavenMetadataSource.java:200)
	at org.apache.maven.project.artifact.MavenMetadataSource.retrieveRelocatedArtifact(MavenMetadataSource.java:94)
	at org.apache.maven.artifact.resolver.DefaultArtifactCollector.recurse(DefaultArtifactCollector.java:387)
	... 35 more
Caused by: org.apache.maven.project.ProjectBuildingException: Cannot find parent: org.apache.camel:components
for project: null:camel-web:war:null for project null:camel-web:war:null
	at org.apache.maven.project.DefaultMavenProjectBuilder.assembleLineage(DefaultMavenProjectBuilder.java:1396)
	at org.apache.maven.project.DefaultMavenProjectBuilder.buildInternal(DefaultMavenProjectBuilder.java:823)
	at org.apache.maven.project.DefaultMavenProjectBuilder.buildFromRepository(DefaultMavenProjectBuilder.java:255)
	at org.apache.maven.project.artifact.MavenMetadataSource.retrieveRelocatedProject(MavenMetadataSource.java:163)
	... 37 more
Caused by: org.apache.maven.project.InvalidProjectModelException: Not a v4.0.0 POM. for project
org.apache.camel:components at <https://builds.apache.org/job/ActiveMQ-5.3-Deploy/ws/.repository/org/apache/camel/components/2.2.0/components-2.2.0.pom>
	at org.apache.maven.project.DefaultMavenProjectBuilder.readModel(DefaultMavenProjectBuilder.java:1599)
	at org.apache.maven.project.DefaultMavenProjectBuilder.readModel(DefaultMavenProjectBuilder.java:1571)
	at org.apache.maven.project.DefaultMavenProjectBuilder.findModelFromRepository(DefaultMavenProjectBuilder.java:562)
	at org.apache.maven.project.DefaultMavenProjectBuilder.assembleLineage(DefaultMavenProjectBuilder.java:1392)
	... 40 more
[INFO] ------------------------------------------------------------------------
[INFO] BUILD ERRORS
[INFO] ------------------------------------------------------------------------
[INFO] Total time: 26 minutes 18 seconds
[INFO] Finished at: Fri Jun 08 03:04:57 UTC 2012
[INFO] Final Memory: 86M/1974M
[INFO] ------------------------------------------------------------------------
channel stopped

Mime
View raw message