activemq-dev mailing list archives

Site index · List index
Message view « Date » · « Thread »
Top « Date » · « Thread »
From Apache Jenkins Server <jenk...@builds.apache.org>
Subject Build failed in Jenkins: ActiveMQ #965
Date Thu, 24 May 2012 09:34:01 GMT
See <https://builds.apache.org/job/ActiveMQ/965/changes>

Changes:

[tabish] fix for: https://issues.apache.org/jira/browse/AMQ-3669

[gtully] https://issues.apache.org/jira/browse/AMQ-3858 fix npe on not found vvm jmx url

------------------------------------------
[...truncated 16529 lines...]
[INFO] [remote-resources:process {execution: default}]
[INFO] [resources:resources {execution: default-resources}]
[INFO] Using 'UTF-8' encoding to copy filtered resources.
[INFO] Copying 35 resources
[INFO] Copying 0 resource
[INFO] Copying 1 resource
[INFO] Copying 3 resources
[INFO] [compiler:compile {execution: default-compile}]
[INFO] Compiling 145 source files to <https://builds.apache.org/job/ActiveMQ/ws/activemq-xmpp/target/classes>
[INFO] [resources:testResources {execution: default-testResources}]
[INFO] Using 'UTF-8' encoding to copy filtered resources.
[INFO] Copying 2 resources
[INFO] Copying 3 resources
[INFO] [compiler:testCompile {execution: default-testCompile}]
[INFO] Compiling 2 source files to <https://builds.apache.org/job/ActiveMQ/ws/activemq-xmpp/target/test-classes>
[INFO] [surefire:test {execution: default-test}]
[INFO] Surefire report directory: <https://builds.apache.org/job/ActiveMQ/ws/activemq-xmpp/target/surefire-reports>

-------------------------------------------------------
 T E S T S
-------------------------------------------------------
Running org.apache.activemq.transport.xmpp.XmppTest
Tests run: 4, Failures: 0, Errors: 0, Skipped: 0, Time elapsed: 13.524 sec

Results :

Tests run: 4, Failures: 0, Errors: 0, Skipped: 0

[JENKINS] Recording test results
[INFO] [jar:jar {execution: default-jar}]
[INFO] Building jar: <https://builds.apache.org/job/ActiveMQ/ws/activemq-xmpp/target/activemq-xmpp-5.7-SNAPSHOT.jar>
[INFO] [ianal:verify-legal-files {execution: default}]
[INFO] Checking legal files in: activemq-xmpp-5.7-SNAPSHOT.jar
[INFO] [install:install {execution: default-install}]
[INFO] Installing <https://builds.apache.org/job/ActiveMQ/ws/activemq-xmpp/target/activemq-xmpp-5.7-SNAPSHOT.jar>
to <https://builds.apache.org/job/ActiveMQ/ws/.repository/org/apache/activemq/activemq-xmpp/5.7-SNAPSHOT/activemq-xmpp-5.7-SNAPSHOT.jar>
[INFO] Preparing source:jar
[JENKINS] Archiving <https://builds.apache.org/job/ActiveMQ/ws/activemq-xmpp/pom.xml>
to /home/hudson/hudson/jobs/ActiveMQ/modules/org.apache.activemq$activemq-xmpp/builds/2012-05-24_00-57-28/archive/org.apache.activemq/activemq-xmpp/5.7-SNAPSHOT/activemq-xmpp-5.7-SNAPSHOT.pom
[JENKINS] Archiving <https://builds.apache.org/job/ActiveMQ/ws/activemq-xmpp/target/activemq-xmpp-5.7-SNAPSHOT.jar>
to /home/hudson/hudson/jobs/ActiveMQ/modules/org.apache.activemq$activemq-xmpp/builds/2012-05-24_00-57-28/archive/org.apache.activemq/activemq-xmpp/5.7-SNAPSHOT/activemq-xmpp-5.7-SNAPSHOT.jar
[INFO] [enforcer:enforce {execution: default}]
[INFO] [bundle:cleanVersions {execution: cleanVersions}]
[INFO] [jaxb2:generate {execution: default}]
[INFO] Skipped XJC execution.  Generated sources were up-to-date.
[INFO] [source:jar {execution: default-cli}]
[INFO] org already added, skipping
[INFO] META-INF already added, skipping
[INFO] META-INF already added, skipping
[INFO] META-INF/sun-jaxb.episode already added, skipping
[INFO] META-INF already added, skipping
[INFO] META-INF/LICENSE already added, skipping
[INFO] META-INF/DEPENDENCIES already added, skipping
[INFO] META-INF/NOTICE already added, skipping
[INFO] META-INF/sun-jaxb.episode already added, skipping
[INFO] Building jar: <https://builds.apache.org/job/ActiveMQ/ws/activemq-xmpp/target/activemq-xmpp-5.7-SNAPSHOT-sources.jar>
[INFO] org already added, skipping
[INFO] META-INF already added, skipping
[INFO] META-INF already added, skipping
[INFO] META-INF/sun-jaxb.episode already added, skipping
[INFO] META-INF already added, skipping
[INFO] META-INF/LICENSE already added, skipping
[INFO] META-INF/DEPENDENCIES already added, skipping
[INFO] META-INF/NOTICE already added, skipping
[INFO] META-INF/sun-jaxb.episode already added, skipping
[JENKINS] Archiving <https://builds.apache.org/job/ActiveMQ/ws/activemq-xmpp/target/activemq-xmpp-5.7-SNAPSHOT-sources.jar>
to /home/hudson/hudson/jobs/ActiveMQ/modules/org.apache.activemq$activemq-xmpp/builds/2012-05-24_00-57-28/archive/org.apache.activemq/activemq-xmpp/5.7-SNAPSHOT/activemq-xmpp-5.7-SNAPSHOT-sources.jar
[INFO] ------------------------------------------------------------------------
[INFO] SKIPPING ActiveMQ :: Web Console
[INFO]    task-segment: [clean, install, source:jar]
[INFO] This project has been banned from further executions due to previous failures.
[INFO] ------------------------------------------------------------------------
[INFO] ------------------------------------------------------------------------
[INFO] SKIPPING ActiveMQ :: Assembly
[INFO]    task-segment: [clean, install, source:jar]
[INFO] This project has been banned from further executions due to previous failures.
[INFO] ------------------------------------------------------------------------
[INFO] 
[INFO] 
[INFO] ------------------------------------------------------------------------
[INFO] Reactor Summary:
[INFO] ------------------------------------------------------------------------
[INFO] ActiveMQ .............................................. SUCCESS [2:37.749s]
[INFO] ActiveMQ :: KahaDB .................................... SUCCESS [8:16.985s]
[INFO] ActiveMQ :: JAAS ...................................... SUCCESS [1:15.259s]
[INFO] Openwire Generator .................................... SUCCESS [18.185s]
[INFO] ActiveMQ :: jmdns 1.0 ................................. SUCCESS [3.622s]
[INFO] ActiveMQ :: Core ...................................... SUCCESS [7:59:27.088s]
[INFO] ActiveMQ :: RA ........................................ SUCCESS [1:52.019s]
[INFO] ActiveMQ :: Pool ...................................... SUCCESS [1:10.686s]
[INFO] ActiveMQ :: Spring .................................... SUCCESS [1:42.789s]
[INFO] ActiveMQ :: Camel ..................................... FAILED [2:17.815s]
[INFO] ActiveMQ :: Console ................................... SUCCESS [2:31.240s]
[INFO] ActiveMQ :: Optional .................................. SUCCESS [6:05.273s]
[INFO] ActiveMQ :: Jar Bundle ................................ SKIPPED (dependency build failed
or was skipped)
[INFO] ActiveMQ :: File Server ............................... SUCCESS [20.684s]
[INFO] ActiveMQ :: Blueprint ................................. SUCCESS [17.335s]
[INFO] ActiveMQ :: Apache Karaf .............................. SUCCESS [2:49.128s]
[INFO] ActiveMQ :: RAR ....................................... SKIPPED (dependency build failed
or was skipped)
[INFO] ActiveMQ :: Run Jar ................................... SUCCESS [15.131s]
[INFO] ActiveMQ Tooling ...................................... SUCCESS [1.721s]
[INFO] ActiveMQ :: Memory Usage Test Plugin .................. SUCCESS [23.952s]
[INFO] ActiveMQ :: Performance Test Plugin ................... SUCCESS [7.532s]
[INFO] ActiveMQ :: StartUp Plugin ............................ SUCCESS [9.178s]
[INFO] ActiveMQ :: Web ....................................... SKIPPED (dependency build failed
or was skipped)
[INFO] ActiveMQ :: Web Demo .................................. SKIPPED (dependency build failed
or was skipped)
[INFO] ActiveMQ :: XMPP ...................................... SUCCESS [37.000s]
[INFO] ActiveMQ :: Web Console ............................... SKIPPED (dependency build failed
or was skipped)
[INFO] ActiveMQ :: Assembly .................................. SKIPPED (dependency build failed
or was skipped)
[INFO] ------------------------------------------------------------------------
[INFO] Error for project: ActiveMQ :: Camel (during install)
[INFO] ------------------------------------------------------------------------
[INFO] Failed to resolve artifact.

Missing:
----------
1) commons-cli:commons-cli:jar:1.1

  Try downloading the file manually from the project website.

  Then, install it using the command: 
      mvn install:install-file -DgroupId=commons-cli -DartifactId=commons-cli -Dversion=1.1
-Dpackaging=jar -Dfile=/path/to/file

  Alternatively, if you host your own repository you can deploy the file there: 
      mvn deploy:deploy-file -DgroupId=commons-cli -DartifactId=commons-cli -Dversion=1.1
-Dpackaging=jar -Dfile=/path/to/file -Durl=[url] -DrepositoryId=[id]

  Path to dependency: 
  	1) org.apache.activemq:activemq-camel:bundle:5.7-SNAPSHOT
  	2) org.apache.openejb:openejb-core:jar:3.1.2
  	3) commons-cli:commons-cli:jar:1.1

----------
1 required artifact is missing.

for artifact: 
  org.apache.activemq:activemq-camel:bundle:5.7-SNAPSHOT

from the specified remote repositories:
  com.springsource.repository.bundles.external (http://repository.springsource.com/maven/bundles/external),
  central (http://repo1.maven.org/maven2),
  fusesource-snapshots (http://repo.fusesource.com/nexus/content/groups/public-snapshots),
  Nexus (http://repository.apache.org/snapshots)



[INFO] ------------------------------------------------------------------------
[INFO] Trace
org.apache.maven.lifecycle.LifecycleExecutionException: Missing:
----------
1) commons-cli:commons-cli:jar:1.1

  Try downloading the file manually from the project website.

  Then, install it using the command: 
      mvn install:install-file -DgroupId=commons-cli -DartifactId=commons-cli -Dversion=1.1
-Dpackaging=jar -Dfile=/path/to/file

  Alternatively, if you host your own repository you can deploy the file there: 
      mvn deploy:deploy-file -DgroupId=commons-cli -DartifactId=commons-cli -Dversion=1.1
-Dpackaging=jar -Dfile=/path/to/file -Durl=[url] -DrepositoryId=[id]

  Path to dependency: 
  	1) org.apache.activemq:activemq-camel:bundle:5.7-SNAPSHOT
  	2) org.apache.openejb:openejb-core:jar:3.1.2
  	3) commons-cli:commons-cli:jar:1.1

----------
1 required artifact is missing.

for artifact: 
  org.apache.activemq:activemq-camel:bundle:5.7-SNAPSHOT

from the specified remote repositories:
  com.springsource.repository.bundles.external (http://repository.springsource.com/maven/bundles/external),
  central (http://repo1.maven.org/maven2),
  fusesource-snapshots (http://repo.fusesource.com/nexus/content/groups/public-snapshots),
  Nexus (http://repository.apache.org/snapshots)


	at org.apache.maven.lifecycle.DefaultLifecycleExecutor.executeGoals(DefaultLifecycleExecutor.java:711)
	at org.apache.maven.lifecycle.DefaultLifecycleExecutor.executeGoalWithLifecycle(DefaultLifecycleExecutor.java:556)
	at org.apache.maven.lifecycle.DefaultLifecycleExecutor.executeGoal(DefaultLifecycleExecutor.java:535)
	at org.apache.maven.lifecycle.DefaultLifecycleExecutor.executeGoalAndHandleFailures(DefaultLifecycleExecutor.java:387)
	at org.apache.maven.lifecycle.DefaultLifecycleExecutor.executeTaskSegments(DefaultLifecycleExecutor.java:348)
	at org.apache.maven.lifecycle.DefaultLifecycleExecutor.execute(DefaultLifecycleExecutor.java:180)
	at org.apache.maven.lifecycle.LifecycleExecutorInterceptor.execute(LifecycleExecutorInterceptor.java:65)
	at org.apache.maven.DefaultMaven.doExecute(DefaultMaven.java:328)
	at org.apache.maven.DefaultMaven.execute(DefaultMaven.java:138)
	at org.apache.maven.cli.MavenCli.main(MavenCli.java:362)
	at sun.reflect.NativeMethodAccessorImpl.invoke0(Native Method)
	at sun.reflect.NativeMethodAccessorImpl.invoke(NativeMethodAccessorImpl.java:39)
	at sun.reflect.DelegatingMethodAccessorImpl.invoke(DelegatingMethodAccessorImpl.java:25)
	at java.lang.reflect.Method.invoke(Method.java:597)
	at org.codehaus.classworlds.Launcher.launchEnhanced(Launcher.java:315)
	at org.codehaus.classworlds.Launcher.launch(Launcher.java:255)
	at hudson.maven.agent.Main.launch(Main.java:185)
	at hudson.maven.MavenBuilder.call(MavenBuilder.java:151)
	at hudson.maven.Maven2Builder.call(Maven2Builder.java:77)
	at hudson.maven.Maven2Builder.call(Maven2Builder.java:53)
	at hudson.remoting.UserRequest.perform(UserRequest.java:118)
	at hudson.remoting.UserRequest.perform(UserRequest.java:48)
	at hudson.remoting.Request$2.run(Request.java:287)
	at hudson.remoting.InterceptingExecutorService$1.call(InterceptingExecutorService.java:72)
	at java.util.concurrent.FutureTask$Sync.innerRun(FutureTask.java:303)
	at java.util.concurrent.FutureTask.run(FutureTask.java:138)
	at java.util.concurrent.ThreadPoolExecutor$Worker.runTask(ThreadPoolExecutor.java:886)
	at java.util.concurrent.ThreadPoolExecutor$Worker.run(ThreadPoolExecutor.java:908)
	at java.lang.Thread.run(Thread.java:662)
Caused by: org.apache.maven.artifact.resolver.MultipleArtifactsNotFoundException: Missing:
----------
1) commons-cli:commons-cli:jar:1.1

  Try downloading the file manually from the project website.

  Then, install it using the command: 
      mvn install:install-file -DgroupId=commons-cli -DartifactId=commons-cli -Dversion=1.1
-Dpackaging=jar -Dfile=/path/to/file

  Alternatively, if you host your own repository you can deploy the file there: 
      mvn deploy:deploy-file -DgroupId=commons-cli -DartifactId=commons-cli -Dversion=1.1
-Dpackaging=jar -Dfile=/path/to/file -Durl=[url] -DrepositoryId=[id]

  Path to dependency: 
  	1) org.apache.activemq:activemq-camel:bundle:5.7-SNAPSHOT
  	2) org.apache.openejb:openejb-core:jar:3.1.2
  	3) commons-cli:commons-cli:jar:1.1

----------
1 required artifact is missing.

for artifact: 
  org.apache.activemq:activemq-camel:bundle:5.7-SNAPSHOT

from the specified remote repositories:
  com.springsource.repository.bundles.external (http://repository.springsource.com/maven/bundles/external),
  central (http://repo1.maven.org/maven2),
  fusesource-snapshots (http://repo.fusesource.com/nexus/content/groups/public-snapshots),
  Nexus (http://repository.apache.org/snapshots)


	at org.apache.maven.artifact.resolver.DefaultArtifactResolver.resolveTransitively(DefaultArtifactResolver.java:360)
	at org.apache.maven.artifact.resolver.DefaultArtifactResolver.resolveTransitively(DefaultArtifactResolver.java:304)
	at org.apache.maven.plugin.DefaultPluginManager.resolveTransitiveDependencies(DefaultPluginManager.java:1499)
	at org.apache.maven.plugin.DefaultPluginManager.executeMojo(DefaultPluginManager.java:442)
	at hudson.maven.agent.PluginManagerInterceptor.executeMojo(PluginManagerInterceptor.java:182)
	at org.apache.maven.lifecycle.DefaultLifecycleExecutor.executeGoals(DefaultLifecycleExecutor.java:694)
	... 28 more
[INFO] ------------------------------------------------------------------------
[INFO] BUILD ERRORS
[INFO] ------------------------------------------------------------------------
[INFO] Total time: 515 minutes 56 seconds
[INFO] Finished at: Thu May 24 09:33:52 UTC 2012
[INFO] Final Memory: 208M/1655M
[INFO] ------------------------------------------------------------------------
channel stopped
[locks-and-latches] Releasing all the locks
[locks-and-latches] All the locks released

Mime
View raw message