activemq-dev mailing list archives

Site index · List index
Message view « Date » · « Thread »
Top « Date » · « Thread »
From Apache Jenkins Server <jenk...@builds.apache.org>
Subject Build failed in Jenkins: ActiveMQ-Trunk-Deploy #496
Date Wed, 21 Mar 2012 03:08:35 GMT
See <https://builds.apache.org/job/ActiveMQ-Trunk-Deploy/496/changes>

Changes:

[tabish] https://issues.apache.org/jira/browse/AMQ-3775

Ensure that the orderIndex is reset to a good state.

[tabish] https://issues.apache.org/jira/browse/AMQ-3775

Update test to not use a static port for the broker Uri.

[tabish] fix and test for: https://issues.apache.org/jira/browse/AMQ-3780

ensure that non-persistent messages are cleaned up from temp storage when the Queue is deleted.

[rajdavies] Added package.html for levelDB stub - for https://issues.apache.org/jira/browse/AMQ-3772

[chirino] Use the snapshot version of the leveldb store..

[tabish] fix bad logger define.

[rajdavies] Added config test for LevelDB - for https://issues.apache.org/jira/browse/AMQ-3772

[rajdavies] add property  optimizeMessageStoreInFlightLimit on destinations so can set the
inflight limit above which optimize store dispatch is no longer applied - for https://issues.apache.org/jira/browse/AMQ-3750

[tabish] fix for: https://issues.apache.org/jira/browse/AMQ-3776

[tabish] fix for: https://issues.apache.org/jira/browse/AMQ-3777

------------------------------------------
[...truncated 5712 lines...]
[INFO] SKIPPING ActiveMQ :: RAR
[INFO]    task-segment: [clean, deploy]
[INFO] This project has been banned from further executions due to previous failures.
[INFO] ------------------------------------------------------------------------
[INFO] ------------------------------------------------------------------------
[INFO] SKIPPING ActiveMQ :: Run Jar
[INFO]    task-segment: [clean, deploy]
[INFO] This project has been banned from further executions due to previous failures.
[INFO] ------------------------------------------------------------------------
[INFO] ------------------------------------------------------------------------
[INFO] Building ActiveMQ Tooling
[INFO]    task-segment: [clean, deploy]
[INFO] ------------------------------------------------------------------------
[INFO] [clean:clean {execution: default-clean}]
[INFO] [enforcer:enforce {execution: default}]
[INFO] [bundle:cleanVersions {execution: cleanVersions}]
[INFO] [remote-resources:process {execution: default}]
[INFO] [site:attach-descriptor {execution: default-attach-descriptor}]
[INFO] Preparing source:jar
[WARNING] Removing: jar from forked lifecycle, to prevent recursive invocation.
[JENKINS] Archiving <https://builds.apache.org/job/ActiveMQ-Trunk-Deploy/ws/deploy/activemq-tooling/pom.xml>
to /home/hudson/hudson/jobs/ActiveMQ-Trunk-Deploy/modules/org.apache.activemq.tooling$activemq-tooling/builds/2012-03-21_03-06-02/archive/org.apache.activemq.tooling/activemq-tooling/5.6-SNAPSHOT/activemq-tooling-5.6-SNAPSHOT.pom
[INFO] [enforcer:enforce {execution: default}]
[INFO] [bundle:cleanVersions {execution: cleanVersions}]
[INFO] [source:jar {execution: attach-sources}]
[INFO] [javadoc:jar {execution: attach-javadocs}]
[INFO] Not executing Javadoc as the project is not a Java classpath-capable package
[INFO] [ianal:verify-legal-files {execution: default}]
[INFO] [install:install {execution: default-install}]
[INFO] Installing <https://builds.apache.org/job/ActiveMQ-Trunk-Deploy/ws/deploy/activemq-tooling/pom.xml>
to <https://builds.apache.org/job/ActiveMQ-Trunk-Deploy/ws/.repository/org/apache/activemq/tooling/activemq-tooling/5.6-SNAPSHOT/activemq-tooling-5.6-SNAPSHOT.pom>
[INFO] [deploy:deploy {execution: default-deploy}]
[INFO] Retrieving previous build number from apache.snapshots.https
[WARNING] *** CHECKSUM FAILED - Checksum failed on download: local = '603b8f3ed6de07fe3ffbf19a5703a42a2a15a93e';
remote = '4b4611824ac22c974fedd1b91981146d6e15fb9b' - RETRYING
[WARNING] *** CHECKSUM FAILED - Checksum failed on download: local = '603b8f3ed6de07fe3ffbf19a5703a42a2a15a93e';
remote = '4b4611824ac22c974fedd1b91981146d6e15fb9b' - IGNORING
Uploading: https://repository.apache.org/content/repositories/snapshots/org/apache/activemq/tooling/activemq-tooling/5.6-SNAPSHOT/activemq-tooling-5.6-SNAPSHOT.pom
1K uploaded  (activemq-tooling-5.6-SNAPSHOT.pom)
[INFO] Retrieving previous metadata from apache.snapshots.https
[INFO] Uploading repository metadata for: 'artifact org.apache.activemq.tooling:activemq-tooling'
[INFO] Retrieving previous metadata from apache.snapshots.https
[WARNING] *** CHECKSUM FAILED - Checksum failed on download: local = '603b8f3ed6de07fe3ffbf19a5703a42a2a15a93e';
remote = '4b4611824ac22c974fedd1b91981146d6e15fb9b' - RETRYING
[WARNING] *** CHECKSUM FAILED - Checksum failed on download: local = '603b8f3ed6de07fe3ffbf19a5703a42a2a15a93e';
remote = '4b4611824ac22c974fedd1b91981146d6e15fb9b' - IGNORING
[INFO] Uploading repository metadata for: 'snapshot org.apache.activemq.tooling:activemq-tooling:5.6-SNAPSHOT'
[INFO] ------------------------------------------------------------------------
[INFO] SKIPPING ActiveMQ :: Memory Usage Test Plugin
[INFO]    task-segment: [clean, deploy]
[INFO] This project has been banned from further executions due to previous failures.
[INFO] ------------------------------------------------------------------------
[INFO] ------------------------------------------------------------------------
[INFO] SKIPPING ActiveMQ :: Performance Test Plugin
[INFO]    task-segment: [clean, deploy]
[INFO] This project has been banned from further executions due to previous failures.
[INFO] ------------------------------------------------------------------------
[INFO] ------------------------------------------------------------------------
[INFO] SKIPPING ActiveMQ :: StartUp Plugin
[INFO]    task-segment: [clean, deploy]
[INFO] This project has been banned from further executions due to previous failures.
[INFO] ------------------------------------------------------------------------
[INFO] ------------------------------------------------------------------------
[INFO] SKIPPING ActiveMQ :: Web
[INFO]    task-segment: [clean, deploy]
[INFO] This project has been banned from further executions due to previous failures.
[INFO] ------------------------------------------------------------------------
[INFO] ------------------------------------------------------------------------
[INFO] SKIPPING ActiveMQ :: Web Demo
[INFO]    task-segment: [clean, deploy]
[INFO] This project has been banned from further executions due to previous failures.
[INFO] ------------------------------------------------------------------------
[INFO] ------------------------------------------------------------------------
[INFO] SKIPPING ActiveMQ :: XMPP
[INFO]    task-segment: [clean, deploy]
[INFO] This project has been banned from further executions due to previous failures.
[INFO] ------------------------------------------------------------------------
[INFO] ------------------------------------------------------------------------
[INFO] SKIPPING ActiveMQ :: Web Console
[INFO]    task-segment: [clean, deploy]
[INFO] This project has been banned from further executions due to previous failures.
[INFO] ------------------------------------------------------------------------
[INFO] ------------------------------------------------------------------------
[INFO] SKIPPING ActiveMQ :: Assembly
[INFO]    task-segment: [clean, deploy]
[INFO] This project has been banned from further executions due to previous failures.
[INFO] ------------------------------------------------------------------------
[INFO] 
[INFO] 
[INFO] ------------------------------------------------------------------------
[INFO] Reactor Summary:
[INFO] ------------------------------------------------------------------------
[INFO] ActiveMQ .............................................. SUCCESS [25.874s]
[INFO] ActiveMQ :: KahaDB .................................... SUCCESS [22.310s]
[INFO] ActiveMQ :: JAAS ...................................... SUCCESS [14.951s]
[INFO] Openwire Generator .................................... SUCCESS [13.294s]
[INFO] ActiveMQ :: jmdns 1.0 ................................. SUCCESS [12.499s]
[INFO] ActiveMQ :: Core ...................................... FAILED [3.301s]
[INFO] ActiveMQ :: RA ........................................ SKIPPED (dependency build failed
or was skipped)
[INFO] ActiveMQ :: Pool ...................................... SKIPPED (dependency build failed
or was skipped)
[INFO] ActiveMQ :: Spring .................................... SKIPPED (dependency build failed
or was skipped)
[INFO] ActiveMQ :: Camel ..................................... SKIPPED (dependency build failed
or was skipped)
[INFO] ActiveMQ :: Console ................................... SKIPPED (dependency build failed
or was skipped)
[INFO] ActiveMQ :: Optional .................................. SKIPPED (dependency build failed
or was skipped)
[INFO] ActiveMQ :: Jar Bundle ................................ SKIPPED (dependency build failed
or was skipped)
[INFO] ActiveMQ :: File Server ............................... SKIPPED (dependency build failed
or was skipped)
[INFO] ActiveMQ :: Blueprint ................................. SUCCESS [6.358s]
[INFO] ActiveMQ :: Apache Karaf .............................. SKIPPED (dependency build failed
or was skipped)
[INFO] ActiveMQ :: RAR ....................................... SKIPPED (dependency build failed
or was skipped)
[INFO] ActiveMQ :: Run Jar ................................... SKIPPED (dependency build failed
or was skipped)
[INFO] ActiveMQ Tooling ...................................... SUCCESS [3.722s]
[INFO] ActiveMQ :: Memory Usage Test Plugin .................. SKIPPED (dependency build failed
or was skipped)
[INFO] ActiveMQ :: Performance Test Plugin ................... SKIPPED (dependency build failed
or was skipped)
[INFO] ActiveMQ :: StartUp Plugin ............................ SKIPPED (dependency build failed
or was skipped)
[INFO] ActiveMQ :: Web ....................................... SKIPPED (dependency build failed
or was skipped)
[INFO] ActiveMQ :: Web Demo .................................. SKIPPED (dependency build failed
or was skipped)
[INFO] ActiveMQ :: XMPP ...................................... SKIPPED (dependency build failed
or was skipped)
[INFO] ActiveMQ :: Web Console ............................... SKIPPED (dependency build failed
or was skipped)
[INFO] ActiveMQ :: Assembly .................................. SKIPPED (dependency build failed
or was skipped)
[INFO] ------------------------------------------------------------------------
[INFO] Error for project: ActiveMQ :: Core (during deploy)
[INFO] ------------------------------------------------------------------------
[INFO] Failed to resolve artifact.

Missing:
----------
1) org.fusesource.fuse-extra:fusemq-leveldb:jar:99-master-SNAPSHOT

  Try downloading the file manually from the project website.

  Then, install it using the command: 
      mvn install:install-file -DgroupId=org.fusesource.fuse-extra -DartifactId=fusemq-leveldb
-Dversion=99-master-SNAPSHOT -Dpackaging=jar -Dfile=/path/to/file

  Alternatively, if you host your own repository you can deploy the file there: 
      mvn deploy:deploy-file -DgroupId=org.fusesource.fuse-extra -DartifactId=fusemq-leveldb
-Dversion=99-master-SNAPSHOT -Dpackaging=jar -Dfile=/path/to/file -Durl=[url] -DrepositoryId=[id]

  Path to dependency: 
  	1) org.apache.activemq:activemq-core:bundle:5.6-SNAPSHOT
  	2) org.fusesource.fuse-extra:fusemq-leveldb:jar:99-master-SNAPSHOT

----------
1 required artifact is missing.

for artifact: 
  org.apache.activemq:activemq-core:bundle:5.6-SNAPSHOT

from the specified remote repositories:
  com.springsource.repository.bundles.external (http://repository.springsource.com/maven/bundles/external),
  central (http://repo1.maven.org/maven2),
  Nexus (http://repository.apache.org/snapshots)



[INFO] ------------------------------------------------------------------------
[INFO] Trace
org.apache.maven.lifecycle.LifecycleExecutionException: Missing:
----------
1) org.fusesource.fuse-extra:fusemq-leveldb:jar:99-master-SNAPSHOT

  Try downloading the file manually from the project website.

  Then, install it using the command: 
      mvn install:install-file -DgroupId=org.fusesource.fuse-extra -DartifactId=fusemq-leveldb
-Dversion=99-master-SNAPSHOT -Dpackaging=jar -Dfile=/path/to/file

  Alternatively, if you host your own repository you can deploy the file there: 
      mvn deploy:deploy-file -DgroupId=org.fusesource.fuse-extra -DartifactId=fusemq-leveldb
-Dversion=99-master-SNAPSHOT -Dpackaging=jar -Dfile=/path/to/file -Durl=[url] -DrepositoryId=[id]

  Path to dependency: 
  	1) org.apache.activemq:activemq-core:bundle:5.6-SNAPSHOT
  	2) org.fusesource.fuse-extra:fusemq-leveldb:jar:99-master-SNAPSHOT

----------
1 required artifact is missing.

for artifact: 
  org.apache.activemq:activemq-core:bundle:5.6-SNAPSHOT

from the specified remote repositories:
  com.springsource.repository.bundles.external (http://repository.springsource.com/maven/bundles/external),
  central (http://repo1.maven.org/maven2),
  Nexus (http://repository.apache.org/snapshots)


	at org.apache.maven.lifecycle.DefaultLifecycleExecutor.executeGoals(DefaultLifecycleExecutor.java:711)
	at org.apache.maven.lifecycle.DefaultLifecycleExecutor.executeGoalWithLifecycle(DefaultLifecycleExecutor.java:556)
	at org.apache.maven.lifecycle.DefaultLifecycleExecutor.executeGoal(DefaultLifecycleExecutor.java:535)
	at org.apache.maven.lifecycle.DefaultLifecycleExecutor.executeGoalAndHandleFailures(DefaultLifecycleExecutor.java:387)
	at org.apache.maven.lifecycle.DefaultLifecycleExecutor.executeTaskSegments(DefaultLifecycleExecutor.java:348)
	at org.apache.maven.lifecycle.DefaultLifecycleExecutor.execute(DefaultLifecycleExecutor.java:180)
	at org.apache.maven.lifecycle.LifecycleExecutorInterceptor.execute(LifecycleExecutorInterceptor.java:65)
	at org.apache.maven.DefaultMaven.doExecute(DefaultMaven.java:328)
	at org.apache.maven.DefaultMaven.execute(DefaultMaven.java:138)
	at org.apache.maven.cli.MavenCli.main(MavenCli.java:362)
	at sun.reflect.NativeMethodAccessorImpl.invoke0(Native Method)
	at sun.reflect.NativeMethodAccessorImpl.invoke(NativeMethodAccessorImpl.java:39)
	at sun.reflect.DelegatingMethodAccessorImpl.invoke(DelegatingMethodAccessorImpl.java:25)
	at java.lang.reflect.Method.invoke(Method.java:597)
	at org.codehaus.classworlds.Launcher.launchEnhanced(Launcher.java:315)
	at org.codehaus.classworlds.Launcher.launch(Launcher.java:255)
	at hudson.maven.agent.Main.launch(Main.java:185)
	at hudson.maven.MavenBuilder.call(MavenBuilder.java:151)
	at hudson.maven.Maven2Builder.call(Maven2Builder.java:77)
	at hudson.maven.Maven2Builder.call(Maven2Builder.java:53)
	at hudson.remoting.UserRequest.perform(UserRequest.java:118)
	at hudson.remoting.UserRequest.perform(UserRequest.java:48)
	at hudson.remoting.Request$2.run(Request.java:287)
	at hudson.remoting.InterceptingExecutorService$1.call(InterceptingExecutorService.java:72)
	at java.util.concurrent.FutureTask$Sync.innerRun(FutureTask.java:303)
	at java.util.concurrent.FutureTask.run(FutureTask.java:138)
	at java.util.concurrent.ThreadPoolExecutor$Worker.runTask(ThreadPoolExecutor.java:886)
	at java.util.concurrent.ThreadPoolExecutor$Worker.run(ThreadPoolExecutor.java:908)
	at java.lang.Thread.run(Thread.java:662)
Caused by: org.apache.maven.artifact.resolver.MultipleArtifactsNotFoundException: Missing:
----------
1) org.fusesource.fuse-extra:fusemq-leveldb:jar:99-master-SNAPSHOT

  Try downloading the file manually from the project website.

  Then, install it using the command: 
      mvn install:install-file -DgroupId=org.fusesource.fuse-extra -DartifactId=fusemq-leveldb
-Dversion=99-master-SNAPSHOT -Dpackaging=jar -Dfile=/path/to/file

  Alternatively, if you host your own repository you can deploy the file there: 
      mvn deploy:deploy-file -DgroupId=org.fusesource.fuse-extra -DartifactId=fusemq-leveldb
-Dversion=99-master-SNAPSHOT -Dpackaging=jar -Dfile=/path/to/file -Durl=[url] -DrepositoryId=[id]

  Path to dependency: 
  	1) org.apache.activemq:activemq-core:bundle:5.6-SNAPSHOT
  	2) org.fusesource.fuse-extra:fusemq-leveldb:jar:99-master-SNAPSHOT

----------
1 required artifact is missing.

for artifact: 
  org.apache.activemq:activemq-core:bundle:5.6-SNAPSHOT

from the specified remote repositories:
  com.springsource.repository.bundles.external (http://repository.springsource.com/maven/bundles/external),
  central (http://repo1.maven.org/maven2),
  Nexus (http://repository.apache.org/snapshots)


	at org.apache.maven.artifact.resolver.DefaultArtifactResolver.resolveTransitively(DefaultArtifactResolver.java:360)
	at org.apache.maven.artifact.resolver.DefaultArtifactResolver.resolveTransitively(DefaultArtifactResolver.java:304)
	at org.apache.maven.plugin.DefaultPluginManager.resolveTransitiveDependencies(DefaultPluginManager.java:1499)
	at org.apache.maven.plugin.DefaultPluginManager.executeMojo(DefaultPluginManager.java:442)
	at hudson.maven.agent.PluginManagerInterceptor.executeMojo(PluginManagerInterceptor.java:182)
	at org.apache.maven.lifecycle.DefaultLifecycleExecutor.executeGoals(DefaultLifecycleExecutor.java:694)
	... 28 more
[INFO] ------------------------------------------------------------------------
[INFO] BUILD ERRORS
[INFO] ------------------------------------------------------------------------
[INFO] Total time: 2 minutes 7 seconds
[INFO] Finished at: Wed Mar 21 03:08:33 UTC 2012
[INFO] Final Memory: 94M/1217M
[INFO] ------------------------------------------------------------------------
channel stopped

Mime
View raw message