activemq-dev mailing list archives

Site index · List index
Message view « Date » · « Thread »
Top « Date » · « Thread »
From Apache Jenkins Server <jenk...@builds.apache.org>
Subject Build failed in Jenkins: ActiveMQ #902
Date Wed, 14 Mar 2012 08:21:57 GMT
See <https://builds.apache.org/job/ActiveMQ/902/changes>

Changes:

[gtully] https://issues.apache.org/jira/browse/AMQ-2570 - remove wildcards as they are ignored
by bnd when the classes are not referenced and replace with explicit imports for the dependencies
that are needed. In case of servlet, wildcard is ok as it is referenced but the spo bits of
the logging package are needed for the appenders

------------------------------------------
[...truncated 17245 lines...]
[INFO] Unable to find resource 'commons-cli:commons-cli:pom:1.2' in repository apache.snapshots
(https://repository.apache.org/content/repositories/snapshots/)
Downloading: http://repository.springsource.com/maven/bundles/external/commons-cli/commons-cli/1.2/commons-cli-1.2.pom
[INFO] Unable to find resource 'commons-cli:commons-cli:pom:1.2' in repository com.springsource.repository.bundles.external
(http://repository.springsource.com/maven/bundles/external)
Downloading: http://repo1.maven.org/maven2/commons-cli/commons-cli/1.2/commons-cli-1.2.pom

Downloading: http://repository.apache.org/snapshots/org/apache/maven/wagon/wagon-ssh-external/1.0-beta-6/wagon-ssh-external-1.0-beta-6.pom
[INFO] Unable to find resource 'org.apache.maven.wagon:wagon-ssh-external:pom:1.0-beta-6'
in repository apache.snapshots (https://repository.apache.org/content/repositories/snapshots/)
Downloading: http://repository.springsource.com/maven/bundles/external/org/apache/maven/wagon/wagon-ssh-external/1.0-beta-6/wagon-ssh-external-1.0-beta-6.pom
[INFO] Unable to find resource 'org.apache.maven.wagon:wagon-ssh-external:pom:1.0-beta-6'
in repository com.springsource.repository.bundles.external (http://repository.springsource.com/maven/bundles/external)
Downloading: http://repo1.maven.org/maven2/org/apache/maven/wagon/wagon-ssh-external/1.0-beta-6/wagon-ssh-external-1.0-beta-6.pom

Downloading: http://repository.apache.org/snapshots/org/apache/maven/wagon/wagon-ssh-common/1.0-beta-6/wagon-ssh-common-1.0-beta-6.pom
[INFO] Unable to find resource 'org.apache.maven.wagon:wagon-ssh-common:pom:1.0-beta-6' in
repository apache.snapshots (https://repository.apache.org/content/repositories/snapshots/)
Downloading: http://repository.springsource.com/maven/bundles/external/org/apache/maven/wagon/wagon-ssh-common/1.0-beta-6/wagon-ssh-common-1.0-beta-6.pom
[INFO] Unable to find resource 'org.apache.maven.wagon:wagon-ssh-common:pom:1.0-beta-6' in
repository com.springsource.repository.bundles.external (http://repository.springsource.com/maven/bundles/external)
Downloading: http://repo1.maven.org/maven2/org/apache/maven/wagon/wagon-ssh-common/1.0-beta-6/wagon-ssh-common-1.0-beta-6.pom

Downloading: http://repository.apache.org/snapshots/org/codehaus/plexus/plexus-interactivity-api/1.0-alpha-6/plexus-interactivity-api-1.0-alpha-6.pom
[INFO] Unable to find resource 'org.codehaus.plexus:plexus-interactivity-api:pom:1.0-alpha-6'
in repository apache.snapshots (https://repository.apache.org/content/repositories/snapshots/)
Downloading: http://repository.springsource.com/maven/bundles/external/org/codehaus/plexus/plexus-interactivity-api/1.0-alpha-6/plexus-interactivity-api-1.0-alpha-6.pom
[INFO] Unable to find resource 'org.codehaus.plexus:plexus-interactivity-api:pom:1.0-alpha-6'
in repository com.springsource.repository.bundles.external (http://repository.springsource.com/maven/bundles/external)
Downloading: http://repo1.maven.org/maven2/org/codehaus/plexus/plexus-interactivity-api/1.0-alpha-6/plexus-interactivity-api-1.0-alpha-6.pom

Downloading: http://repository.apache.org/snapshots/org/codehaus/plexus/plexus-interactivity/1.0-alpha-6/plexus-interactivity-1.0-alpha-6.pom
[INFO] Unable to find resource 'org.codehaus.plexus:plexus-interactivity:pom:1.0-alpha-6'
in repository apache.snapshots (https://repository.apache.org/content/repositories/snapshots/)
Downloading: http://repository.springsource.com/maven/bundles/external/org/codehaus/plexus/plexus-interactivity/1.0-alpha-6/plexus-interactivity-1.0-alpha-6.pom
[INFO] Unable to find resource 'org.codehaus.plexus:plexus-interactivity:pom:1.0-alpha-6'
in repository com.springsource.repository.bundles.external (http://repository.springsource.com/maven/bundles/external)
Downloading: http://repo1.maven.org/maven2/org/codehaus/plexus/plexus-interactivity/1.0-alpha-6/plexus-interactivity-1.0-alpha-6.pom

Downloading: http://repository.apache.org/snapshots/org/codehaus/plexus/plexus-utils/1.4/plexus-utils-1.4.pom
[INFO] Unable to find resource 'org.codehaus.plexus:plexus-utils:pom:1.4' in repository apache.snapshots
(https://repository.apache.org/content/repositories/snapshots/)
Downloading: http://repository.springsource.com/maven/bundles/external/org/codehaus/plexus/plexus-utils/1.4/plexus-utils-1.4.pom
[INFO] Unable to find resource 'org.codehaus.plexus:plexus-utils:pom:1.4' in repository com.springsource.repository.bundles.external
(http://repository.springsource.com/maven/bundles/external)
Downloading: http://repo1.maven.org/maven2/org/codehaus/plexus/plexus-utils/1.4/plexus-utils-1.4.pom

Downloading: http://repository.apache.org/snapshots/org/codehaus/plexus/plexus/1.0.9/plexus-1.0.9.pom
[INFO] Unable to find resource 'org.codehaus.plexus:plexus:pom:1.0.9' in repository apache.snapshots
(https://repository.apache.org/content/repositories/snapshots/)
Downloading: http://repository.springsource.com/maven/bundles/external/org/codehaus/plexus/plexus/1.0.9/plexus-1.0.9.pom
[INFO] Unable to find resource 'org.codehaus.plexus:plexus:pom:1.0.9' in repository com.springsource.repository.bundles.external
(http://repository.springsource.com/maven/bundles/external)
Downloading: http://repo1.maven.org/maven2/org/codehaus/plexus/plexus/1.0.9/plexus-1.0.9.pom

Downloading: http://repository.apache.org/snapshots/org/apache/maven/maven-plugin-descriptor/2.2.1/maven-plugin-descriptor-2.2.1.pom
[INFO] Unable to find resource 'org.apache.maven:maven-plugin-descriptor:pom:2.2.1' in repository
apache.snapshots (https://repository.apache.org/content/repositories/snapshots/)
Downloading: http://repository.springsource.com/maven/bundles/external/org/apache/maven/maven-plugin-descriptor/2.2.1/maven-plugin-descriptor-2.2.1.pom
[INFO] Unable to find resource 'org.apache.maven:maven-plugin-descriptor:pom:2.2.1' in repository
com.springsource.repository.bundles.external (http://repository.springsource.com/maven/bundles/external)
Downloading: http://repo1.maven.org/maven2/org/apache/maven/maven-plugin-descriptor/2.2.1/maven-plugin-descriptor-2.2.1.pom

Downloading: http://repository.apache.org/snapshots/org/apache/maven/maven-monitor/2.2.1/maven-monitor-2.2.1.pom
[INFO] Unable to find resource 'org.apache.maven:maven-monitor:pom:2.2.1' in repository apache.snapshots
(https://repository.apache.org/content/repositories/snapshots/)
Downloading: http://repository.springsource.com/maven/bundles/external/org/apache/maven/maven-monitor/2.2.1/maven-monitor-2.2.1.pom
[INFO] Unable to find resource 'org.apache.maven:maven-monitor:pom:2.2.1' in repository com.springsource.repository.bundles.external
(http://repository.springsource.com/maven/bundles/external)
Downloading: http://repo1.maven.org/maven2/org/apache/maven/maven-monitor/2.2.1/maven-monitor-2.2.1.pom

Downloading: http://repository.apache.org/snapshots/org/apache/maven/wagon/wagon-ssh/1.0-beta-6/wagon-ssh-1.0-beta-6.pom
[INFO] Unable to find resource 'org.apache.maven.wagon:wagon-ssh:pom:1.0-beta-6' in repository
apache.snapshots (https://repository.apache.org/content/repositories/snapshots/)
Downloading: http://repository.springsource.com/maven/bundles/external/org/apache/maven/wagon/wagon-ssh/1.0-beta-6/wagon-ssh-1.0-beta-6.pom
[INFO] Unable to find resource 'org.apache.maven.wagon:wagon-ssh:pom:1.0-beta-6' in repository
com.springsource.repository.bundles.external (http://repository.springsource.com/maven/bundles/external)
Downloading: http://repo1.maven.org/maven2/org/apache/maven/wagon/wagon-ssh/1.0-beta-6/wagon-ssh-1.0-beta-6.pom

Downloading: http://repository.apache.org/snapshots/com/jcraft/jsch/0.1.38/jsch-0.1.38.pom
[INFO] Unable to find resource 'com.jcraft:jsch:pom:0.1.38' in repository apache.snapshots
(https://repository.apache.org/content/repositories/snapshots/)
Downloading: http://repository.springsource.com/maven/bundles/external/com/jcraft/jsch/0.1.38/jsch-0.1.38.pom
[INFO] Unable to find resource 'com.jcraft:jsch:pom:0.1.38' in repository com.springsource.repository.bundles.external
(http://repository.springsource.com/maven/bundles/external)
Downloading: http://repo1.maven.org/maven2/com/jcraft/jsch/0.1.38/jsch-0.1.38.pom

Downloading: http://repository.apache.org/snapshots/org/sonatype/plexus/plexus-sec-dispatcher/1.3/plexus-sec-dispatcher-1.3.pom
[INFO] Unable to find resource 'org.sonatype.plexus:plexus-sec-dispatcher:pom:1.3' in repository
apache.snapshots (https://repository.apache.org/content/repositories/snapshots/)
Downloading: http://repository.springsource.com/maven/bundles/external/org/sonatype/plexus/plexus-sec-dispatcher/1.3/plexus-sec-dispatcher-1.3.pom
[INFO] Unable to find resource 'org.sonatype.plexus:plexus-sec-dispatcher:pom:1.3' in repository
com.springsource.repository.bundles.external (http://repository.springsource.com/maven/bundles/external)
Downloading: http://repo1.maven.org/maven2/org/sonatype/plexus/plexus-sec-dispatcher/1.3/plexus-sec-dispatcher-1.3.pom

Downloading: http://repository.apache.org/snapshots/org/sonatype/spice/spice-parent/12/spice-parent-12.pom
[INFO] Unable to find resource 'org.sonatype.spice:spice-parent:pom:12' in repository apache.snapshots
(https://repository.apache.org/content/repositories/snapshots/)
Downloading: http://repository.springsource.com/maven/bundles/external/org/sonatype/spice/spice-parent/12/spice-parent-12.pom
[INFO] Unable to find resource 'org.sonatype.spice:spice-parent:pom:12' in repository com.springsource.repository.bundles.external
(http://repository.springsource.com/maven/bundles/external)
Downloading: http://repo1.maven.org/maven2/org/sonatype/spice/spice-parent/12/spice-parent-12.pom

Downloading: http://repository.apache.org/snapshots/org/sonatype/forge/forge-parent/4/forge-parent-4.pom
[INFO] Unable to find resource 'org.sonatype.forge:forge-parent:pom:4' in repository apache.snapshots
(https://repository.apache.org/content/repositories/snapshots/)
Downloading: http://repository.springsource.com/maven/bundles/external/org/sonatype/forge/forge-parent/4/forge-parent-4.pom
[INFO] Unable to find resource 'org.sonatype.forge:forge-parent:pom:4' in repository com.springsource.repository.bundles.external
(http://repository.springsource.com/maven/bundles/external)
Downloading: http://repo1.maven.org/maven2/org/sonatype/forge/forge-parent/4/forge-parent-4.pom

Downloading: http://repository.apache.org/snapshots/org/sonatype/plexus/plexus-cipher/1.4/plexus-cipher-1.4.pom
[INFO] Unable to find resource 'org.sonatype.plexus:plexus-cipher:pom:1.4' in repository apache.snapshots
(https://repository.apache.org/content/repositories/snapshots/)
Downloading: http://repository.springsource.com/maven/bundles/external/org/sonatype/plexus/plexus-cipher/1.4/plexus-cipher-1.4.pom
[INFO] Unable to find resource 'org.sonatype.plexus:plexus-cipher:pom:1.4' in repository com.springsource.repository.bundles.external
(http://repository.springsource.com/maven/bundles/external)
Downloading: http://repo1.maven.org/maven2/org/sonatype/plexus/plexus-cipher/1.4/plexus-cipher-1.4.pom

Downloading: http://repository.apache.org/snapshots/org/codehaus/plexus/plexus-utils/1.4.9/plexus-utils-1.4.9.pom
[INFO] Unable to find resource 'org.codehaus.plexus:plexus-utils:pom:1.4.9' in repository
apache.snapshots (https://repository.apache.org/content/repositories/snapshots/)
Downloading: http://repository.springsource.com/maven/bundles/external/org/codehaus/plexus/plexus-utils/1.4.9/plexus-utils-1.4.9.pom
[INFO] Unable to find resource 'org.codehaus.plexus:plexus-utils:pom:1.4.9' in repository
com.springsource.repository.bundles.external (http://repository.springsource.com/maven/bundles/external)
Downloading: http://repo1.maven.org/maven2/org/codehaus/plexus/plexus-utils/1.4.9/plexus-utils-1.4.9.pom

Downloading: http://repository.apache.org/snapshots/org/codehaus/plexus/plexus-archiver/1.1/plexus-archiver-1.1.pom
[INFO] Unable to find resource 'org.codehaus.plexus:plexus-archiver:pom:1.1' in repository
apache.snapshots (https://repository.apache.org/content/repositories/snapshots/)
Downloading: http://repo1.maven.org/maven2/org/codehaus/plexus/plexus-archiver/1.1/plexus-archiver-1.1.pom

Downloading: http://repository.apache.org/snapshots/org/apache/maven/shared/maven-shared-io/1.1/maven-shared-io-1.1.pom
[INFO] Unable to find resource 'org.apache.maven.shared:maven-shared-io:pom:1.1' in repository
apache.snapshots (https://repository.apache.org/content/repositories/snapshots/)
Downloading: http://repo1.maven.org/maven2/org/apache/maven/shared/maven-shared-io/1.1/maven-shared-io-1.1.pom

Downloading: http://repository.apache.org/snapshots/org/apache/maven/shared/maven-filtering/1.0/maven-filtering-1.0.pom
[INFO] Unable to find resource 'org.apache.maven.shared:maven-filtering:pom:1.0' in repository
apache.snapshots (https://repository.apache.org/content/repositories/snapshots/)
Downloading: http://repo1.maven.org/maven2/org/apache/maven/shared/maven-filtering/1.0/maven-filtering-1.0.pom

Downloading: http://repository.apache.org/snapshots/org/apache/maven/shared/maven-repository-builder/1.0-alpha-2/maven-repository-builder-1.0-alpha-2.pom
[INFO] Unable to find resource 'org.apache.maven.shared:maven-repository-builder:pom:1.0-alpha-2'
in repository apache.snapshots (https://repository.apache.org/content/repositories/snapshots/)
Downloading: http://repo1.maven.org/maven2/org/apache/maven/shared/maven-repository-builder/1.0-alpha-2/maven-repository-builder-1.0-alpha-2.pom

Downloading: http://repository.apache.org/snapshots/org/apache/maven/shared/maven-common-artifact-filters/1.0-alpha-1/maven-common-artifact-filters-1.0-alpha-1.pom
[INFO] Unable to find resource 'org.apache.maven.shared:maven-common-artifact-filters:pom:1.0-alpha-1'
in repository apache.snapshots (https://repository.apache.org/content/repositories/snapshots/)
Downloading: http://repository.springsource.com/maven/bundles/external/org/apache/maven/shared/maven-common-artifact-filters/1.0-alpha-1/maven-common-artifact-filters-1.0-alpha-1.pom
[INFO] Unable to find resource 'org.apache.maven.shared:maven-common-artifact-filters:pom:1.0-alpha-1'
in repository com.springsource.repository.bundles.external (http://repository.springsource.com/maven/bundles/external)
Downloading: http://repo1.maven.org/maven2/org/apache/maven/shared/maven-common-artifact-filters/1.0-alpha-1/maven-common-artifact-filters-1.0-alpha-1.pom

Downloading: http://repository.apache.org/snapshots/org/apache/maven/shared/maven-shared-components/6/maven-shared-components-6.pom
[INFO] Unable to find resource 'org.apache.maven.shared:maven-shared-components:pom:6' in
repository apache.snapshots (https://repository.apache.org/content/repositories/snapshots/)
Downloading: http://repository.springsource.com/maven/bundles/external/org/apache/maven/shared/maven-shared-components/6/maven-shared-components-6.pom
[INFO] Unable to find resource 'org.apache.maven.shared:maven-shared-components:pom:6' in
repository com.springsource.repository.bundles.external (http://repository.springsource.com/maven/bundles/external)
Downloading: http://repo1.maven.org/maven2/org/apache/maven/shared/maven-shared-components/6/maven-shared-components-6.pom

Downloading: http://repository.apache.org/snapshots/org/codehaus/plexus/plexus-archiver/1.1/plexus-archiver-1.1.jar
Downloading: http://repository.apache.org/snapshots/org/apache/maven/shared/maven-shared-io/1.1/maven-shared-io-1.1.jar
[INFO] Unable to find resource 'org.apache.maven.shared:maven-shared-io:jar:1.1' in repository
apache.snapshots (https://repository.apache.org/content/repositories/snapshots/)
Downloading: http://repo1.maven.org/maven2/org/apache/maven/shared/maven-shared-io/1.1/maven-shared-io-1.1.jar
[INFO] Unable to find resource 'org.codehaus.plexus:plexus-archiver:jar:1.1' in repository
apache.snapshots (https://repository.apache.org/content/repositories/snapshots/)
Downloading: http://repo1.maven.org/maven2/org/codehaus/plexus/plexus-archiver/1.1/plexus-archiver-1.1.jar

Downloading: http://repository.apache.org/snapshots/org/apache/maven/shared/maven-filtering/1.0/maven-filtering-1.0.jar
[INFO] Unable to find resource 'org.apache.maven.shared:maven-filtering:jar:1.0' in repository
apache.snapshots (https://repository.apache.org/content/repositories/snapshots/)
Downloading: http://repo1.maven.org/maven2/org/apache/maven/shared/maven-filtering/1.0/maven-filtering-1.0.jar

Downloading: http://repository.apache.org/snapshots/org/apache/maven/shared/maven-repository-builder/1.0-alpha-2/maven-repository-builder-1.0-alpha-2.jar
[INFO] Unable to find resource 'org.apache.maven.shared:maven-repository-builder:jar:1.0-alpha-2'
in repository apache.snapshots (https://repository.apache.org/content/repositories/snapshots/)
Downloading: http://repo1.maven.org/maven2/org/apache/maven/shared/maven-repository-builder/1.0-alpha-2/maven-repository-builder-1.0-alpha-2.jar


[INFO] [assembly:attached {execution: unix-bin}]
[INFO] Reading assembly descriptor: src/main/descriptors/unix-bin.xml
[WARNING] Cannot include project artifact: org.apache.activemq:apache-activemq:pom:5.6-SNAPSHOT;
it doesn't have an associated file or directory.
[WARNING] Cannot include project artifact: org.apache.activemq:apache-activemq:pom:5.6-SNAPSHOT;
it doesn't have an associated file or directory.
[WARNING] Cannot include project artifact: org.apache.activemq:apache-activemq:pom:5.6-SNAPSHOT;
it doesn't have an associated file or directory.
[WARNING] Cannot include project artifact: org.apache.activemq:apache-activemq:pom:5.6-SNAPSHOT;
it doesn't have an associated file or directory.
[WARNING] Cannot include project artifact: org.apache.activemq:apache-activemq:pom:5.6-SNAPSHOT;
it doesn't have an associated file or directory.
[WARNING] The following patterns were never triggered in this artifact inclusion filter:
o  'org.fusesource.commonman:commons-management'

[INFO] apache-activemq-5.6-SNAPSHOT/webapps/admin/WEB-INF already added, skipping
[INFO] Building tar : <https://builds.apache.org/job/ActiveMQ/ws/assembly/target/apache-activemq-5.6-SNAPSHOT-bin.tar.gz>
[INFO] apache-activemq-5.6-SNAPSHOT/webapps/admin/WEB-INF already added, skipping
[INFO] [assembly:attached {execution: windows-bin}]
[INFO] Reading assembly descriptor: src/main/descriptors/windows-bin.xml
[WARNING] Cannot include project artifact: org.apache.activemq:apache-activemq:pom:5.6-SNAPSHOT;
it doesn't have an associated file or directory.
[WARNING] Cannot include project artifact: org.apache.activemq:apache-activemq:pom:5.6-SNAPSHOT;
it doesn't have an associated file or directory.
[WARNING] Cannot include project artifact: org.apache.activemq:apache-activemq:pom:5.6-SNAPSHOT;
it doesn't have an associated file or directory.
[WARNING] Cannot include project artifact: org.apache.activemq:apache-activemq:pom:5.6-SNAPSHOT;
it doesn't have an associated file or directory.
[WARNING] Cannot include project artifact: org.apache.activemq:apache-activemq:pom:5.6-SNAPSHOT;
it doesn't have an associated file or directory.
[WARNING] The following patterns were never triggered in this artifact inclusion filter:
o  'org.fusesource.commonman:commons-management'

[INFO] apache-activemq-5.6-SNAPSHOT/webapps/admin/WEB-INF already added, skipping
[INFO] Building zip: <https://builds.apache.org/job/ActiveMQ/ws/assembly/target/apache-activemq-5.6-SNAPSHOT-bin.zip>
[INFO] apache-activemq-5.6-SNAPSHOT/webapps/admin/WEB-INF already added, skipping
[INFO] [ianal:verify-legal-files {execution: default}]
[INFO] Checking legal files in: apache-activemq-5.6-SNAPSHOT-bin.zip
[INFO] [install:install {execution: default-install}]
[INFO] Installing <https://builds.apache.org/job/ActiveMQ/ws/assembly/pom.xml> to <https://builds.apache.org/job/ActiveMQ/ws/.repository/org/apache/activemq/apache-activemq/5.6-SNAPSHOT/apache-activemq-5.6-SNAPSHOT.pom>
[INFO] Installing <https://builds.apache.org/job/ActiveMQ/ws/assembly/target/apache-activemq-5.6-SNAPSHOT-bin.tar.gz>
to <https://builds.apache.org/job/ActiveMQ/ws/.repository/org/apache/activemq/apache-activemq/5.6-SNAPSHOT/apache-activemq-5.6-SNAPSHOT-bin.tar.gz>
[INFO] Installing <https://builds.apache.org/job/ActiveMQ/ws/assembly/target/apache-activemq-5.6-SNAPSHOT-bin.zip>
to <https://builds.apache.org/job/ActiveMQ/ws/.repository/org/apache/activemq/apache-activemq/5.6-SNAPSHOT/apache-activemq-5.6-SNAPSHOT-bin.zip>
[INFO] Preparing source:jar
[JENKINS] Archiving <https://builds.apache.org/job/ActiveMQ/ws/assembly/pom.xml> to
/home/hudson/hudson/jobs/ActiveMQ/modules/org.apache.activemq$apache-activemq/builds/2012-03-14_00-33-21/archive/org.apache.activemq/apache-activemq/5.6-SNAPSHOT/apache-activemq-5.6-SNAPSHOT.pom
[JENKINS] Archiving <https://builds.apache.org/job/ActiveMQ/ws/assembly/target/apache-activemq-5.6-SNAPSHOT-bin.tar.gz>
to /home/hudson/hudson/jobs/ActiveMQ/modules/org.apache.activemq$apache-activemq/builds/2012-03-14_00-33-21/archive/org.apache.activemq/apache-activemq/5.6-SNAPSHOT/apache-activemq-5.6-SNAPSHOT-bin.tar.gz
[JENKINS] Archiving <https://builds.apache.org/job/ActiveMQ/ws/assembly/target/apache-activemq-5.6-SNAPSHOT-bin.zip>
to /home/hudson/hudson/jobs/ActiveMQ/modules/org.apache.activemq$apache-activemq/builds/2012-03-14_00-33-21/archive/org.apache.activemq/apache-activemq/5.6-SNAPSHOT/apache-activemq-5.6-SNAPSHOT-bin.zip
[INFO] [enforcer:enforce {execution: default}]
[INFO] [bundle:cleanVersions {execution: cleanVersions}]
[INFO] [source:jar {execution: default-cli}]
[INFO] 
[INFO] 
[INFO] ------------------------------------------------------------------------
[INFO] Reactor Summary:
[INFO] ------------------------------------------------------------------------
[INFO] ActiveMQ .............................................. SUCCESS [3:34.820s]
[INFO] ActiveMQ :: KahaDB .................................... SUCCESS [3:07.997s]
[INFO] ActiveMQ :: JAAS ...................................... SUCCESS [1:49.635s]
[INFO] Openwire Generator .................................... SUCCESS [40.107s]
[INFO] ActiveMQ :: jmdns 1.0 ................................. SUCCESS [33.349s]
[INFO] ActiveMQ :: Core ...................................... SUCCESS [6:42:57.967s]
[INFO] ActiveMQ :: RA ........................................ SUCCESS [1:42.408s]
[INFO] ActiveMQ :: Pool ...................................... SUCCESS [41.676s]
[INFO] ActiveMQ :: Spring .................................... SUCCESS [1:16.237s]
[INFO] ActiveMQ :: Camel ..................................... SUCCESS [15:39.884s]
[INFO] ActiveMQ :: Console ................................... SUCCESS [2:11.234s]
[INFO] ActiveMQ :: Optional .................................. SUCCESS [5:22.402s]
[INFO] ActiveMQ :: Jar Bundle ................................ SUCCESS [48.436s]
[INFO] ActiveMQ :: File Server ............................... SUCCESS [20.520s]
[INFO] ActiveMQ :: Blueprint ................................. SUCCESS [26.066s]
[INFO] ActiveMQ :: Apache Karaf .............................. SUCCESS [3:14.384s]
[INFO] ActiveMQ :: RAR ....................................... SUCCESS [1:29.566s]
[INFO] ActiveMQ :: Run Jar ................................... SUCCESS [3.108s]
[INFO] ActiveMQ Tooling ...................................... SUCCESS [2.073s]
[INFO] ActiveMQ :: Memory Usage Test Plugin .................. SUCCESS [28.423s]
[INFO] ActiveMQ :: Performance Test Plugin ................... SUCCESS [12.964s]
[INFO] ActiveMQ :: StartUp Plugin ............................ SUCCESS [10.859s]
[INFO] ActiveMQ :: Web ....................................... SUCCESS [14.952s]
[INFO] ActiveMQ :: Web Demo .................................. SUCCESS [3:31.227s]
[INFO] ActiveMQ :: XMPP ...................................... SUCCESS [54.624s]
[INFO] ActiveMQ :: Web Console ............................... SUCCESS [2:09.178s]
[INFO] ActiveMQ :: Assembly .................................. SUCCESS [10:04.649s]
[INFO] ------------------------------------------------------------------------
[INFO] ------------------------------------------------------------------------
[INFO] BUILD SUCCESSFUL
[INFO] ------------------------------------------------------------------------
[INFO] Total time: 467 minutes 21 seconds
[INFO] Finished at: Wed Mar 14 08:21:34 UTC 2012
[INFO] Final Memory: 144M/1627M
[INFO] ------------------------------------------------------------------------
Waiting for Jenkins to finish collecting data
channel stopped
[locks-and-latches] Releasing all the locks
[locks-and-latches] All the locks released
Maven RedeployPublished use remote ubuntu2 maven settings from : /home/hudson/.m2/settings.xml
[INFO] Deployment in https://repository.apache.org/content/repositories/snapshots (id=,uniqueVersion=false)
Deploying the main artifact activemq-all-5.6-SNAPSHOT.jar
ERROR: Error deploying artifact: Failed to transfer file: https://repository.apache.org/content/repositories/snapshots/org/apache/activemq/activemq-all/5.6-SNAPSHOT/activemq-all-5.6-SNAPSHOT.jar.
Return code is: 401, ReasonPhrase:Unauthorized.
org.apache.maven.artifact.deployer.ArtifactDeploymentException: Error deploying artifact:
Failed to transfer file: https://repository.apache.org/content/repositories/snapshots/org/apache/activemq/activemq-all/5.6-SNAPSHOT/activemq-all-5.6-SNAPSHOT.jar.
Return code is: 401, ReasonPhrase:Unauthorized.
	at hudson.maven.artifact.deployer.DefaultArtifactDeployer.deploy(DefaultArtifactDeployer.java:175)
	at hudson.maven.reporters.MavenArtifactRecord.deploy(MavenArtifactRecord.java:182)
	at hudson.maven.RedeployPublisher.perform(RedeployPublisher.java:176)
	at hudson.tasks.BuildStepMonitor$1.perform(BuildStepMonitor.java:19)
	at hudson.model.AbstractBuild$AbstractRunner.perform(AbstractBuild.java:703)
	at hudson.model.AbstractBuild$AbstractRunner.performAllBuildSteps(AbstractBuild.java:678)
	at hudson.maven.MavenModuleSetBuild$RunnerImpl.post2(MavenModuleSetBuild.java:998)
	at hudson.model.AbstractBuild$AbstractRunner.post(AbstractBuild.java:625)
	at hudson.model.Run.run(Run.java:1433)
	at hudson.maven.MavenModuleSetBuild.run(MavenModuleSetBuild.java:481)
	at hudson.model.ResourceController.execute(ResourceController.java:88)
	at hudson.model.Executor.run(Executor.java:238)
Caused by: org.apache.maven.wagon.TransferFailedException: Failed to transfer file: https://repository.apache.org/content/repositories/snapshots/org/apache/activemq/activemq-all/5.6-SNAPSHOT/activemq-all-5.6-SNAPSHOT.jar.
Return code is: 401, ReasonPhrase:Unauthorized.
	at org.apache.maven.wagon.shared.http4.AbstractHttpClientWagon.put(AbstractHttpClientWagon.java:562)
	at org.apache.maven.wagon.shared.http4.AbstractHttpClientWagon.put(AbstractHttpClientWagon.java:471)
	at org.apache.maven.wagon.shared.http4.AbstractHttpClientWagon.put(AbstractHttpClientWagon.java:451)
	at org.apache.maven.repository.legacy.DefaultWagonManager.putRemoteFile(DefaultWagonManager.java:543)
	at org.apache.maven.repository.legacy.DefaultWagonManager.putArtifact(DefaultWagonManager.java:494)
	at hudson.maven.artifact.deployer.DefaultArtifactDeployer.deploy(DefaultArtifactDeployer.java:160)
	... 11 more
[INFO] Deployment failed after 6.3 sec
Build step 'Deploy artifacts to Maven repository' changed build result to FAILURE


Mime
View raw message