activemq-dev mailing list archives

Site index · List index
Message view « Date » · « Thread »
Top « Date » · « Thread »
From Apache Jenkins Server <jenk...@builds.apache.org>
Subject Build failed in Jenkins: ActiveMQ-Trunk-Deploy #452
Date Fri, 06 Jan 2012 03:34:21 GMT
See <https://builds.apache.org/job/ActiveMQ-Trunk-Deploy/452/changes>

Changes:

[tabish] Update Javadoc for: https://issues.apache.org/jira/browse/AMQ-3652

[dejanb] https://issues.apache.org/jira/browse/AMQ-3653 - content-length in ack frames

------------------------------------------
[...truncated 23351 lines...]
[INFO] Unable to find resource 'org.mortbay.jetty:jetty-parent:pom:8' in repository dev.java.net
(http://download.java.net/maven/1)
Downloading: http://repository.springsource.com/maven/bundles/external/org/mortbay/jetty/jetty-parent/8/jetty-parent-8.pom
[INFO] Unable to find resource 'org.mortbay.jetty:jetty-parent:pom:8' in repository com.springsource.repository.bundles.external
(http://repository.springsource.com/maven/bundles/external)
Downloading: http://repo1.maven.org/maven2/org/mortbay/jetty/jetty-parent/8/jetty-parent-8.pom

Downloading: http://download.java.net/maven/1/org.eclipse.jetty/poms/jetty-parent-9.pom
[INFO] Unable to find resource 'org.eclipse.jetty:jetty-parent:pom:9' in repository dev.java.net
(http://download.java.net/maven/1)
Downloading: http://repository.springsource.com/maven/bundles/external/org/eclipse/jetty/jetty-parent/9/jetty-parent-9.pom
[INFO] Unable to find resource 'org.eclipse.jetty:jetty-parent:pom:9' in repository com.springsource.repository.bundles.external
(http://repository.springsource.com/maven/bundles/external)
Downloading: http://repo1.maven.org/maven2/org/eclipse/jetty/jetty-parent/9/jetty-parent-9.pom

Downloading: http://repository.springsource.com/maven/bundles/external/org/eclipse/jdt/core/compiler/ecj/3.5.1/ecj-3.5.1.pom
[INFO] Unable to find resource 'org.eclipse.jdt.core.compiler:ecj:pom:3.5.1' in repository
com.springsource.repository.bundles.external (http://repository.springsource.com/maven/bundles/external)
Downloading: http://download.java.net/maven/1/org.eclipse.jdt.core.compiler/poms/ecj-3.5.1.pom
[INFO] Unable to find resource 'org.eclipse.jdt.core.compiler:ecj:pom:3.5.1' in repository
dev.java.net (http://download.java.net/maven/1)
Downloading: http://download.java.net/maven/2/org/eclipse/jdt/core/compiler/ecj/3.5.1/ecj-3.5.1.pom
[INFO] Unable to find resource 'org.eclipse.jdt.core.compiler:ecj:pom:3.5.1' in repository
java.net (http://download.java.net/maven/2)
Downloading: http://download.java.net/maven/1/org.eclipse.jdt.core.compiler/poms/ecj-3.5.1.pom
[INFO] Unable to find resource 'org.eclipse.jdt.core.compiler:ecj:pom:3.5.1' in repository
m1.java.net (http://download.java.net/maven/1)
Downloading: http://repo1.maven.org/maven2/org/eclipse/jdt/core/compiler/ecj/3.5.1/ecj-3.5.1.pom

Downloading: http://repository.springsource.com/maven/bundles/external/org/mortbay/jetty/jsp-api-2.1-glassfish/2.1.v20100127/jsp-api-2.1-glassfish-2.1.v20100127.pom
[INFO] Unable to find resource 'org.mortbay.jetty:jsp-api-2.1-glassfish:pom:2.1.v20100127'
in repository com.springsource.repository.bundles.external (http://repository.springsource.com/maven/bundles/external)
Downloading: http://download.java.net/maven/1/org.mortbay.jetty/poms/jsp-api-2.1-glassfish-2.1.v20100127.pom
[INFO] Unable to find resource 'org.mortbay.jetty:jsp-api-2.1-glassfish:pom:2.1.v20100127'
in repository dev.java.net (http://download.java.net/maven/1)
Downloading: http://download.java.net/maven/2/org/mortbay/jetty/jsp-api-2.1-glassfish/2.1.v20100127/jsp-api-2.1-glassfish-2.1.v20100127.pom
[INFO] Unable to find resource 'org.mortbay.jetty:jsp-api-2.1-glassfish:pom:2.1.v20100127'
in repository java.net (http://download.java.net/maven/2)
Downloading: http://download.java.net/maven/1/org.mortbay.jetty/poms/jsp-api-2.1-glassfish-2.1.v20100127.pom
[INFO] Unable to find resource 'org.mortbay.jetty:jsp-api-2.1-glassfish:pom:2.1.v20100127'
in repository m1.java.net (http://download.java.net/maven/1)
Downloading: http://repo1.maven.org/maven2/org/mortbay/jetty/jsp-api-2.1-glassfish/2.1.v20100127/jsp-api-2.1-glassfish-2.1.v20100127.pom

Downloading: http://repository.springsource.com/maven/bundles/external/opensymphony/sitemesh/2.4.2/sitemesh-2.4.2.pom
[INFO] Unable to find resource 'opensymphony:sitemesh:pom:2.4.2' in repository com.springsource.repository.bundles.external
(http://repository.springsource.com/maven/bundles/external)
Downloading: http://repo1.maven.org/maven2/opensymphony/sitemesh/2.4.2/sitemesh-2.4.2.pom

Downloading: http://repository.springsource.com/maven/bundles/external/javax/servlet/jstl/1.1.2/jstl-1.1.2.pom
[INFO] Unable to find resource 'javax.servlet:jstl:pom:1.1.2' in repository com.springsource.repository.bundles.external
(http://repository.springsource.com/maven/bundles/external)
Downloading: http://repo1.maven.org/maven2/javax/servlet/jstl/1.1.2/jstl-1.1.2.pom

Downloading: http://repository.springsource.com/maven/bundles/external/taglibs/standard/1.1.2/standard-1.1.2.pom
[INFO] Unable to find resource 'taglibs:standard:pom:1.1.2' in repository com.springsource.repository.bundles.external
(http://repository.springsource.com/maven/bundles/external)
Downloading: http://repo1.maven.org/maven2/taglibs/standard/1.1.2/standard-1.1.2.pom

Downloading: http://repository.springsource.com/maven/bundles/external/org/mortbay/jetty/jsp-2.1-glassfish/2.1.v20100127/jsp-2.1-glassfish-2.1.v20100127.jar
Downloading: http://repository.springsource.com/maven/bundles/external/org/eclipse/jdt/core/compiler/ecj/3.5.1/ecj-3.5.1.jar
Downloading: http://repository.springsource.com/maven/bundles/external/taglibs/standard/1.1.2/standard-1.1.2.jar
Downloading: http://repository.springsource.com/maven/bundles/external/opensymphony/sitemesh/2.4.2/sitemesh-2.4.2.jar
Downloading: http://repository.springsource.com/maven/bundles/external/javax/servlet/jstl/1.1.2/jstl-1.1.2.jar
[INFO] Unable to find resource 'taglibs:standard:jar:1.1.2' in repository com.springsource.repository.bundles.external
(http://repository.springsource.com/maven/bundles/external)
Downloading: http://repo1.maven.org/maven2/taglibs/standard/1.1.2/standard-1.1.2.jar
[INFO] Unable to find resource 'org.eclipse.jdt.core.compiler:ecj:jar:3.5.1' in repository
com.springsource.repository.bundles.external (http://repository.springsource.com/maven/bundles/external)
Downloading: http://download.java.net/maven/1/org.eclipse.jdt.core.compiler/jars/ecj-3.5.1.jar
[INFO] Unable to find resource 'opensymphony:sitemesh:jar:2.4.2' in repository com.springsource.repository.bundles.external
(http://repository.springsource.com/maven/bundles/external)
Downloading: http://repo1.maven.org/maven2/opensymphony/sitemesh/2.4.2/sitemesh-2.4.2.jar
[INFO] Unable to find resource 'org.mortbay.jetty:jsp-2.1-glassfish:jar:2.1.v20100127' in
repository com.springsource.repository.bundles.external (http://repository.springsource.com/maven/bundles/external)
Downloading: http://repo1.maven.org/maven2/org/mortbay/jetty/jsp-2.1-glassfish/2.1.v20100127/jsp-2.1-glassfish-2.1.v20100127.jar
[INFO] Unable to find resource 'javax.servlet:jstl:jar:1.1.2' in repository com.springsource.repository.bundles.external
(http://repository.springsource.com/maven/bundles/external)
Downloading: http://repo1.maven.org/maven2/javax/servlet/jstl/1.1.2/jstl-1.1.2.jar
[INFO] Unable to find resource 'org.eclipse.jdt.core.compiler:ecj:jar:3.5.1' in repository
dev.java.net (http://download.java.net/maven/1)
Downloading: http://download.java.net/maven/2/org/eclipse/jdt/core/compiler/ecj/3.5.1/ecj-3.5.1.jar
[INFO] Unable to find resource 'org.eclipse.jdt.core.compiler:ecj:jar:3.5.1' in repository
java.net (http://download.java.net/maven/2)
Downloading: http://download.java.net/maven/1/org.eclipse.jdt.core.compiler/jars/ecj-3.5.1.jar
[INFO] Unable to find resource 'org.eclipse.jdt.core.compiler:ecj:jar:3.5.1' in repository
m1.java.net (http://download.java.net/maven/1)
Downloading: http://repo1.maven.org/maven2/org/eclipse/jdt/core/compiler/ecj/3.5.1/ecj-3.5.1.jar



Downloading: http://repository.apache.org/snapshots/org/apache/activemq/activemq-core/5.6-SNAPSHOT/activemq-core-5.6-SNAPSHOT.jar
Downloading: http://repository.apache.org/snapshots/org/apache/activemq/kahadb/5.6-SNAPSHOT/kahadb-5.6-SNAPSHOT.jar

Downloading: http://repository.apache.org/snapshots/org/apache/activemq/activemq-camel/5.6-SNAPSHOT/activemq-camel-5.6-SNAPSHOT.jar
Downloading: http://repository.apache.org/snapshots/org/apache/activemq/activemq-pool/5.6-SNAPSHOT/activemq-pool-5.6-SNAPSHOT.jar
Downloading: http://repository.apache.org/snapshots/org/apache/activemq/activemq-console/5.6-SNAPSHOT/activemq-console-5.6-SNAPSHOT.jar

Downloading: http://repository.springsource.com/maven/bundles/external/org/mortbay/jetty/jsp-api-2.1-glassfish/2.1.v20100127/jsp-api-2.1-glassfish-2.1.v20100127.jar
[INFO] Unable to find resource 'org.mortbay.jetty:jsp-api-2.1-glassfish:jar:2.1.v20100127'
in repository com.springsource.repository.bundles.external (http://repository.springsource.com/maven/bundles/external)
Downloading: http://download.java.net/maven/1/org.mortbay.jetty/jars/jsp-api-2.1-glassfish-2.1.v20100127.jar
[INFO] Unable to find resource 'org.mortbay.jetty:jsp-api-2.1-glassfish:jar:2.1.v20100127'
in repository dev.java.net (http://download.java.net/maven/1)
Downloading: http://download.java.net/maven/2/org/mortbay/jetty/jsp-api-2.1-glassfish/2.1.v20100127/jsp-api-2.1-glassfish-2.1.v20100127.jar
[INFO] Unable to find resource 'org.mortbay.jetty:jsp-api-2.1-glassfish:jar:2.1.v20100127'
in repository java.net (http://download.java.net/maven/2)
Downloading: http://download.java.net/maven/1/org.mortbay.jetty/jars/jsp-api-2.1-glassfish-2.1.v20100127.jar
[INFO] Unable to find resource 'org.mortbay.jetty:jsp-api-2.1-glassfish:jar:2.1.v20100127'
in repository m1.java.net (http://download.java.net/maven/1)
Downloading: http://repo1.maven.org/maven2/org/mortbay/jetty/jsp-api-2.1-glassfish/2.1.v20100127/jsp-api-2.1-glassfish-2.1.v20100127.jar

[INFO] [enforcer:enforce {execution: default}]
[INFO] [bundle:cleanVersions {execution: cleanVersions}]
[INFO] [remote-resources:process {execution: default}]
Downloading: http://repository.apache.org/snapshots/org/apache/activemq/kahadb/5.6-SNAPSHOT/kahadb-5.6-SNAPSHOT.jar
Downloading: http://repository.apache.org/snapshots/org/apache/activemq/activemq-camel/5.6-SNAPSHOT/activemq-camel-5.6-SNAPSHOT.jar
Downloading: http://repository.apache.org/snapshots/org/apache/activemq/activemq-pool/5.6-SNAPSHOT/activemq-pool-5.6-SNAPSHOT.jar
[INFO] [resources:resources {execution: default-resources}]
[INFO] Using 'UTF-8' encoding to copy filtered resources.
[INFO] Copying 1 resource
[INFO] Copying 3 resources
Downloading: http://repository.apache.org/snapshots/org/apache/activemq/kahadb/5.6-SNAPSHOT/kahadb-5.6-SNAPSHOT.jar
Downloading: http://repository.apache.org/snapshots/org/apache/activemq/activemq-camel/5.6-SNAPSHOT/activemq-camel-5.6-SNAPSHOT.jar
Downloading: http://repository.apache.org/snapshots/org/apache/activemq/activemq-pool/5.6-SNAPSHOT/activemq-pool-5.6-SNAPSHOT.jar
[INFO] [compiler:compile {execution: default-compile}]
[INFO] Compiling 13 source files to <https://builds.apache.org/job/ActiveMQ-Trunk-Deploy/ws/deploy/activemq-web-console/target/classes>
Downloading: http://repository.apache.org/snapshots/org/apache/activemq/kahadb/5.6-SNAPSHOT/kahadb-5.6-SNAPSHOT.jar
Downloading: http://repository.apache.org/snapshots/org/apache/activemq/activemq-camel/5.6-SNAPSHOT/activemq-camel-5.6-SNAPSHOT.jar
Downloading: http://repository.apache.org/snapshots/org/apache/activemq/activemq-pool/5.6-SNAPSHOT/activemq-pool-5.6-SNAPSHOT.jar
[INFO] [bundle:manifest {execution: bundle-manifest}]
[INFO] [resources:testResources {execution: default-testResources}]
[INFO] Using 'UTF-8' encoding to copy filtered resources.
[INFO] skip non existing resourceDirectory <https://builds.apache.org/job/ActiveMQ-Trunk-Deploy/ws/deploy/activemq-web-console/src/test/resources>
[INFO] Copying 3 resources
Downloading: http://repository.apache.org/snapshots/org/apache/activemq/kahadb/5.6-SNAPSHOT/kahadb-5.6-SNAPSHOT.jar
Downloading: http://repository.apache.org/snapshots/org/apache/activemq/activemq-camel/5.6-SNAPSHOT/activemq-camel-5.6-SNAPSHOT.jar
Downloading: http://repository.apache.org/snapshots/org/apache/activemq/activemq-pool/5.6-SNAPSHOT/activemq-pool-5.6-SNAPSHOT.jar
[INFO] [compiler:testCompile {execution: default-testCompile}]
[INFO] Compiling 1 source file to <https://builds.apache.org/job/ActiveMQ-Trunk-Deploy/ws/deploy/activemq-web-console/target/test-classes>
[JENKINS] Archiving <https://builds.apache.org/job/ActiveMQ-Trunk-Deploy/ws/deploy/activemq-web-console/pom.xml>
to /home/hudson/hudson/jobs/ActiveMQ-Trunk-Deploy/modules/org.apache.activemq$activemq-web-console/builds/2012-01-06_03-06-05/archive/org.apache.activemq/activemq-web-console/5.6-SNAPSHOT/activemq-web-console-5.6-SNAPSHOT.pom
[INFO] ------------------------------------------------------------------------
[INFO] SKIPPING ActiveMQ :: Assembly
[INFO]    task-segment: [clean, deploy]
[INFO] This project has been banned from further executions due to previous failures.
[INFO] ------------------------------------------------------------------------
[INFO] 
[INFO] 
[INFO] ------------------------------------------------------------------------
[INFO] Reactor Summary:
[INFO] ------------------------------------------------------------------------
[INFO] ActiveMQ .............................................. SUCCESS [3:27.493s]
[INFO] ActiveMQ :: KahaDB .................................... SUCCESS [42.852s]
[INFO] ActiveMQ :: JAAS ...................................... SUCCESS [1:17.361s]
[INFO] Openwire Generator .................................... SUCCESS [28.257s]
[INFO] ActiveMQ :: jmdns 1.0 ................................. SUCCESS [11.112s]
[INFO] ActiveMQ :: Core ...................................... SUCCESS [3:38.454s]
[INFO] ActiveMQ :: RA ........................................ SUCCESS [22.925s]
[INFO] ActiveMQ :: Pool ...................................... SUCCESS [16.174s]
[INFO] ActiveMQ :: Spring .................................... SUCCESS [29.151s]
[INFO] ActiveMQ :: Camel ..................................... SUCCESS [1:12.801s]
[INFO] ActiveMQ :: Console ................................... SUCCESS [26.735s]
[INFO] ActiveMQ :: Optional .................................. SUCCESS [1:21.403s]
[INFO] ActiveMQ :: Jar Bundle ................................ SUCCESS [48.799s]
[INFO] ActiveMQ :: File Server ............................... SUCCESS [27.425s]
[INFO] ActiveMQ :: Blueprint ................................. SUCCESS [17.533s]
[INFO] ActiveMQ :: Apache Karaf .............................. SUCCESS [3:15.613s]
[INFO] ActiveMQ :: RAR ....................................... SUCCESS [56.749s]
[INFO] ActiveMQ :: Run Jar ................................... SUCCESS [5.672s]
[INFO] ActiveMQ Tooling ...................................... SUCCESS [2.832s]
[INFO] ActiveMQ :: Memory Usage Test Plugin .................. SUCCESS [34.601s]
[INFO] ActiveMQ :: Performance Test Plugin ................... SUCCESS [17.365s]
[INFO] ActiveMQ :: StartUp Plugin ............................ SUCCESS [18.582s]
[INFO] ActiveMQ :: Web ....................................... SUCCESS [21.390s]
[INFO] ActiveMQ :: Web Demo .................................. SUCCESS [1:25.337s]
[INFO] ActiveMQ :: XMPP ...................................... SUCCESS [33.109s]
[INFO] ActiveMQ :: Web Console ............................... FAILED [28.179s]
[INFO] ActiveMQ :: Assembly .................................. SKIPPED (dependency build failed
or was skipped)
[INFO] ------------------------------------------------------------------------
[INFO] Error for project: ActiveMQ :: Web Console (during deploy)
[INFO] ------------------------------------------------------------------------
[INFO] Fatal error compiling

Embedded error: Error while executing the compiler.
PermGen space
[INFO] ------------------------------------------------------------------------
[INFO] Trace
org.apache.maven.lifecycle.LifecycleExecutionException: Fatal error compiling
	at org.apache.maven.lifecycle.DefaultLifecycleExecutor.executeGoals(DefaultLifecycleExecutor.java:719)
	at org.apache.maven.lifecycle.DefaultLifecycleExecutor.executeGoalWithLifecycle(DefaultLifecycleExecutor.java:556)
	at org.apache.maven.lifecycle.DefaultLifecycleExecutor.executeGoal(DefaultLifecycleExecutor.java:535)
	at org.apache.maven.lifecycle.DefaultLifecycleExecutor.executeGoalAndHandleFailures(DefaultLifecycleExecutor.java:387)
	at org.apache.maven.lifecycle.DefaultLifecycleExecutor.executeTaskSegments(DefaultLifecycleExecutor.java:348)
	at org.apache.maven.lifecycle.DefaultLifecycleExecutor.execute(DefaultLifecycleExecutor.java:180)
	at org.apache.maven.lifecycle.LifecycleExecutorInterceptor.execute(LifecycleExecutorInterceptor.java:65)
	at org.apache.maven.DefaultMaven.doExecute(DefaultMaven.java:328)
	at org.apache.maven.DefaultMaven.execute(DefaultMaven.java:138)
	at org.apache.maven.cli.MavenCli.main(MavenCli.java:362)
	at sun.reflect.NativeMethodAccessorImpl.invoke0(Native Method)
	at sun.reflect.NativeMethodAccessorImpl.invoke(NativeMethodAccessorImpl.java:39)
	at sun.reflect.DelegatingMethodAccessorImpl.invoke(DelegatingMethodAccessorImpl.java:25)
	at java.lang.reflect.Method.invoke(Method.java:597)
	at org.codehaus.classworlds.Launcher.launchEnhanced(Launcher.java:315)
	at org.codehaus.classworlds.Launcher.launch(Launcher.java:255)
	at hudson.maven.agent.Main.launch(Main.java:185)
	at hudson.maven.MavenBuilder.call(MavenBuilder.java:151)
	at hudson.maven.Maven2Builder.call(Maven2Builder.java:77)
	at hudson.maven.Maven2Builder.call(Maven2Builder.java:53)
	at hudson.remoting.UserRequest.perform(UserRequest.java:118)
	at hudson.remoting.UserRequest.perform(UserRequest.java:48)
	at hudson.remoting.Request$2.run(Request.java:287)
	at java.util.concurrent.Executors$RunnableAdapter.call(Executors.java:441)
	at java.util.concurrent.FutureTask$Sync.innerRun(FutureTask.java:303)
	at java.util.concurrent.FutureTask.run(FutureTask.java:138)
	at java.util.concurrent.ThreadPoolExecutor$Worker.runTask(ThreadPoolExecutor.java:886)
	at java.util.concurrent.ThreadPoolExecutor$Worker.run(ThreadPoolExecutor.java:908)
	at java.lang.Thread.run(Thread.java:662)
Caused by: org.apache.maven.plugin.MojoExecutionException: Fatal error compiling
	at org.apache.maven.plugin.AbstractCompilerMojo.execute(AbstractCompilerMojo.java:610)
	at org.apache.maven.plugin.TestCompilerMojo.execute(TestCompilerMojo.java:161)
	at org.apache.maven.plugin.DefaultPluginManager.executeMojo(DefaultPluginManager.java:490)
	at hudson.maven.agent.PluginManagerInterceptor.executeMojo(PluginManagerInterceptor.java:182)
	at org.apache.maven.lifecycle.DefaultLifecycleExecutor.executeGoals(DefaultLifecycleExecutor.java:694)
	... 28 more
Caused by: org.codehaus.plexus.compiler.CompilerException: Error while executing the compiler.
	at org.codehaus.plexus.compiler.javac.JavacCompiler.compileInProcess(JavacCompiler.java:568)
	at org.codehaus.plexus.compiler.javac.JavacCompiler.compile(JavacCompiler.java:161)
	at org.apache.maven.plugin.AbstractCompilerMojo.execute(AbstractCompilerMojo.java:605)
	... 32 more
Caused by: java.lang.reflect.InvocationTargetException
	at sun.reflect.NativeMethodAccessorImpl.invoke0(Native Method)
	at sun.reflect.NativeMethodAccessorImpl.invoke(NativeMethodAccessorImpl.java:39)
	at sun.reflect.DelegatingMethodAccessorImpl.invoke(DelegatingMethodAccessorImpl.java:25)
	at java.lang.reflect.Method.invoke(Method.java:597)
	at org.codehaus.plexus.compiler.javac.JavacCompiler.compileInProcess(JavacCompiler.java:554)
	... 34 more
Caused by: java.lang.OutOfMemoryError: PermGen space
	at java.lang.ClassLoader.defineClass1(Native Method)
	at java.lang.ClassLoader.defineClassCond(ClassLoader.java:631)
	at java.lang.ClassLoader.defineClass(ClassLoader.java:615)
	at java.security.SecureClassLoader.defineClass(SecureClassLoader.java:141)
	at java.net.URLClassLoader.defineClass(URLClassLoader.java:283)
	at java.net.URLClassLoader.access$000(URLClassLoader.java:58)
	at java.net.URLClassLoader$1.run(URLClassLoader.java:197)
	at java.security.AccessController.doPrivileged(Native Method)
	at java.net.URLClassLoader.findClass(URLClassLoader.java:190)
	at org.codehaus.plexus.compiler.javac.IsolatedClassLoader.loadClass(IsolatedClassLoader.java:56)
	at java.util.ResourceBundle$Control.newBundle(ResourceBundle.java:2289)
	at java.util.ResourceBundle.loadBundle(ResourceBundle.java:1364)
	at java.util.ResourceBundle.findBundle(ResourceBundle.java:1328)
	at java.util.ResourceBundle.findBundle(ResourceBundle.java:1282)
	at java.util.ResourceBundle.findBundle(ResourceBundle.java:1282)
	at java.util.ResourceBundle.getBundleImpl(ResourceBundle.java:1224)
	at java.util.ResourceBundle.getBundle(ResourceBundle.java:705)
	at com.sun.tools.javac.util.Messages.add(Messages.java:66)
	at com.sun.tools.javac.util.Messages.<init>(Messages.java:52)
	at com.sun.tools.javac.main.Main.getLocalizedString(Main.java:447)
	at com.sun.tools.javac.main.Main.resourceMessage(Main.java:421)
	at com.sun.tools.javac.main.Main.compile(Main.java:364)
	at com.sun.tools.javac.main.Main.compile(Main.java:279)
	at com.sun.tools.javac.main.Main.compile(Main.java:270)
	at com.sun.tools.javac.Main.compile(Main.java:87)
	at sun.reflect.NativeMethodAccessorImpl.invoke0(Native Method)
	at sun.reflect.NativeMethodAccessorImpl.invoke(NativeMethodAccessorImpl.java:39)
	at sun.reflect.DelegatingMethodAccessorImpl.invoke(DelegatingMethodAccessorImpl.java:25)
	at java.lang.reflect.Method.invoke(Method.java:597)
	at org.codehaus.plexus.compiler.javac.JavacCompiler.compileInProcess(JavacCompiler.java:554)
	at org.codehaus.plexus.compiler.javac.JavacCompiler.compile(JavacCompiler.java:161)
	at org.apache.maven.plugin.AbstractCompilerMojo.execute(AbstractCompilerMojo.java:605)
[INFO] ------------------------------------------------------------------------
[INFO] BUILD ERRORS
[INFO] ------------------------------------------------------------------------
[INFO] Total time: 27 minutes 46 seconds
[INFO] Finished at: Fri Jan 06 03:34:19 UTC 2012
[INFO] Final Memory: 120M/1783M
[INFO] ------------------------------------------------------------------------
channel stopped


Mime
View raw message