activemq-dev mailing list archives

Site index · List index
Message view « Date » · « Thread »
Top « Date » · « Thread »
From Apache Jenkins Server <jenk...@builds.apache.org>
Subject Build failed in Jenkins: ActiveMQ #761
Date Sat, 17 Sep 2011 10:00:59 GMT
See <https://builds.apache.org/job/ActiveMQ/761/changes>

Changes:

[tabish] fixes for https://issues.apache.org/jira/browse/AMQ-3467

------------------------------------------
[...truncated 9320 lines...]
Tests run: 1, Failures: 0, Errors: 0, Skipped: 0, Time elapsed: 0.185 sec
Running org.apache.activemq.openwire.v7.ReplayCommandTest
Tests run: 1, Failures: 0, Errors: 0, Skipped: 0, Time elapsed: 0.187 sec
Running org.apache.activemq.openwire.v7.LastPartialCommandTest
Tests run: 1, Failures: 0, Errors: 0, Skipped: 0, Time elapsed: 0.185 sec
Running org.apache.activemq.openwire.v7.JournalQueueAckTest
Tests run: 1, Failures: 0, Errors: 0, Skipped: 0, Time elapsed: 0.218 sec
Running org.apache.activemq.openwire.v7.ControlCommandTest
Tests run: 1, Failures: 0, Errors: 0, Skipped: 0, Time elapsed: 0.186 sec
Running org.apache.activemq.openwire.v7.XATransactionIdTest
Tests run: 1, Failures: 0, Errors: 0, Skipped: 0, Time elapsed: 0.184 sec
Running org.apache.activemq.openwire.v7.ShutdownInfoTest
Tests run: 1, Failures: 0, Errors: 0, Skipped: 0, Time elapsed: 0.186 sec
Running org.apache.activemq.openwire.NumberRangesWhileMarshallingTest
Tests run: 2, Failures: 0, Errors: 0, Skipped: 0, Time elapsed: 0.181 sec
Running org.apache.activemq.spring.ActiveMQConnectionFactoryFactoryBeanTest
Tests run: 6, Failures: 0, Errors: 0, Skipped: 0, Time elapsed: 0.129 sec
Running org.apache.activemq.spring.Spring2XmlNamespacesWithoutRemoteSchemaTest
Tests run: 1, Failures: 0, Errors: 0, Skipped: 0, Time elapsed: 4.986 sec
Running org.apache.activemq.spring.Spring2XmlNamespacesTest
Tests run: 1, Failures: 0, Errors: 0, Skipped: 0, Time elapsed: 5.034 sec
Running org.apache.activemq.spring.SpringTest
Tests run: 7, Failures: 0, Errors: 0, Skipped: 0, Time elapsed: 15.984 sec
Running org.apache.activemq.kaha.LoadTest
Tests run: 1, Failures: 0, Errors: 0, Skipped: 0, Time elapsed: 51.359 sec
Running org.apache.activemq.kaha.ListContainerTest
Tests run: 22, Failures: 0, Errors: 0, Skipped: 0, Time elapsed: 1.037 sec
Running org.apache.activemq.kaha.impl.index.DiskIndexLinkedListTest
Tests run: 17, Failures: 0, Errors: 0, Skipped: 0, Time elapsed: 0.186 sec
Running org.apache.activemq.kaha.impl.index.hash.HashTest
Tests run: 1, Failures: 0, Errors: 0, Skipped: 0, Time elapsed: 4.509 sec
Running org.apache.activemq.kaha.impl.index.tree.TreeTest
Tests run: 2, Failures: 0, Errors: 0, Skipped: 0, Time elapsed: 0.141 sec
Running org.apache.activemq.kaha.impl.index.VMIndexLinkedListTest
Tests run: 17, Failures: 0, Errors: 0, Skipped: 0, Time elapsed: 0.038 sec
Running org.apache.activemq.kaha.impl.async.DataFileAppenderTest
Tests run: 5, Failures: 0, Errors: 0, Skipped: 0, Time elapsed: 0.922 sec
Running org.apache.activemq.kaha.impl.async.NioDataFileAppenderTest
Tests run: 5, Failures: 0, Errors: 0, Skipped: 0, Time elapsed: 0.866 sec
Running org.apache.activemq.kaha.impl.async.LocationTest
Tests run: 1, Failures: 0, Errors: 0, Skipped: 0, Time elapsed: 0.102 sec
Running org.apache.activemq.kaha.impl.async.JournalImplTest
Tests run: 4, Failures: 0, Errors: 0, Skipped: 0, Time elapsed: 0.279 sec
Running org.apache.activemq.kaha.MapContainerTest
Tests run: 14, Failures: 0, Errors: 0, Skipped: 0, Time elapsed: 1.235 sec
Running org.apache.activemq.kaha.StoreTest
Tests run: 8, Failures: 0, Errors: 0, Skipped: 0, Time elapsed: 1.594 sec
Running org.apache.activemq.kaha.VolumeTest
Tests run: 1, Failures: 0, Errors: 0, Skipped: 0, Time elapsed: 0.856 sec
Running org.apache.activemq.JMSExclusiveConsumerTest
Tests run: 5, Failures: 0, Errors: 0, Skipped: 0, Time elapsed: 6.155 sec
Running org.apache.activemq.JmsQueueBrowserTest
Tests run: 4, Failures: 0, Errors: 0, Skipped: 0, Time elapsed: 2.185 sec
Running org.apache.activemq.LargeStreamletTest
Tests run: 1, Failures: 0, Errors: 0, Skipped: 0, Time elapsed: 1.541 sec
Running org.apache.activemq.config.BrokerPropertiesTest
Tests run: 2, Failures: 0, Errors: 0, Skipped: 0, Time elapsed: 0.371 sec
Running org.apache.activemq.config.BrokerXmlConfigTest
Tests run: 1, Failures: 0, Errors: 0, Skipped: 0, Time elapsed: 2.122 sec
Running org.apache.activemq.config.BrokerXmlConfigFromJNDITest
Tests run: 1, Failures: 0, Errors: 0, Skipped: 0, Time elapsed: 3.024 sec
Running org.apache.activemq.config.ConfigTest
Tests run: 8, Failures: 0, Errors: 0, Skipped: 0, Time elapsed: 31.568 sec
Running org.apache.activemq.JmsTopicCompositeSendReceiveTest
Tests run: 1, Failures: 0, Errors: 0, Skipped: 0, Time elapsed: 1.671 sec
Running org.apache.activemq.thread.PooledTaskRunnerTest
Tests run: 3, Failures: 0, Errors: 0, Skipped: 0, Time elapsed: 0.161 sec
Running org.apache.activemq.thread.TaskRunnerTest
Tests run: 2, Failures: 0, Errors: 0, Skipped: 0, Time elapsed: 0.423 sec
Running org.apache.activemq.RemoveDestinationTest
Tests run: 2, Failures: 0, Errors: 0, Skipped: 0, Time elapsed: 21.365 sec
Running org.apache.activemq.JmsQueueTransactionTest
Tests run: 17, Failures: 0, Errors: 0, Skipped: 0, Time elapsed: 22.647 sec
Running org.apache.activemq.JmsDurableTopicSelectorTest
Tests run: 3, Failures: 0, Errors: 0, Skipped: 0, Time elapsed: 8.742 sec
Running org.apache.activemq.JmsTopicSendReceiveWithTwoConnectionsWithJMXTest
Tests run: 1, Failures: 0, Errors: 0, Skipped: 0, Time elapsed: 0.683 sec
Running org.apache.activemq.ActiveMQXAConnectionFactoryTest
Tests run: 12, Failures: 0, Errors: 0, Skipped: 0, Time elapsed: 9.283 sec
Running org.apache.activemq.JmsSessionRecoverTest
Tests run: 6, Failures: 0, Errors: 0, Skipped: 0, Time elapsed: 7.003 sec
Running org.apache.activemq.usecases.NewConsumerCreatesDestinationTest
Tests run: 1, Failures: 0, Errors: 0, Skipped: 0, Time elapsed: 0.628 sec
Running org.apache.activemq.usecases.DurableSubscriptionOfflineTest
Tests run: 30, Failures: 2, Errors: 0, Skipped: 0, Time elapsed: 245.308 sec <<<
FAILURE!
Running org.apache.activemq.usecases.TwoBrokerTopicSendReceiveUsingTcpTest
Tests run: 1, Failures: 0, Errors: 0, Skipped: 0, Time elapsed: 10.724 sec
Running org.apache.activemq.usecases.MessageReroutingTest
Tests run: 2, Failures: 0, Errors: 0, Skipped: 0, Time elapsed: 25.628 sec
Running org.apache.activemq.usecases.DurableSubProcessWithRestartTest
Tests run: 1, Failures: 0, Errors: 0, Skipped: 1, Time elapsed: 0.068 sec
Running org.apache.activemq.usecases.DurableConsumerCloseAndReconnectTcpTest
Tests run: 2, Failures: 0, Errors: 0, Skipped: 0, Time elapsed: 33.588 sec
Running org.apache.activemq.usecases.ThreeBrokerVirtualTopicNetworkAMQPATest
Tests run: 1, Failures: 0, Errors: 0, Skipped: 0, Time elapsed: 29.176 sec
Running org.apache.activemq.usecases.ThreeBrokerTopicNetworkUsingTcpTest
Tests run: 9, Failures: 0, Errors: 0, Skipped: 0, Time elapsed: 86.764 sec
Running org.apache.activemq.usecases.TwoMulticastDiscoveryBrokerTopicSendReceiveTest
Tests run: 1, Failures: 0, Errors: 0, Skipped: 0, Time elapsed: 19.27 sec
Running org.apache.activemq.usecases.JMXRemoveQueueThenSendIgnoredTest
Tests run: 2, Failures: 0, Errors: 0, Skipped: 0, Time elapsed: 8.543 sec
Running org.apache.activemq.usecases.StartAndStopBrokerTest
Tests run: 1, Failures: 0, Errors: 0, Skipped: 0, Time elapsed: 6.144 sec
Running org.apache.activemq.usecases.ObjectMessageNotSerializableTest
Tests run: 2, Failures: 0, Errors: 0, Skipped: 0, Time elapsed: 4.382 sec
Running org.apache.activemq.usecases.QueueRepeaterTest
Tests run: 1, Failures: 0, Errors: 0, Skipped: 0, Time elapsed: 0.626 sec
Running org.apache.activemq.usecases.JournalDurableSubscriptionTest
Tests run: 10, Failures: 0, Errors: 0, Skipped: 0, Time elapsed: 56.433 sec
Running org.apache.activemq.usecases.JDBCDurableSubscriptionTest
Tests run: 10, Failures: 0, Errors: 0, Skipped: 0, Time elapsed: 49.136 sec
Running org.apache.activemq.usecases.ConcurrentDestinationCreationTest
Tests run: 1, Failures: 0, Errors: 0, Skipped: 0, Time elapsed: 6.423 sec
Running org.apache.activemq.usecases.ConcurrentProducerDurableConsumerTest
Tests run: 2, Failures: 0, Errors: 0, Skipped: 0, Time elapsed: 255.917 sec
Running org.apache.activemq.usecases.PublishOnQueueConsumedMessageUsingActivemqXMLTest
Tests run: 1, Failures: 0, Errors: 0, Skipped: 0, Time elapsed: 8.873 sec
Running org.apache.activemq.usecases.CreateTemporaryQueueBeforeStartTest
Tests run: 3, Failures: 0, Errors: 0, Skipped: 0, Time elapsed: 6.701 sec
Running org.apache.activemq.usecases.TwoBrokerMessageNotSentToRemoteWhenNoConsumerTest
Tests run: 3, Failures: 0, Errors: 0, Skipped: 0, Time elapsed: 22.386 sec
Running org.apache.activemq.usecases.TransactionRollbackOrderTest
Tests run: 1, Failures: 0, Errors: 0, Skipped: 0, Time elapsed: 1.635 sec
Running org.apache.activemq.usecases.PublishOnTemporaryQueueConsumedMessageTest
Tests run: 1, Failures: 0, Errors: 0, Skipped: 0, Time elapsed: 1.682 sec
Running org.apache.activemq.usecases.ExpiredMessagesTest
Tests run: 3, Failures: 0, Errors: 0, Skipped: 0, Time elapsed: 39.126 sec
Running org.apache.activemq.usecases.DispatchMultipleConsumersTest
Tests run: 1, Failures: 0, Errors: 0, Skipped: 0, Time elapsed: 309.121 sec
Running org.apache.activemq.usecases.DurableSubscriptionUnsubscribeTest
Tests run: 6, Failures: 0, Errors: 0, Skipped: 0, Time elapsed: 65.568 sec
Running org.apache.activemq.usecases.AMQ2927Test
Tests run: 2, Failures: 0, Errors: 0, Skipped: 0, Time elapsed: 40.051 sec
Running org.apache.activemq.usecases.PublishOnQueueConsumedMessageTest
Tests run: 1, Failures: 0, Errors: 0, Skipped: 0, Time elapsed: 1.674 sec
Running org.apache.activemq.usecases.MultiBrokersMultiClientsTest
Tests run: 2, Failures: 0, Errors: 0, Skipped: 0, Time elapsed: 31.456 sec
Running org.apache.activemq.usecases.DurableSubscriberWithNetworkDisconnectTest
Tests run: 2, Failures: 0, Errors: 0, Skipped: 0, Time elapsed: 282.178 sec
Running org.apache.activemq.usecases.ConsumeUncompressedCompressedMessageTest
Tests run: 2, Failures: 0, Errors: 0, Skipped: 0, Time elapsed: 4.55 sec
Running org.apache.activemq.usecases.TwoBrokerQueueClientsReconnectTest
Tests run: 9, Failures: 0, Errors: 0, Skipped: 0, Time elapsed: 66.561 sec
Running org.apache.activemq.usecases.DurableSubscriptionActivationTest
Tests run: 1, Failures: 0, Errors: 0, Skipped: 0, Time elapsed: 1.151 sec
Running org.apache.activemq.usecases.SingleBrokerVirtualDestinationsWithWildcardTest
Tests run: 4, Failures: 0, Errors: 0, Skipped: 0, Time elapsed: 47.956 sec
Running org.apache.activemq.usecases.KahaDBDurableSubscriptionTest
Tests run: 10, Failures: 0, Errors: 0, Skipped: 0, Time elapsed: 34.534 sec
Running org.apache.activemq.usecases.DurableSubscriptionRemoveOfflineTest
Tests run: 1, Failures: 0, Errors: 0, Skipped: 0, Time elapsed: 7.58 sec
Running org.apache.activemq.usecases.TransactionTest
Tests run: 1, Failures: 0, Errors: 0, Skipped: 0, Time elapsed: 0.629 sec
Running org.apache.activemq.usecases.BrokerQueueNetworkWithDisconnectTest
Tests run: 4, Failures: 0, Errors: 0, Skipped: 0, Time elapsed: 94.565 sec
Running org.apache.activemq.usecases.PublishOnTopicConsumedMessageTest
Tests run: 1, Failures: 0, Errors: 0, Skipped: 0, Time elapsed: 1.639 sec
Running org.apache.activemq.usecases.TopicReplicationTest
Tests run: 1, Failures: 0, Errors: 0, Skipped: 0, Time elapsed: 11.389 sec
Running org.apache.activemq.usecases.DurableSubscriptionReactivationTest
Tests run: 2, Failures: 0, Errors: 0, Skipped: 0, Time elapsed: 7.253 sec
Running org.apache.activemq.usecases.TwoBrokerNetworkConnectorWildcardDynamicallyIncludedDestinationTest
Tests run: 4, Failures: 0, Errors: 0, Skipped: 0, Time elapsed: 54.117 sec
Running org.apache.activemq.usecases.AuthorizationFromAdminViewTest
Tests run: 1, Failures: 0, Errors: 0, Skipped: 0, Time elapsed: 0.515 sec
Running org.apache.activemq.usecases.NetworkAsyncStartTest
Tests run: 2, Failures: 0, Errors: 0, Skipped: 0, Time elapsed: 9.554 sec
Running org.apache.activemq.usecases.QueueRedeliverTest
Tests run: 4, Failures: 0, Errors: 0, Skipped: 0, Time elapsed: 24.8 sec
Running org.apache.activemq.usecases.ConsumeTopicPrefetchTest
Tests run: 3, Failures: 0, Errors: 0, Skipped: 0, Time elapsed: 0.883 sec
Running org.apache.activemq.usecases.ChangeSessionDeliveryModeTest
Tests run: 1, Failures: 0, Errors: 0, Skipped: 0, Time elapsed: 0.568 sec
Running org.apache.activemq.usecases.LargeQueueSparseDeleteTest
Tests run: 3, Failures: 0, Errors: 0, Skipped: 0, Time elapsed: 6.506 sec
Running org.apache.activemq.usecases.DurableConsumerCloseAndReconnectTest
Tests run: 1, Failures: 0, Errors: 0, Skipped: 0, Time elapsed: 16.544 sec
Running org.apache.activemq.usecases.PublishOnQueueConsumedMessageInTransactionTest
Tests run: 1, Failures: 0, Errors: 0, Skipped: 0, Time elapsed: 6.297 sec
Running org.apache.activemq.usecases.CreateLotsOfTemporaryQueuesTest
Tests run: 1, Failures: 0, Errors: 0, Skipped: 0, Time elapsed: 12.27 sec
Running org.apache.activemq.usecases.BrowseOverNetworkTest
Tests run: 3, Failures: 0, Errors: 0, Skipped: 0, Time elapsed: 49.884 sec
Running org.apache.activemq.usecases.QueueDuplicatesTest
Tests run: 1, Failures: 0, Errors: 0, Skipped: 0, Time elapsed: 26.503 sec
Running org.apache.activemq.usecases.MessageGroupCloseTest
Tests run: 1, Failures: 0, Errors: 0, Skipped: 0, Time elapsed: 5.537 sec
Running org.apache.activemq.usecases.ThreeBrokerVirtualTopicNetworkTest
Tests run: 1, Failures: 0, Errors: 0, Skipped: 0, Time elapsed: 30.383 sec
Running org.apache.activemq.usecases.UnlimitedEnqueueTest
Build timed out (after 575 minutes). Marking the build as aborted.
[locks-and-latches] Releasing all the locks
[locks-and-latches] All the locks released
ERROR: Failed to parse POMs
hudson.remoting.ChannelClosedException: channel is already closed
	at hudson.remoting.Channel.send(Channel.java:486)
	at hudson.remoting.ProxyOutputStream._write(ProxyOutputStream.java:123)
	at hudson.remoting.ProxyOutputStream.write(ProxyOutputStream.java:103)
	at hudson.remoting.RemoteOutputStream.write(RemoteOutputStream.java:110)
	at java.io.BufferedOutputStream.flushBuffer(BufferedOutputStream.java:65)
	at java.io.BufferedOutputStream.flush(BufferedOutputStream.java:123)
	at java.io.BufferedOutputStream.flush(BufferedOutputStream.java:124)
	at java.io.ObjectOutputStream$BlockDataOutputStream.flush(ObjectOutputStream.java:1793)
	at java.io.ObjectOutputStream.flush(ObjectOutputStream.java:699)
	at hudson.remoting.Channel.send(Channel.java:492)
	at hudson.remoting.Request.call(Request.java:161)
	at hudson.remoting.Channel.call(Channel.java:668)
	at hudson.maven.ProcessCache$MavenProcess.call(ProcessCache.java:156)
	at hudson.maven.MavenModuleSetBuild$RunnerImpl.doRun(MavenModuleSetBuild.java:775)
	at hudson.model.AbstractBuild$AbstractRunner.run(AbstractBuild.java:448)
	at hudson.model.Run.run(Run.java:1376)
	at hudson.maven.MavenModuleSetBuild.run(MavenModuleSetBuild.java:479)
	at hudson.model.ResourceController.execute(ResourceController.java:88)
	at hudson.model.Executor.run(Executor.java:230)
Caused by: hudson.remoting.Channel$OrderlyShutdown
	at hudson.remoting.Channel$CloseCommand.execute(Channel.java:813)
	at hudson.remoting.Channel$ReaderThread.run(Channel.java:1049)
Caused by: Command close created at
	at hudson.remoting.Command.<init>(Command.java:62)
	at hudson.remoting.Command.<init>(Command.java:47)
	at hudson.remoting.Channel$CloseCommand.<init>(Channel.java:809)
	at hudson.remoting.Channel$CloseCommand.<init>(Channel.java:809)
	at hudson.remoting.Channel.close(Channel.java:854)
	at hudson.slaves.ChannelPinger$1.onDead(ChannelPinger.java:112)
	at hudson.remoting.PingThread.ping(PingThread.java:107)
	at hudson.remoting.PingThread.run(PingThread.java:81)
FATAL: channel is already closed
hudson.remoting.ChannelClosedException: channel is already closed
	at hudson.remoting.Channel.send(Channel.java:486)
	at hudson.remoting.Request.call(Request.java:110)
	at hudson.remoting.Channel.call(Channel.java:668)
	at hudson.Launcher$RemoteLauncher.kill(Launcher.java:812)
	at hudson.model.AbstractBuild$AbstractRunner.run(AbstractBuild.java:471)
	at hudson.model.Run.run(Run.java:1376)
	at hudson.maven.MavenModuleSetBuild.run(MavenModuleSetBuild.java:479)
	at hudson.model.ResourceController.execute(ResourceController.java:88)
	at hudson.model.Executor.run(Executor.java:230)
Caused by: hudson.remoting.Channel$OrderlyShutdown
	at hudson.remoting.Channel$CloseCommand.execute(Channel.java:813)
	at hudson.remoting.Channel$ReaderThread.run(Channel.java:1049)
Caused by: Command close created at
	at hudson.remoting.Command.<init>(Command.java:62)
	at hudson.remoting.Command.<init>(Command.java:47)
	at hudson.remoting.Channel$CloseCommand.<init>(Channel.java:809)
	at hudson.remoting.Channel$CloseCommand.<init>(Channel.java:809)
	at hudson.remoting.Channel.close(Channel.java:854)
	at hudson.slaves.ChannelPinger$1.onDead(ChannelPinger.java:112)
	at hudson.remoting.PingThread.ping(PingThread.java:107)
	at hudson.remoting.PingThread.run(PingThread.java:81)


Mime
View raw message