activemq-dev mailing list archives

Site index · List index
Message view « Date » · « Thread »
Top « Date » · « Thread »
From Apache Jenkins Server <jenk...@builds.apache.org>
Subject Build failed in Jenkins: ActiveMQ-Trunk-Deploy #376
Date Wed, 14 Sep 2011 04:54:23 GMT
See <https://builds.apache.org/job/ActiveMQ-Trunk-Deploy/376/changes>

Changes:

[gtully] remove duplicate declaration of mvn-jar-plugin

[gtully] https://issues.apache.org/jira/browse/AMQ-2922 - rework, introduce new store 'mKahaDB'
that contains multiple filtered kahadb persistence adapters, destinations match a store using
destination wildcards in the same way as policy entries. Transactions that span multiple stores
use a local xa variant to ensure consistency

[davsclaus] CAMEL-3458: Using FQN in Camel TypeConverter file, after upgrade to Camel 2.8.1

[davsclaus] AMQ-3494: Upgrade to Camel 2.8.1

------------------------------------------
[...truncated 18691 lines...]
[INFO] Building jar: <https://builds.apache.org/job/ActiveMQ-Trunk-Deploy/ws/deploy/activemq-xmpp/target/activemq-xmpp-5.6-SNAPSHOT-javadoc.jar>
[INFO] [ianal:verify-legal-files {execution: default}]
[INFO] Checking legal files in: activemq-xmpp-5.6-SNAPSHOT.jar
[INFO] Checking legal files in: activemq-xmpp-5.6-SNAPSHOT-sources.jar
[INFO] Checking legal files in: activemq-xmpp-5.6-SNAPSHOT-javadoc.jar
[INFO] [install:install {execution: default-install}]
[INFO] Installing <https://builds.apache.org/job/ActiveMQ-Trunk-Deploy/ws/deploy/activemq-xmpp/target/activemq-xmpp-5.6-SNAPSHOT.jar>
to <https://builds.apache.org/job/ActiveMQ-Trunk-Deploy/ws/.repository/org/apache/activemq/activemq-xmpp/5.6-SNAPSHOT/activemq-xmpp-5.6-SNAPSHOT.jar>
[INFO] Installing <https://builds.apache.org/job/ActiveMQ-Trunk-Deploy/ws/deploy/activemq-xmpp/target/activemq-xmpp-5.6-SNAPSHOT-sources.jar>
to <https://builds.apache.org/job/ActiveMQ-Trunk-Deploy/ws/.repository/org/apache/activemq/activemq-xmpp/5.6-SNAPSHOT/activemq-xmpp-5.6-SNAPSHOT-sources.jar>
[INFO] Installing <https://builds.apache.org/job/ActiveMQ-Trunk-Deploy/ws/deploy/activemq-xmpp/target/activemq-xmpp-5.6-SNAPSHOT-javadoc.jar>
to <https://builds.apache.org/job/ActiveMQ-Trunk-Deploy/ws/.repository/org/apache/activemq/activemq-xmpp/5.6-SNAPSHOT/activemq-xmpp-5.6-SNAPSHOT-javadoc.jar>
[INFO] [deploy:deploy {execution: default-deploy}]
[INFO] Retrieving previous build number from apache.snapshots.https
Uploading: https://repository.apache.org/content/repositories/snapshots/org/apache/activemq/activemq-xmpp/5.6-SNAPSHOT/activemq-xmpp-5.6-SNAPSHOT.jar
174K uploaded  (activemq-xmpp-5.6-SNAPSHOT.jar)
[INFO] Retrieving previous metadata from apache.snapshots.https
[INFO] Uploading repository metadata for: 'artifact org.apache.activemq:activemq-xmpp'
[INFO] Uploading project information for activemq-xmpp 5.6-SNAPSHOT
[INFO] Retrieving previous metadata from apache.snapshots.https
[INFO] Uploading repository metadata for: 'snapshot org.apache.activemq:activemq-xmpp:5.6-SNAPSHOT'
[INFO] Retrieving previous build number from apache.snapshots.https
Uploading: https://repository.apache.org/content/repositories/snapshots/org/apache/activemq/activemq-xmpp/5.6-SNAPSHOT/activemq-xmpp-5.6-SNAPSHOT-sources.jar
191K uploaded  (activemq-xmpp-5.6-SNAPSHOT-sources.jar)
[INFO] Retrieving previous build number from apache.snapshots.https
Uploading: https://repository.apache.org/content/repositories/snapshots/org/apache/activemq/activemq-xmpp/5.6-SNAPSHOT/activemq-xmpp-5.6-SNAPSHOT-javadoc.jar
1105K uploaded  (activemq-xmpp-5.6-SNAPSHOT-javadoc.jar)
[JENKINS] Archiving <https://builds.apache.org/job/ActiveMQ-Trunk-Deploy/ws/deploy/activemq-xmpp/target/activemq-xmpp-5.6-SNAPSHOT-sources.jar>
to /home/hudson/hudson/jobs/ActiveMQ-Trunk-Deploy/modules/org.apache.activemq$activemq-xmpp/builds/2011-09-14_04-27-33/archive/org.apache.activemq/activemq-xmpp/5.6-SNAPSHOT/activemq-xmpp-5.6-SNAPSHOT-sources.jar
[JENKINS] Archiving <https://builds.apache.org/job/ActiveMQ-Trunk-Deploy/ws/deploy/activemq-xmpp/target/activemq-xmpp-5.6-SNAPSHOT-javadoc.jar>
to /home/hudson/hudson/jobs/ActiveMQ-Trunk-Deploy/modules/org.apache.activemq$activemq-xmpp/builds/2011-09-14_04-27-33/archive/org.apache.activemq/activemq-xmpp/5.6-SNAPSHOT/activemq-xmpp-5.6-SNAPSHOT-javadoc.jar
[INFO] ------------------------------------------------------------------------
[INFO] SKIPPING ActiveMQ :: Web Console
[INFO]    task-segment: [clean, deploy]
[INFO] This project has been banned from further executions due to previous failures.
[INFO] ------------------------------------------------------------------------
[INFO] ------------------------------------------------------------------------
[INFO] SKIPPING ActiveMQ :: Assembly
[INFO]    task-segment: [clean, deploy]
[INFO] This project has been banned from further executions due to previous failures.
[INFO] ------------------------------------------------------------------------
[INFO] 
[INFO] 
[INFO] ------------------------------------------------------------------------
[INFO] Reactor Summary:
[INFO] ------------------------------------------------------------------------
[INFO] ActiveMQ .............................................. SUCCESS [2:48.701s]
[INFO] ActiveMQ :: KahaDB .................................... SUCCESS [35.033s]
[INFO] ActiveMQ :: JAAS ...................................... SUCCESS [1:19.525s]
[INFO] Openwire Generator .................................... SUCCESS [29.056s]
[INFO] ActiveMQ :: jmdns 1.0 ................................. SUCCESS [9.515s]
[INFO] ActiveMQ :: Core ...................................... SUCCESS [3:22.619s]
[INFO] ActiveMQ :: RA ........................................ SUCCESS [5:21.846s]
[INFO] ActiveMQ :: Pool ...................................... SUCCESS [14.713s]
[INFO] ActiveMQ :: Spring .................................... SUCCESS [25.804s]
[INFO] ActiveMQ :: Camel ..................................... SUCCESS [59.624s]
[INFO] ActiveMQ :: Console ................................... FAILED [2:29.690s]
[INFO] ActiveMQ :: Optional .................................. SKIPPED (dependency build failed
or was skipped)
[INFO] ActiveMQ :: Jar Bundle ................................ SKIPPED (dependency build failed
or was skipped)
[INFO] ActiveMQ :: File Server ............................... SUCCESS [35.662s]
[INFO] ActiveMQ :: Blueprint ................................. SUCCESS [23.220s]
[INFO] ActiveMQ :: Apache Karaf .............................. SKIPPED (dependency build failed
or was skipped)
[INFO] ActiveMQ :: RAR ....................................... SKIPPED (dependency build failed
or was skipped)
[INFO] ActiveMQ :: Run Jar ................................... SKIPPED (dependency build failed
or was skipped)
[INFO] ActiveMQ Tooling ...................................... SUCCESS [2.995s]
[INFO] ActiveMQ :: Memory Usage Test Plugin .................. SKIPPED (dependency build failed
or was skipped)
[INFO] ActiveMQ :: Performance Test Plugin ................... SKIPPED (dependency build failed
or was skipped)
[INFO] ActiveMQ :: StartUp Plugin ............................ SKIPPED (dependency build failed
or was skipped)
[INFO] ActiveMQ :: Web ....................................... SUCCESS [29.185s]
[INFO] ActiveMQ :: Web Demo .................................. SUCCESS [1:34.021s]
[INFO] ActiveMQ :: XMPP ...................................... SUCCESS [34.551s]
[INFO] ActiveMQ :: Web Console ............................... SKIPPED (dependency build failed
or was skipped)
[INFO] ActiveMQ :: Assembly .................................. SKIPPED (dependency build failed
or was skipped)
[INFO] ------------------------------------------------------------------------
[INFO] Error for project: ActiveMQ :: Console (during deploy)
[INFO] ------------------------------------------------------------------------
[INFO] Failed to resolve artifact.

Missing:
----------
1) net.sf.josql:josql:jar:1.5

  Try downloading the file manually from the project website.

  Then, install it using the command: 
      mvn install:install-file -DgroupId=net.sf.josql -DartifactId=josql -Dversion=1.5 -Dpackaging=jar
-Dfile=/path/to/file

  Alternatively, if you host your own repository you can deploy the file there: 
      mvn deploy:deploy-file -DgroupId=net.sf.josql -DartifactId=josql -Dversion=1.5 -Dpackaging=jar
-Dfile=/path/to/file -Durl=[url] -DrepositoryId=[id]

  Path to dependency: 
  	1) org.apache.activemq:activemq-console:bundle:5.6-SNAPSHOT
  	2) net.sf.josql:josql:jar:1.5

2) net.sf.josql:gentlyweb-utils:jar:1.5

  Try downloading the file manually from the project website.

  Then, install it using the command: 
      mvn install:install-file -DgroupId=net.sf.josql -DartifactId=gentlyweb-utils -Dversion=1.5
-Dpackaging=jar -Dfile=/path/to/file

  Alternatively, if you host your own repository you can deploy the file there: 
      mvn deploy:deploy-file -DgroupId=net.sf.josql -DartifactId=gentlyweb-utils -Dversion=1.5
-Dpackaging=jar -Dfile=/path/to/file -Durl=[url] -DrepositoryId=[id]

  Path to dependency: 
  	1) org.apache.activemq:activemq-console:bundle:5.6-SNAPSHOT
  	2) net.sf.josql:gentlyweb-utils:jar:1.5

----------
2 required artifacts are missing.

for artifact: 
  org.apache.activemq:activemq-console:bundle:5.6-SNAPSHOT

from the specified remote repositories:
  com.springsource.repository.bundles.external (http://repository.springsource.com/maven/bundles/external),
  central (http://repo1.maven.org/maven2),
  com.fusesource.m2 (http://repo.fusesource.com/nexus/content/groups/public/),
  Nexus (http://repository.apache.org/snapshots)



[INFO] ------------------------------------------------------------------------
[INFO] Trace
org.apache.maven.lifecycle.LifecycleExecutionException: Missing:
----------
1) net.sf.josql:josql:jar:1.5

  Try downloading the file manually from the project website.

  Then, install it using the command: 
      mvn install:install-file -DgroupId=net.sf.josql -DartifactId=josql -Dversion=1.5 -Dpackaging=jar
-Dfile=/path/to/file

  Alternatively, if you host your own repository you can deploy the file there: 
      mvn deploy:deploy-file -DgroupId=net.sf.josql -DartifactId=josql -Dversion=1.5 -Dpackaging=jar
-Dfile=/path/to/file -Durl=[url] -DrepositoryId=[id]

  Path to dependency: 
  	1) org.apache.activemq:activemq-console:bundle:5.6-SNAPSHOT
  	2) net.sf.josql:josql:jar:1.5

2) net.sf.josql:gentlyweb-utils:jar:1.5

  Try downloading the file manually from the project website.

  Then, install it using the command: 
      mvn install:install-file -DgroupId=net.sf.josql -DartifactId=gentlyweb-utils -Dversion=1.5
-Dpackaging=jar -Dfile=/path/to/file

  Alternatively, if you host your own repository you can deploy the file there: 
      mvn deploy:deploy-file -DgroupId=net.sf.josql -DartifactId=gentlyweb-utils -Dversion=1.5
-Dpackaging=jar -Dfile=/path/to/file -Durl=[url] -DrepositoryId=[id]

  Path to dependency: 
  	1) org.apache.activemq:activemq-console:bundle:5.6-SNAPSHOT
  	2) net.sf.josql:gentlyweb-utils:jar:1.5

----------
2 required artifacts are missing.

for artifact: 
  org.apache.activemq:activemq-console:bundle:5.6-SNAPSHOT

from the specified remote repositories:
  com.springsource.repository.bundles.external (http://repository.springsource.com/maven/bundles/external),
  central (http://repo1.maven.org/maven2),
  com.fusesource.m2 (http://repo.fusesource.com/nexus/content/groups/public/),
  Nexus (http://repository.apache.org/snapshots)


	at org.apache.maven.lifecycle.DefaultLifecycleExecutor.executeGoals(DefaultLifecycleExecutor.java:711)
	at org.apache.maven.lifecycle.DefaultLifecycleExecutor.executeGoalWithLifecycle(DefaultLifecycleExecutor.java:556)
	at org.apache.maven.lifecycle.DefaultLifecycleExecutor.executeGoal(DefaultLifecycleExecutor.java:535)
	at org.apache.maven.lifecycle.DefaultLifecycleExecutor.executeGoalAndHandleFailures(DefaultLifecycleExecutor.java:387)
	at org.apache.maven.lifecycle.DefaultLifecycleExecutor.executeTaskSegments(DefaultLifecycleExecutor.java:348)
	at org.apache.maven.lifecycle.DefaultLifecycleExecutor.execute(DefaultLifecycleExecutor.java:180)
	at org.apache.maven.lifecycle.LifecycleExecutorInterceptor.execute(LifecycleExecutorInterceptor.java:65)
	at org.apache.maven.DefaultMaven.doExecute(DefaultMaven.java:328)
	at org.apache.maven.DefaultMaven.execute(DefaultMaven.java:138)
	at org.apache.maven.cli.MavenCli.main(MavenCli.java:362)
	at sun.reflect.NativeMethodAccessorImpl.invoke0(Native Method)
	at sun.reflect.NativeMethodAccessorImpl.invoke(NativeMethodAccessorImpl.java:39)
	at sun.reflect.DelegatingMethodAccessorImpl.invoke(DelegatingMethodAccessorImpl.java:25)
	at java.lang.reflect.Method.invoke(Method.java:597)
	at org.codehaus.classworlds.Launcher.launchEnhanced(Launcher.java:315)
	at org.codehaus.classworlds.Launcher.launch(Launcher.java:255)
	at hudson.maven.agent.Main.launch(Main.java:185)
	at hudson.maven.MavenBuilder.call(MavenBuilder.java:160)
	at hudson.maven.MavenModuleSetBuild$Builder.call(MavenModuleSetBuild.java:1064)
	at hudson.maven.MavenModuleSetBuild$Builder.call(MavenModuleSetBuild.java:995)
	at hudson.remoting.UserRequest.perform(UserRequest.java:118)
	at hudson.remoting.UserRequest.perform(UserRequest.java:48)
	at hudson.remoting.Request$2.run(Request.java:287)
	at java.util.concurrent.Executors$RunnableAdapter.call(Executors.java:441)
	at java.util.concurrent.FutureTask$Sync.innerRun(FutureTask.java:303)
	at java.util.concurrent.FutureTask.run(FutureTask.java:138)
	at java.util.concurrent.ThreadPoolExecutor$Worker.runTask(ThreadPoolExecutor.java:886)
	at java.util.concurrent.ThreadPoolExecutor$Worker.run(ThreadPoolExecutor.java:908)
	at java.lang.Thread.run(Thread.java:619)
Caused by: org.apache.maven.artifact.resolver.MultipleArtifactsNotFoundException: Missing:
----------
1) net.sf.josql:josql:jar:1.5

  Try downloading the file manually from the project website.

  Then, install it using the command: 
      mvn install:install-file -DgroupId=net.sf.josql -DartifactId=josql -Dversion=1.5 -Dpackaging=jar
-Dfile=/path/to/file

  Alternatively, if you host your own repository you can deploy the file there: 
      mvn deploy:deploy-file -DgroupId=net.sf.josql -DartifactId=josql -Dversion=1.5 -Dpackaging=jar
-Dfile=/path/to/file -Durl=[url] -DrepositoryId=[id]

  Path to dependency: 
  	1) org.apache.activemq:activemq-console:bundle:5.6-SNAPSHOT
  	2) net.sf.josql:josql:jar:1.5

2) net.sf.josql:gentlyweb-utils:jar:1.5

  Try downloading the file manually from the project website.

  Then, install it using the command: 
      mvn install:install-file -DgroupId=net.sf.josql -DartifactId=gentlyweb-utils -Dversion=1.5
-Dpackaging=jar -Dfile=/path/to/file

  Alternatively, if you host your own repository you can deploy the file there: 
      mvn deploy:deploy-file -DgroupId=net.sf.josql -DartifactId=gentlyweb-utils -Dversion=1.5
-Dpackaging=jar -Dfile=/path/to/file -Durl=[url] -DrepositoryId=[id]

  Path to dependency: 
  	1) org.apache.activemq:activemq-console:bundle:5.6-SNAPSHOT
  	2) net.sf.josql:gentlyweb-utils:jar:1.5

----------
2 required artifacts are missing.

for artifact: 
  org.apache.activemq:activemq-console:bundle:5.6-SNAPSHOT

from the specified remote repositories:
  com.springsource.repository.bundles.external (http://repository.springsource.com/maven/bundles/external),
  central (http://repo1.maven.org/maven2),
  com.fusesource.m2 (http://repo.fusesource.com/nexus/content/groups/public/),
  Nexus (http://repository.apache.org/snapshots)


	at org.apache.maven.artifact.resolver.DefaultArtifactResolver.resolveTransitively(DefaultArtifactResolver.java:360)
	at org.apache.maven.artifact.resolver.DefaultArtifactResolver.resolveTransitively(DefaultArtifactResolver.java:304)
	at org.apache.maven.plugin.DefaultPluginManager.resolveTransitiveDependencies(DefaultPluginManager.java:1499)
	at org.apache.maven.plugin.DefaultPluginManager.executeMojo(DefaultPluginManager.java:442)
	at hudson.maven.agent.PluginManagerInterceptor.executeMojo(PluginManagerInterceptor.java:182)
	at org.apache.maven.lifecycle.DefaultLifecycleExecutor.executeGoals(DefaultLifecycleExecutor.java:694)
	... 28 more
[INFO] ------------------------------------------------------------------------
[INFO] BUILD ERRORS
[INFO] ------------------------------------------------------------------------
[INFO] Total time: 26 minutes 12 seconds
[INFO] Finished at: Wed Sep 14 04:54:20 UTC 2011
[INFO] Final Memory: 119M/1487M
[INFO] ------------------------------------------------------------------------
channel stopped


Mime
View raw message