activemq-dev mailing list archives

Site index · List index
Message view « Date » · « Thread »
Top « Date » · « Thread »
From Apache Jenkins Server <jenk...@builds.apache.org>
Subject Build failed in Jenkins: ActiveMQ #751
Date Wed, 07 Sep 2011 10:30:00 GMT
See <https://builds.apache.org/job/ActiveMQ/751/changes>

Changes:

[tabish] https://issues.apache.org/jira/browse/AMQ-3467

Handle a potential NPE case.

------------------------------------------
[...truncated 9792 lines...]
Tests run: 2, Failures: 0, Errors: 0, Skipped: 0, Time elapsed: 9.782 sec
Running org.apache.activemq.broker.region.DestinationGCTest
Tests run: 2, Failures: 0, Errors: 0, Skipped: 0, Time elapsed: 24.62 sec
Running org.apache.activemq.broker.TopicSubscriptionTest
Tests run: 8, Failures: 0, Errors: 0, Skipped: 0, Time elapsed: 6.007 sec
Running org.apache.activemq.JmsTempDestinationTest
Tests run: 7, Failures: 0, Errors: 0, Skipped: 0, Time elapsed: 13.98 sec
Running org.apache.activemq.JmsRollbackRedeliveryTest
Tests run: 9, Failures: 0, Errors: 0, Skipped: 0, Time elapsed: 10.776 sec
Running org.apache.activemq.ActiveMQInputStreamTest
Tests run: 2, Failures: 0, Errors: 0, Skipped: 0, Time elapsed: 4.412 sec
Running org.apache.activemq.store.kahadb.plist.PListTest
Tests run: 14, Failures: 0, Errors: 0, Skipped: 0, Time elapsed: 514.582 sec
Running org.apache.activemq.store.kahadb.TempKahaDBStoreBrokerTest
Tests run: 129, Failures: 0, Errors: 0, Skipped: 0, Time elapsed: 160.94 sec
Running org.apache.activemq.store.kahadb.KahaDBMessagePriorityTest
Tests run: 14, Failures: 0, Errors: 0, Skipped: 0, Time elapsed: 190.351 sec
Running org.apache.activemq.store.kahadb.KahaDBStoreBrokerTest
Tests run: 129, Failures: 0, Errors: 0, Skipped: 0, Time elapsed: 103.643 sec
Running org.apache.activemq.store.kahadb.PBMesssagesTest
Tests run: 1, Failures: 0, Errors: 0, Skipped: 0, Time elapsed: 0.042 sec
Running org.apache.activemq.store.kahadb.KahaDBStoreRecoveryBrokerTest
Tests run: 10, Failures: 0, Errors: 0, Skipped: 0, Time elapsed: 44.7 sec
Running org.apache.activemq.store.kahadb.KahaDBVersionTest
Tests run: 2, Failures: 0, Errors: 0, Skipped: 0, Time elapsed: 167.386 sec
Running org.apache.activemq.store.kahadb.KahaDBTest
Tests run: 4, Failures: 0, Errors: 0, Skipped: 0, Time elapsed: 67.956 sec
Running org.apache.activemq.store.kahadb.KahaDBStoreOrderTest
Tests run: 2, Failures: 0, Errors: 0, Skipped: 0, Time elapsed: 4.359 sec
Running org.apache.activemq.store.kahadb.KahaDBStoreTest
Tests run: 1, Failures: 0, Errors: 0, Skipped: 0, Time elapsed: 5.434 sec
Running org.apache.activemq.store.kahadb.KahaDBPersistenceAdapterTest
Tests run: 1, Failures: 0, Errors: 0, Skipped: 0, Time elapsed: 0.901 sec
Running org.apache.activemq.store.kahadb.NoSpaceIOTest
Tests run: 1, Failures: 0, Errors: 0, Skipped: 1, Time elapsed: 0.056 sec
Running org.apache.activemq.store.jdbc.JDBCStoreOrderTest
Tests run: 2, Failures: 0, Errors: 0, Skipped: 0, Time elapsed: 8.677 sec
Running org.apache.activemq.store.jdbc.JDBCStoreBrokerTest
Tests run: 129, Failures: 0, Errors: 0, Skipped: 0, Time elapsed: 284.44 sec
Running org.apache.activemq.store.jdbc.JDBCPersistenceAdapterTest
Tests run: 2, Failures: 0, Errors: 0, Skipped: 0, Time elapsed: 10.75 sec
Running org.apache.activemq.store.jdbc.JDBCCommitExceptionTest
Tests run: 1, Failures: 0, Errors: 0, Skipped: 0, Time elapsed: 8.407 sec
Running org.apache.activemq.store.jdbc.JDBCNetworkBrokerDetachTest
Tests run: 2, Failures: 0, Errors: 0, Skipped: 0, Time elapsed: 42.406 sec
Running org.apache.activemq.store.jdbc.JDBCXACommitExceptionTest
Tests run: 2, Failures: 0, Errors: 0, Skipped: 0, Time elapsed: 10.89 sec
Running org.apache.activemq.store.jdbc.JDBCMessagePriorityTest
Tests run: 21, Failures: 0, Errors: 0, Skipped: 0, Time elapsed: 669.564 sec
Running org.apache.activemq.store.jdbc.JDBCNegativeQueueTest
Tests run: 7, Failures: 0, Errors: 0, Skipped: 0, Time elapsed: 734.072 sec
Running org.apache.activemq.JmsQueueTopicCompositeSendReceiveTest
Tests run: 1, Failures: 0, Errors: 0, Skipped: 0, Time elapsed: 1.717 sec
Running org.apache.activemq.JmsQueueSendReceiveTwoConnectionsStartBeforeBrokerTest
Tests run: 1, Failures: 0, Errors: 0, Skipped: 0, Time elapsed: 3.398 sec
Running org.apache.activemq.TransactionContextTest
Tests run: 2, Failures: 0, Errors: 0, Skipped: 0, Time elapsed: 2.521 sec
Running org.apache.activemq.JmsTopicRequestReplyTest
Tests run: 2, Failures: 0, Errors: 0, Skipped: 0, Time elapsed: 0.74 sec
Running org.apache.activemq.network.NetworkReconnectTest
Tests run: 1, Failures: 0, Errors: 0, Skipped: 0, Time elapsed: 5.586 sec
Running org.apache.activemq.network.NetworkBrokerDetachTest
Tests run: 2, Failures: 0, Errors: 0, Skipped: 0, Time elapsed: 16.991 sec
Running org.apache.activemq.network.FailoverStaticNetworkTest
Tests run: 6, Failures: 0, Errors: 0, Skipped: 0, Time elapsed: 72.4 sec
Running org.apache.activemq.network.DemandForwardingBridgeTest
Tests run: 6, Failures: 0, Errors: 0, Skipped: 0, Time elapsed: 4.624 sec
Running org.apache.activemq.network.jms.TopicBridgeXBeanTest
Tests run: 1, Failures: 0, Errors: 0, Skipped: 0, Time elapsed: 1.14 sec
Running org.apache.activemq.network.jms.QueueBridgeTest
Tests run: 1, Failures: 0, Errors: 0, Skipped: 0, Time elapsed: 1.164 sec
Running org.apache.activemq.network.jms.TopicBridgeSpringTest
Tests run: 1, Failures: 0, Errors: 0, Skipped: 0, Time elapsed: 1.124 sec
Running org.apache.activemq.network.jms.QueueBridgeXBeanTest
Tests run: 1, Failures: 0, Errors: 0, Skipped: 0, Time elapsed: 1.493 sec
Running org.apache.activemq.network.NetworkRestartTest
Tests run: 2, Failures: 0, Errors: 0, Skipped: 0, Time elapsed: 30.732 sec
Running org.apache.activemq.network.ForwardingBridgeTest
Tests run: 4, Failures: 0, Errors: 0, Skipped: 0, Time elapsed: 8.483 sec
Running org.apache.activemq.network.DuplexNetworkMBeanTest
Tests run: 2, Failures: 0, Errors: 0, Skipped: 0, Time elapsed: 21.899 sec
Running org.apache.activemq.network.DuplexNetworkTest
Tests run: 6, Failures: 0, Errors: 0, Skipped: 0, Time elapsed: 68.087 sec
Running org.apache.activemq.network.DemandForwardingBridgeFilterTest
Tests run: 5, Failures: 0, Errors: 0, Skipped: 0, Time elapsed: 24.713 sec
Running org.apache.activemq.network.NetworkRemovesSubscriptionsTest
Tests run: 5, Failures: 0, Errors: 0, Skipped: 0, Time elapsed: 26.721 sec
Running org.apache.activemq.network.SimpleNetworkTest
Tests run: 5, Failures: 0, Errors: 0, Skipped: 0, Time elapsed: 55.526 sec
Running org.apache.activemq.network.NetworkRestartPlainTest
Tests run: 2, Failures: 0, Errors: 0, Skipped: 0, Time elapsed: 33.207 sec
Running org.apache.activemq.network.NetworkLoadTest
Tests run: 1, Failures: 0, Errors: 0, Skipped: 0, Time elapsed: 67.624 sec
Running org.apache.activemq.network.NetworkConnectionsTest
Tests run: 3, Failures: 0, Errors: 0, Skipped: 0, Time elapsed: 7.656 sec
Running org.apache.activemq.JmsQueueSendReceiveTest
Tests run: 1, Failures: 0, Errors: 0, Skipped: 0, Time elapsed: 1.67 sec
Running org.apache.activemq.blob.FTPBlobDownloadStrategyTest
Tests run: 3, Failures: 0, Errors: 0, Skipped: 0, Time elapsed: 1.868 sec
Running org.apache.activemq.blob.FilesystemBlobTest
Tests run: 1, Failures: 0, Errors: 0, Skipped: 0, Time elapsed: 1.662 sec
Running org.apache.activemq.blob.BlobTransferPolicyUriTest
Tests run: 1, Failures: 0, Errors: 0, Skipped: 0, Time elapsed: 0.121 sec
Running org.apache.activemq.blob.FTPBlobUploadStrategyTest
Tests run: 2, Failures: 0, Errors: 0, Skipped: 0, Time elapsed: 0.917 sec
Running org.apache.activemq.blob.FTPBlobTest
Tests run: 1, Failures: 0, Errors: 0, Skipped: 0, Time elapsed: 2.015 sec
Running org.apache.activemq.JMSMessageTest
Tests run: 28, Failures: 0, Errors: 0, Skipped: 0, Time elapsed: 1.635 sec
Running org.apache.activemq.test.message.NestedMapMessageTest
Tests run: 1, Failures: 0, Errors: 0, Skipped: 0, Time elapsed: 3.438 sec
Running org.apache.activemq.test.message.NestedMapAndListPropertyTest
Tests run: 1, Failures: 0, Errors: 0, Skipped: 0, Time elapsed: 3.434 sec
Running org.apache.activemq.test.rollback.CloseRollbackRedeliveryQueueTest
Tests run: 3, Failures: 0, Errors: 0, Skipped: 0, Time elapsed: 0.853 sec
Running org.apache.activemq.test.rollback.RollbacksWhileConsumingLargeQueueTest
Tests run: 2, Failures: 0, Errors: 0, Skipped: 0, Time elapsed: 5.589 sec
Running org.apache.activemq.test.JmsTopicSendReceiveWithEmbeddedBrokerAndUserIDTest
Tests run: 2, Failures: 0, Errors: 0, Skipped: 0, Time elapsed: 6.635 sec
Running org.apache.activemq.test.JmsTopicSendReceiveWithTwoConnectionsAndEmbeddedBrokerTest
Tests run: 1, Failures: 0, Errors: 0, Skipped: 0, Time elapsed: 3.444 sec
Running org.apache.activemq.test.TemporaryDestinationToFromNameTest
Tests run: 2, Failures: 0, Errors: 0, Skipped: 0, Time elapsed: 0.636 sec
Running org.apache.activemq.test.JmsTopicSendReceiveTest
Tests run: 1, Failures: 0, Errors: 0, Skipped: 0, Time elapsed: 1.63 sec
Running org.apache.activemq.test.retroactive.RetroactiveConsumerTestWithLastImagePolicyWithWildcardTest
Tests run: 1, Failures: 0, Errors: 0, Skipped: 0, Time elapsed: 1.425 sec
Running org.apache.activemq.test.retroactive.RetroactiveConsumerTestWithTimePolicyTest
Tests run: 1, Failures: 0, Errors: 0, Skipped: 0, Time elapsed: 1.264 sec
Running org.apache.activemq.test.retroactive.RetroactiveConsumerTestWithSimpleMessageListTest
Tests run: 1, Failures: 0, Errors: 0, Skipped: 0, Time elapsed: 1.274 sec
Running org.apache.activemq.test.retroactive.RetroactiveConsumerWithMessageQueryTest
Tests run: 1, Failures: 0, Errors: 0, Skipped: 0, Time elapsed: 1.282 sec
Running org.apache.activemq.test.retroactive.RetroactiveConsumerTestWithDestinationBasedBufferTest
Tests run: 1, Failures: 0, Errors: 0, Skipped: 0, Time elapsed: 1.331 sec
Running org.apache.activemq.test.JmsTopicSendReceiveWithTwoConnectionsTest
Tests run: 1, Failures: 0, Errors: 0, Skipped: 0, Time elapsed: 1.673 sec
Running org.apache.activemq.test.JmsTopicSendReceiveWithTwoConnectionsAndByteSelectorTest
Tests run: 1, Failures: 0, Errors: 0, Skipped: 0, Time elapsed: 1.646 sec
Running org.apache.activemq.plugin.BrokerStatisticsPluginTest
Tests run: 2, Failures: 0, Errors: 0, Skipped: 0, Time elapsed: 6.709 sec
Running org.apache.activemq.ProducerFlowControlTest
Tests run: 6, Failures: 0, Errors: 0, Skipped: 0, Time elapsed: 25.552 sec
Running org.apache.activemq.ActiveMQConnectionFactoryTest
Tests run: 12, Failures: 0, Errors: 0, Skipped: 0, Time elapsed: 8.742 sec
Running org.apache.activemq.CreateConsumerButDontStartConnectionWarningTest
Tests run: 1, Failures: 0, Errors: 0, Skipped: 0, Time elapsed: 2.67 sec
Running org.apache.activemq.JmsRedeliveredTest
Tests run: 18, Failures: 0, Errors: 0, Skipped: 0, Time elapsed: 13.489 sec
Running org.apache.activemq.transport.reliable.ReliableTransportTest
Tests run: 7, Failures: 0, Errors: 0, Skipped: 0, Time elapsed: 0.186 sec
Running org.apache.activemq.transport.fanout.FanoutTransportBrokerTest
Tests run: 6, Failures: 0, Errors: 0, Skipped: 0, Time elapsed: 28.711 sec
Running org.apache.activemq.transport.fanout.FanoutTest
Tests run: 1, Failures: 0, Errors: 0, Skipped: 0, Time elapsed: 2.553 sec
Running org.apache.activemq.transport.failover.FailoverTransactionTest
Tests run: 15, Failures: 0, Errors: 0, Skipped: 0, Time elapsed: 225.893 sec
Running org.apache.activemq.transport.failover.AMQ1925Test
Tests run: 2, Failures: 0, Errors: 0, Skipped: 0, Time elapsed: 278.744 sec
Running org.apache.activemq.transport.failover.FailoverConsumerOutstandingCommitTest
Tests run: 4, Failures: 0, Errors: 0, Skipped: 0, Time elapsed: 32.409 sec
Running org.apache.activemq.transport.failover.FailoverConsumerUnconsumedTest
Tests run: 2, Failures: 0, Errors: 0, Skipped: 0, Time elapsed: 12.772 sec
Running org.apache.activemq.transport.failover.FailoverUpdateURIsTest
Tests run: 2, Failures: 0, Errors: 0, Skipped: 0, Time elapsed: 11.148 sec
Running org.apache.activemq.transport.failover.BadConnectionTest
Tests run: 1, Failures: 0, Errors: 0, Skipped: 0, Time elapsed: 0.64 sec
Running org.apache.activemq.transport.failover.ReconnectTest
Tests run: 1, Failures: 0, Errors: 0, Skipped: 0, Time elapsed: 20.344 sec
Running org.apache.activemq.transport.failover.FailoverTimeoutTest
Tests run: 2, Failures: 0, Errors: 0, Skipped: 0, Time elapsed: 10.467 sec
Running org.apache.activemq.transport.failover.SlowConnectionTest
Tests run: 1, Failures: 0, Errors: 0, Skipped: 0, Time elapsed: 5.678 sec
Running org.apache.activemq.transport.failover.FailoverUriTest
Tests run: 16, Failures: 0, Errors: 0, Skipped: 0, Time elapsed: 33.052 sec
Running org.apache.activemq.transport.failover.FailoverRandomTest
Tests run: 1, Failures: 0, Errors: 0, Skipped: 0, Time elapsed: 4.438 sec
Running org.apache.activemq.transport.failover.FailoverClusterTest
Tests run: 3, Failures: 0, Errors: 0, Skipped: 0, Time elapsed: 25.796 sec
Running org.apache.activemq.transport.failover.FailoverPrefetchZeroTest
Tests run: 1, Failures: 0, Errors: 0, Skipped: 0, Time elapsed: 6.596 sec
Running org.apache.activemq.transport.failover.FailoverTransportBrokerTest
Tests run: 5, Failures: 0, Errors: 0, Skipped: 0, Time elapsed: 20.602 sec
Running org.apache.activemq.transport.discovery.DiscoveryTransportNoBrokerTest
Tests run: 6, Failures: 0, Errors: 0, Skipped: 0, Time elapsed: 15.799 sec
Running org.apache.activemq.transport.discovery.DiscoveryTransportBrokerTest
Tests run: 1, Failures: 0, Errors: 0, Skipped: 0, Time elapsed: 5.135 sec
Running org.apache.activemq.transport.discovery.DiscoveryUriTest
Tests run: 2, Failures: 0, Errors: 0, Skipped: 0, Time elapsed: 7.58 sec
Running org.apache.activemq.transport.discovery.DiscoveryNetworkReconnectTest
Tests run: 2, Failures: 0, Errors: 0, Skipped: 0, Time elapsed: 706.788 sec
Running org.apache.activemq.transport.QueueClusterTest
Tests run: 1, Failures: 0, Errors: 0, Skipped: 0, Time elapsed: 13.501 sec
Running org.apache.activemq.transport.SoWriteTimeoutTest
Tests run: 3, Failures: 1, Errors: 0, Skipped: 0, Time elapsed: 39.106 sec <<< FAILURE!
Running org.apache.activemq.transport.stomp.StompFrameTest
Tests run: 1, Failures: 0, Errors: 0, Skipped: 0, Time elapsed: 0.055 sec
Running org.apache.activemq.transport.stomp.StompSslTest
Tests run: 58, Failures: 0, Errors: 0, Skipped: 0, Time elapsed: 213.581 sec
Running org.apache.activemq.transport.stomp.StompSslAuthTest
Build timed out (after 575 minutes). Marking the build as aborted.
[locks-and-latches] Releasing all the locks
[locks-and-latches] All the locks released
ERROR: Failed to parse POMs
hudson.remoting.ChannelClosedException: channel is already closed
	at hudson.remoting.Channel.send(Channel.java:486)
	at hudson.remoting.ProxyOutputStream._write(ProxyOutputStream.java:123)
	at hudson.remoting.ProxyOutputStream.write(ProxyOutputStream.java:103)
	at hudson.remoting.RemoteOutputStream.write(RemoteOutputStream.java:110)
	at java.io.BufferedOutputStream.flushBuffer(BufferedOutputStream.java:65)
	at java.io.BufferedOutputStream.flush(BufferedOutputStream.java:123)
	at java.io.BufferedOutputStream.flush(BufferedOutputStream.java:124)
	at java.io.ObjectOutputStream$BlockDataOutputStream.flush(ObjectOutputStream.java:1793)
	at java.io.ObjectOutputStream.flush(ObjectOutputStream.java:699)
	at hudson.remoting.Channel.send(Channel.java:492)
	at hudson.remoting.Request.call(Request.java:161)
	at hudson.remoting.Channel.call(Channel.java:668)
	at hudson.maven.ProcessCache$MavenProcess.call(ProcessCache.java:156)
	at hudson.maven.MavenModuleSetBuild$RunnerImpl.doRun(MavenModuleSetBuild.java:775)
	at hudson.model.AbstractBuild$AbstractRunner.run(AbstractBuild.java:448)
	at hudson.model.Run.run(Run.java:1376)
	at hudson.maven.MavenModuleSetBuild.run(MavenModuleSetBuild.java:479)
	at hudson.model.ResourceController.execute(ResourceController.java:88)
	at hudson.model.Executor.run(Executor.java:230)
Caused by: java.io.IOException: Unexpected termination of the channel
	at hudson.remoting.Channel$ReaderThread.run(Channel.java:1037)
Caused by: java.io.EOFException
	at java.io.ObjectInputStream$BlockDataInputStream.peekByte(ObjectInputStream.java:2553)
	at java.io.ObjectInputStream.readObject0(ObjectInputStream.java:1296)
	at java.io.ObjectInputStream.readObject(ObjectInputStream.java:350)
	at hudson.remoting.Channel$ReaderThread.run(Channel.java:1031)
FATAL: channel is already closed
hudson.remoting.ChannelClosedException: channel is already closed
	at hudson.remoting.Channel.send(Channel.java:486)
	at hudson.remoting.Request.call(Request.java:110)
	at hudson.remoting.Channel.call(Channel.java:668)
	at hudson.Launcher$RemoteLauncher.kill(Launcher.java:812)
	at hudson.model.AbstractBuild$AbstractRunner.run(AbstractBuild.java:471)
	at hudson.model.Run.run(Run.java:1376)
	at hudson.maven.MavenModuleSetBuild.run(MavenModuleSetBuild.java:479)
	at hudson.model.ResourceController.execute(ResourceController.java:88)
	at hudson.model.Executor.run(Executor.java:230)
Caused by: java.io.IOException: Unexpected termination of the channel
	at hudson.remoting.Channel$ReaderThread.run(Channel.java:1037)
Caused by: java.io.EOFException
	at java.io.ObjectInputStream$BlockDataInputStream.peekByte(ObjectInputStream.java:2553)
	at java.io.ObjectInputStream.readObject0(ObjectInputStream.java:1296)
	at java.io.ObjectInputStream.readObject(ObjectInputStream.java:350)
	at hudson.remoting.Channel$ReaderThread.run(Channel.java:1031)


Mime
View raw message