activemq-dev mailing list archives

Site index · List index
Message view « Date » · « Thread »
Top « Date » · « Thread »
From Apache Jenkins Server <jenk...@builds.apache.org>
Subject Build failed in Jenkins: ActiveMQ #740
Date Wed, 24 Aug 2011 07:45:19 GMT
See <https://builds.apache.org/job/ActiveMQ/740/changes>

Changes:

[tabish] Fix for AMQ-3468.  Updated to XStream v1.4.1

[tabish] fix for: https://issues.apache.org/jira/browse/AMQ-3454

Use a read / write lock on the destination mutex as many of the access points are simply reads
of the underlying maps or a quite copy to another Collection.  The only time a write is done
is during addDestination and removeDestination.

[dejanb] https://issues.apache.org/jira/browse/AMQ-3464 - xml view for subscribers in admin
console

[gtully] https://issues.apache.org/jira/browse/AMQ-3466: IndexOutOfBounds in kahadb with large
number of subscriptions and pending messages. use long locations such that temp file appends
do not overflow and ensure page file overflow does not leave oversized chunk, link pages till
overflow fits in a page, + some additional tests

[dejanb] https://issues.apache.org/jira/browse/AMQ-3463 - osgi and maven metadata

------------------------------------------
[...truncated 8627 lines...]
Running org.apache.activemq.blob.FTPBlobUploadStrategyTest
Tests run: 2, Failures: 0, Errors: 0, Skipped: 0, Time elapsed: 0.963 sec
Running org.apache.activemq.usecases.NoDuplicateOnTopicNetworkTest
Tests run: 8, Failures: 0, Errors: 0, Skipped: 0, Time elapsed: 142.052 sec
Running org.apache.activemq.openwire.v6.MessageAckTest
Tests run: 1, Failures: 0, Errors: 0, Skipped: 0, Time elapsed: 0.196 sec
Running org.apache.activemq.proxy.ProxyFailoverTest
Tests run: 1, Failures: 0, Errors: 0, Skipped: 0, Time elapsed: 30.463 sec
Running org.apache.activemq.openwire.v3.ConsumerControlTest
Tests run: 1, Failures: 0, Errors: 0, Skipped: 0, Time elapsed: 0.183 sec
Running org.apache.activemq.openwire.v5.ReplayCommandTest
Tests run: 1, Failures: 0, Errors: 0, Skipped: 0, Time elapsed: 0.173 sec
Running org.apache.activemq.openwire.v3.ConnectionControlTest
Tests run: 1, Failures: 0, Errors: 0, Skipped: 0, Time elapsed: 0.177 sec
Running org.apache.activemq.JmsCreateConsumerInOnMessageTest
Tests run: 1, Failures: 0, Errors: 0, Skipped: 0, Time elapsed: 0.587 sec
Running org.apache.activemq.broker.advisory.AdvisoryBrokerTest
Tests run: 6, Failures: 0, Errors: 0, Skipped: 0, Time elapsed: 0.737 sec
Running org.apache.activemq.openwire.v6.ConnectionIdTest
Tests run: 1, Failures: 0, Errors: 0, Skipped: 0, Time elapsed: 0.173 sec
Running org.apache.activemq.openwire.v8.RemoveInfoTest
Tests run: 1, Failures: 0, Errors: 0, Skipped: 0, Time elapsed: 0.185 sec
Running org.apache.activemq.openwire.v8.ProducerIdTest
Tests run: 1, Failures: 0, Errors: 0, Skipped: 0, Time elapsed: 0.172 sec
Running org.apache.activemq.xbean.JDBCPersistenceXBeanConfigTest
Tests run: 1, Failures: 0, Errors: 0, Skipped: 0, Time elapsed: 5.931 sec
Running org.apache.activemq.usecases.NetworkAsyncStartTest
Tests run: 2, Failures: 0, Errors: 0, Skipped: 0, Time elapsed: 9.468 sec
Running org.apache.activemq.openwire.v2.RemoveInfoTest
Tests run: 1, Failures: 0, Errors: 0, Skipped: 0, Time elapsed: 0.18 sec
Running org.apache.activemq.jndi.InitialContextTest
Tests run: 3, Failures: 0, Errors: 0, Skipped: 0, Time elapsed: 0.141 sec
Running org.apache.activemq.bugs.AMQ2439Test
Tests run: 1, Failures: 0, Errors: 0, Skipped: 0, Time elapsed: 33.511 sec
Running org.apache.activemq.bugs.TempStorageBlockedBrokerTest
Tests run: 1, Failures: 0, Errors: 0, Skipped: 0, Time elapsed: 103.286 sec
Running org.apache.activemq.bugs.AMQ2314Test
Tests run: 2, Failures: 0, Errors: 0, Skipped: 0, Time elapsed: 103.563 sec
Running org.apache.activemq.openwire.v7.IntegerResponseTest
Tests run: 1, Failures: 0, Errors: 0, Skipped: 0, Time elapsed: 0.179 sec
Running org.apache.activemq.openwire.v5.PartialCommandTest
Tests run: 1, Failures: 0, Errors: 0, Skipped: 0, Time elapsed: 0.176 sec
Running org.apache.activemq.openwire.v1.JournalTopicAckTest
Tests run: 1, Failures: 0, Errors: 0, Skipped: 0, Time elapsed: 0.19 sec
Running org.apache.activemq.usecases.MessageReroutingTest
Tests run: 2, Failures: 0, Errors: 0, Skipped: 0, Time elapsed: 25.561 sec
Running org.apache.activemq.JmsTopicSendReceiveWithTwoConnectionsTest
Tests run: 1, Failures: 0, Errors: 0, Skipped: 0, Time elapsed: 0.649 sec
Running org.apache.activemq.filter.DestinationFilterTest
Tests run: 3, Failures: 0, Errors: 0, Skipped: 0, Time elapsed: 0.049 sec
Running org.apache.activemq.openwire.v4.JournalQueueAckTest
Tests run: 1, Failures: 0, Errors: 0, Skipped: 0, Time elapsed: 0.195 sec
Running org.apache.activemq.blob.FilesystemBlobTest
Tests run: 1, Failures: 0, Errors: 0, Skipped: 0, Time elapsed: 1.632 sec
Running org.apache.activemq.bugs.SlowConsumerTest
Tests run: 1, Failures: 0, Errors: 0, Skipped: 0, Time elapsed: 143.343 sec
Running org.apache.activemq.JmsTopicCompositeSendReceiveTest
Tests run: 1, Failures: 0, Errors: 0, Skipped: 0, Time elapsed: 1.656 sec
Running org.apache.activemq.openwire.v7.RemoveSubscriptionInfoTest
Tests run: 1, Failures: 0, Errors: 0, Skipped: 0, Time elapsed: 0.181 sec
Running org.apache.activemq.kaha.LoadTest
Tests run: 1, Failures: 0, Errors: 0, Skipped: 0, Time elapsed: 54.269 sec
Running org.apache.activemq.broker.advisory.AdvisoryJmxTest
Tests run: 1, Failures: 0, Errors: 0, Skipped: 0, Time elapsed: 0.637 sec
Running org.apache.activemq.usecases.NetworkOfTwentyBrokersTest
Tests run: 5, Failures: 0, Errors: 0, Skipped: 0, Time elapsed: 117.309 sec
Running org.apache.activemq.command.ActiveMQObjectMessageTest
Tests run: 5, Failures: 0, Errors: 0, Skipped: 0, Time elapsed: 0.062 sec
Running org.apache.activemq.bugs.AMQ2982Test
Tests run: 1, Failures: 0, Errors: 0, Skipped: 0, Time elapsed: 14.086 sec
Running org.apache.activemq.openwire.v5.MessageDispatchTest
Tests run: 1, Failures: 0, Errors: 0, Skipped: 0, Time elapsed: 0.204 sec
Running org.apache.activemq.bugs.AMQ2413Test
Tests run: 8, Failures: 0, Errors: 0, Skipped: 0, Time elapsed: 780.405 sec
Running org.apache.activemq.JmsAutoAckListenerTest
Tests run: 1, Failures: 0, Errors: 0, Skipped: 0, Time elapsed: 11.607 sec
Running org.apache.activemq.openwire.v1.IntegerResponseTest
Tests run: 1, Failures: 0, Errors: 0, Skipped: 0, Time elapsed: 0.179 sec
Running org.apache.activemq.bugs.AMQ1917Test
Tests run: 1, Failures: 0, Errors: 0, Skipped: 0, Time elapsed: 6.688 sec
Running org.apache.activemq.bugs.AMQ2870Test
Tests run: 2, Failures: 0, Errors: 0, Skipped: 0, Time elapsed: 324.346 sec
Running org.apache.activemq.openwire.v6.DataResponseTest
Tests run: 1, Failures: 0, Errors: 0, Skipped: 0, Time elapsed: 0.182 sec
Running org.apache.activemq.bugs.AMQ2489Test
Tests run: 2, Failures: 0, Errors: 0, Skipped: 0, Time elapsed: 4.718 sec
Running org.apache.activemq.openwire.v7.ConnectionIdTest
Tests run: 1, Failures: 0, Errors: 0, Skipped: 0, Time elapsed: 0.17 sec
Running org.apache.activemq.blob.BlobTransferPolicyUriTest
Tests run: 1, Failures: 0, Errors: 0, Skipped: 0, Time elapsed: 0.121 sec
Running org.apache.activemq.broker.policy.DestinationCursorConfigTest
Tests run: 2, Failures: 0, Errors: 0, Skipped: 0, Time elapsed: 1.318 sec
Running org.apache.activemq.openwire.v4.SessionIdTest
Tests run: 1, Failures: 0, Errors: 0, Skipped: 0, Time elapsed: 0.174 sec
Running org.apache.activemq.network.jms.QueueBridgeTest
Tests run: 1, Failures: 0, Errors: 0, Skipped: 0, Time elapsed: 1.165 sec
Running org.apache.activemq.bugs.JmsTimeoutTest
Tests run: 2, Failures: 0, Errors: 0, Skipped: 0, Time elapsed: 18.558 sec
Running org.apache.activemq.bugs.AMQ2751Test
Tests run: 1, Failures: 0, Errors: 0, Skipped: 0, Time elapsed: 8.543 sec
Running org.apache.activemq.store.jdbc.JDBCNetworkBrokerDetachTest
Tests run: 2, Failures: 0, Errors: 0, Skipped: 0, Time elapsed: 43.655 sec
Running org.apache.activemq.ConnectionCleanupTest
Tests run: 1, Failures: 0, Errors: 0, Skipped: 0, Time elapsed: 1.332 sec
Running org.apache.activemq.openwire.v1.SubscriptionInfoTest
Tests run: 1, Failures: 0, Errors: 0, Skipped: 0, Time elapsed: 0.188 sec
Running org.apache.activemq.bugs.CraigsBugTest
Tests run: 1, Failures: 0, Errors: 0, Skipped: 0, Time elapsed: 4.532 sec
Running org.apache.activemq.openwire.v5.ProducerInfoTest
Tests run: 1, Failures: 0, Errors: 0, Skipped: 0, Time elapsed: 0.187 sec
Running org.apache.activemq.JmsDurableQueueWildcardSendReceiveTest
Tests run: 1, Failures: 0, Errors: 0, Skipped: 0, Time elapsed: 1.654 sec
Running org.apache.activemq.transport.TopicClusterTest
Tests run: 1, Failures: 0, Errors: 0, Skipped: 0, Time elapsed: 13.44 sec
Running org.apache.activemq.usecases.JMXRemoveQueueThenSendIgnoredTest
Tests run: 2, Failures: 0, Errors: 0, Skipped: 0, Time elapsed: 8.532 sec
Running org.apache.activemq.usecases.DurableSubscriptionSelectorTest
Tests run: 4, Failures: 0, Errors: 0, Skipped: 0, Time elapsed: 133.785 sec
Running org.apache.activemq.openwire.v3.MessagePullTest
Tests run: 1, Failures: 0, Errors: 0, Skipped: 0, Time elapsed: 0.194 sec
Running org.apache.activemq.openwire.v5.DataArrayResponseTest
Tests run: 1, Failures: 0, Errors: 0, Skipped: 0, Time elapsed: 0.186 sec
Running org.apache.activemq.openwire.v2.ConsumerIdTest
Tests run: 1, Failures: 0, Errors: 0, Skipped: 0, Time elapsed: 0.176 sec
Running org.apache.activemq.openwire.v1.WireFormatInfoTest
Tests run: 1, Failures: 0, Errors: 0, Skipped: 0, Time elapsed: 0.178 sec
Running org.apache.activemq.usecases.ThreeBrokerStompTemporaryQueueTest
Tests run: 1, Failures: 0, Errors: 0, Skipped: 0, Time elapsed: 22.297 sec
Running org.apache.activemq.openwire.v5.ProducerIdTest
Tests run: 1, Failures: 0, Errors: 0, Skipped: 0, Time elapsed: 0.176 sec
Running org.apache.activemq.broker.region.cursors.CursorDurableTest
Tests run: 2, Failures: 0, Errors: 0, Skipped: 0, Time elapsed: 14.124 sec
Running org.apache.activemq.openwire.v2.ConnectionInfoTest
Tests run: 1, Failures: 0, Errors: 0, Skipped: 0, Time elapsed: 0.183 sec
Running org.apache.activemq.openwire.v1.JournalQueueAckTest
Tests run: 1, Failures: 0, Errors: 0, Skipped: 0, Time elapsed: 0.2 sec
Running org.apache.activemq.openwire.v1.MessageIdTest
Tests run: 1, Failures: 0, Errors: 0, Skipped: 0, Time elapsed: 0.175 sec
Running org.apache.activemq.broker.scheduler.JmsSchedulerTest
Tests run: 5, Failures: 0, Errors: 0, Skipped: 0, Time elapsed: 109.369 sec
Running org.apache.activemq.usecases.StartAndStopClientAndBrokerDoesNotLeaveThreadsRunningTest
Tests run: 1, Failures: 0, Errors: 0, Skipped: 0, Time elapsed: 2.593 sec
Running org.apache.activemq.openwire.v4.XATransactionIdTest
Tests run: 1, Failures: 0, Errors: 0, Skipped: 0, Time elapsed: 0.367 sec
Running org.apache.activemq.openwire.v3.BrokerIdTest
Tests run: 1, Failures: 0, Errors: 0, Skipped: 0, Time elapsed: 0.173 sec
Running org.apache.activemq.usecases.TopicReplicationTest
Tests run: 1, Failures: 0, Errors: 0, Skipped: 0, Time elapsed: 21.221 sec
Running org.apache.activemq.openwire.v2.ActiveMQTempTopicTest
Tests run: 1, Failures: 0, Errors: 0, Skipped: 0, Time elapsed: 0.184 sec
Running org.apache.activemq.openwire.v3.PartialCommandTest
Tests run: 1, Failures: 0, Errors: 0, Skipped: 0, Time elapsed: 0.175 sec
Running org.apache.activemq.usecases.TopicProducerFlowControlTest
Tests run: 1, Failures: 0, Errors: 0, Skipped: 0, Time elapsed: 54.429 sec
Running org.apache.activemq.usage.MemoryUsageTest
Tests run: 2, Failures: 0, Errors: 0, Skipped: 0, Time elapsed: 0.156 sec
Running org.apache.activemq.openwire.v8.NetworkBridgeFilterTest
Tests run: 1, Failures: 0, Errors: 0, Skipped: 0, Time elapsed: 0.175 sec
Running org.apache.activemq.openwire.v4.PartialCommandTest
Tests run: 1, Failures: 0, Errors: 0, Skipped: 0, Time elapsed: 0.176 sec
Running org.apache.activemq.usecases.DurableConsumerCloseAndReconnectTest
Tests run: 1, Failures: 0, Errors: 0, Skipped: 0, Time elapsed: 16.682 sec
Running org.apache.activemq.openwire.v1.ActiveMQTextMessageTest
Tests run: 1, Failures: 0, Errors: 0, Skipped: 0, Time elapsed: 0.219 sec
Running org.apache.activemq.bugs.DurableConsumerTest
Tests run: 6, Failures: 0, Errors: 0, Skipped: 0, Time elapsed: 4,135.092 sec
Running org.apache.activemq.store.kahadb.PBMesssagesTest
Tests run: 1, Failures: 0, Errors: 0, Skipped: 0, Time elapsed: 0.063 sec
Running org.apache.activemq.openwire.v5.DiscoveryEventTest
Tests run: 1, Failures: 0, Errors: 0, Skipped: 0, Time elapsed: 0.175 sec
Running org.apache.activemq.network.DuplexNetworkMBeanTest
Tests run: 2, Failures: 0, Errors: 0, Skipped: 0, Time elapsed: 22.113 sec
Running org.apache.activemq.bugs.DoubleExpireTest
Tests run: 1, Failures: 0, Errors: 0, Skipped: 0, Time elapsed: 60.659 sec
Running org.apache.activemq.openwire.v3.ConsumerInfoTest
Tests run: 1, Failures: 0, Errors: 0, Skipped: 0, Time elapsed: 0.196 sec
Running org.apache.activemq.util.URISupportTest
Tests run: 12, Failures: 0, Errors: 0, Skipped: 0, Time elapsed: 0.052 sec
Running org.apache.activemq.bugs.AMQ2383Test
Tests run: 1, Failures: 0, Errors: 0, Skipped: 0, Time elapsed: 10.431 sec
Running org.apache.activemq.openwire.v5.MessageDispatchNotificationTest
Tests run: 1, Failures: 0, Errors: 0, Skipped: 0, Time elapsed: 0.191 sec
Running org.apache.activemq.streams.JMSInputStreamTest
Tests run: 8, Failures: 0, Errors: 0, Skipped: 0, Time elapsed: 2.043 sec
Running org.apache.activemq.advisory.TempQueueMemoryTest
Tests run: 2, Failures: 0, Errors: 0, Skipped: 0, Time elapsed: 21.1 sec
Running org.apache.activemq.openwire.v8.MessageAckTest
Tests run: 1, Failures: 0, Errors: 0, Skipped: 0, Time elapsed: 0.197 sec
Running org.apache.activemq.openwire.v8.LastPartialCommandTest
Tests run: 1, Failures: 0, Errors: 0, Skipped: 0, Time elapsed: 0.173 sec
Running org.apache.activemq.openwire.v2.ActiveMQMessageTest
Tests run: 1, Failures: 0, Errors: 0, Skipped: 0, Time elapsed: 0.216 sec
Running org.apache.activemq.broker.policy.PriorityNetworkDispatchPolicyTest
Tests run: 1, Failures: 0, Errors: 0, Skipped: 0, Time elapsed: 0.154 sec
Running org.apache.activemq.JmsTopicWildcardSendReceiveTest
Tests run: 4, Failures: 0, Errors: 0, Skipped: 0, Time elapsed: 1.826 sec
Running org.apache.activemq.openwire.v6.ResponseTest
Tests run: 1, Failures: 0, Errors: 0, Skipped: 0, Time elapsed: 0.178 sec
Running org.apache.activemq.openwire.v2.ConnectionControlTest
Tests run: 1, Failures: 0, Errors: 0, Skipped: 0, Time elapsed: 0.176 sec
Running org.apache.activemq.transport.tcp.SslContextBrokerServiceTest
[locks-and-latches] Releasing all the locks
[locks-and-latches] All the locks released
ERROR: Failed to parse POMs
hudson.remoting.ChannelClosedException: channel is already closed
	at hudson.remoting.Channel.send(Channel.java:486)
	at hudson.remoting.ProxyOutputStream._write(ProxyOutputStream.java:123)
	at hudson.remoting.ProxyOutputStream.write(ProxyOutputStream.java:103)
	at hudson.remoting.RemoteOutputStream.write(RemoteOutputStream.java:110)
	at java.io.BufferedOutputStream.flushBuffer(BufferedOutputStream.java:65)
	at java.io.BufferedOutputStream.flush(BufferedOutputStream.java:123)
	at java.io.BufferedOutputStream.flush(BufferedOutputStream.java:124)
	at java.io.ObjectOutputStream$BlockDataOutputStream.flush(ObjectOutputStream.java:1793)
	at java.io.ObjectOutputStream.flush(ObjectOutputStream.java:699)
	at hudson.remoting.Channel.send(Channel.java:492)
	at hudson.remoting.Request.call(Request.java:161)
	at hudson.remoting.Channel.call(Channel.java:668)
	at hudson.maven.ProcessCache$MavenProcess.call(ProcessCache.java:156)
	at hudson.maven.MavenModuleSetBuild$RunnerImpl.doRun(MavenModuleSetBuild.java:775)
	at hudson.model.AbstractBuild$AbstractRunner.run(AbstractBuild.java:448)
	at hudson.model.Run.run(Run.java:1376)
	at hudson.maven.MavenModuleSetBuild.run(MavenModuleSetBuild.java:479)
	at hudson.model.ResourceController.execute(ResourceController.java:88)
	at hudson.model.Executor.run(Executor.java:230)
Caused by: java.io.IOException: Unexpected termination of the channel
	at hudson.remoting.Channel$ReaderThread.run(Channel.java:1037)
Caused by: java.io.EOFException
	at java.io.ObjectInputStream$BlockDataInputStream.peekByte(ObjectInputStream.java:2553)
	at java.io.ObjectInputStream.readObject0(ObjectInputStream.java:1296)
	at java.io.ObjectInputStream.readObject(ObjectInputStream.java:350)
	at hudson.remoting.Channel$ReaderThread.run(Channel.java:1031)
FATAL: channel is already closed
hudson.remoting.ChannelClosedException: channel is already closed
	at hudson.remoting.Channel.send(Channel.java:486)
	at hudson.remoting.Request.call(Request.java:110)
	at hudson.remoting.Channel.call(Channel.java:668)
	at hudson.Launcher$RemoteLauncher.kill(Launcher.java:812)
	at hudson.model.AbstractBuild$AbstractRunner.run(AbstractBuild.java:471)
	at hudson.model.Run.run(Run.java:1376)
	at hudson.maven.MavenModuleSetBuild.run(MavenModuleSetBuild.java:479)
	at hudson.model.ResourceController.execute(ResourceController.java:88)
	at hudson.model.Executor.run(Executor.java:230)
Caused by: java.io.IOException: Unexpected termination of the channel
	at hudson.remoting.Channel$ReaderThread.run(Channel.java:1037)
Caused by: java.io.EOFException
	at java.io.ObjectInputStream$BlockDataInputStream.peekByte(ObjectInputStream.java:2553)
	at java.io.ObjectInputStream.readObject0(ObjectInputStream.java:1296)
	at java.io.ObjectInputStream.readObject(ObjectInputStream.java:350)
	at hudson.remoting.Channel$ReaderThread.run(Channel.java:1031)


Mime
View raw message