activemq-dev mailing list archives

Site index · List index
Message view « Date » · « Thread »
Top « Date » · « Thread »
From Apache Jenkins Server <jenk...@builds.apache.org>
Subject Build failed in Jenkins: ActiveMQ #742
Date Fri, 26 Aug 2011 09:54:44 GMT
See <https://builds.apache.org/job/ActiveMQ/742/changes>

Changes:

[tabish] apply changes for https://issues.apache.org/jira/browse/AMQ-2961 updates some versions
of dependencies and clean up the versions in the pom files so its easier to change in the
future.

[dejanb] https://issues.apache.org/jira/browse/AMQ-3463 - upgrade maven-bundle-plugin

------------------------------------------
[...truncated 9424 lines...]
Running org.apache.activemq.usecases.PublishOnTopicConsumedMessageTest
Tests run: 1, Failures: 0, Errors: 0, Skipped: 0, Time elapsed: 1.637 sec
Running org.apache.activemq.usecases.TopicReplicationTest
Tests run: 1, Failures: 0, Errors: 0, Skipped: 0, Time elapsed: 13.448 sec
Running org.apache.activemq.usecases.DurableSubscriptionReactivationTest
Tests run: 2, Failures: 0, Errors: 0, Skipped: 0, Time elapsed: 7.712 sec
Running org.apache.activemq.usecases.TwoBrokerNetworkConnectorWildcardDynamicallyIncludedDestinationTest
Tests run: 4, Failures: 0, Errors: 0, Skipped: 0, Time elapsed: 53.634 sec
Running org.apache.activemq.usecases.AuthorizationFromAdminViewTest
Tests run: 1, Failures: 0, Errors: 0, Skipped: 0, Time elapsed: 0.516 sec
Running org.apache.activemq.usecases.NetworkAsyncStartTest
Tests run: 2, Failures: 0, Errors: 0, Skipped: 0, Time elapsed: 10.693 sec
Running org.apache.activemq.usecases.QueueRedeliverTest
Tests run: 4, Failures: 0, Errors: 0, Skipped: 0, Time elapsed: 24.81 sec
Running org.apache.activemq.usecases.ConsumeTopicPrefetchTest
Tests run: 3, Failures: 0, Errors: 0, Skipped: 0, Time elapsed: 0.884 sec
Running org.apache.activemq.usecases.ChangeSessionDeliveryModeTest
Tests run: 1, Failures: 0, Errors: 0, Skipped: 0, Time elapsed: 0.561 sec
Running org.apache.activemq.usecases.LargeQueueSparseDeleteTest
Tests run: 3, Failures: 0, Errors: 0, Skipped: 0, Time elapsed: 6.599 sec
Running org.apache.activemq.usecases.DurableConsumerCloseAndReconnectTest
Tests run: 1, Failures: 0, Errors: 0, Skipped: 0, Time elapsed: 16.618 sec
Running org.apache.activemq.usecases.PublishOnQueueConsumedMessageInTransactionTest
Tests run: 1, Failures: 0, Errors: 0, Skipped: 0, Time elapsed: 6.334 sec
Running org.apache.activemq.usecases.CreateLotsOfTemporaryQueuesTest
Tests run: 1, Failures: 0, Errors: 0, Skipped: 0, Time elapsed: 12.292 sec
Running org.apache.activemq.usecases.BrowseOverNetworkTest
Tests run: 3, Failures: 0, Errors: 0, Skipped: 0, Time elapsed: 47.83 sec
Running org.apache.activemq.usecases.QueueDuplicatesTest
Tests run: 1, Failures: 0, Errors: 0, Skipped: 0, Time elapsed: 26.501 sec
Running org.apache.activemq.usecases.MessageGroupCloseTest
Tests run: 1, Failures: 0, Errors: 0, Skipped: 0, Time elapsed: 5.541 sec
Running org.apache.activemq.usecases.ThreeBrokerVirtualTopicNetworkTest
Tests run: 1, Failures: 0, Errors: 0, Skipped: 0, Time elapsed: 32.465 sec
Running org.apache.activemq.usecases.UnlimitedEnqueueTest
Tests run: 1, Failures: 0, Errors: 0, Skipped: 0, Time elapsed: 1,801.191 sec
Running org.apache.activemq.usecases.MessageGroupDelayedTest
Tests run: 6, Failures: 0, Errors: 0, Skipped: 0, Time elapsed: 36.448 sec
Running org.apache.activemq.usecases.PublishOnTopicConsumerMessageUsingActivemqXMLTest
Tests run: 1, Failures: 0, Errors: 0, Skipped: 0, Time elapsed: 8.388 sec
Running org.apache.activemq.usecases.DurableSubscriptionSelectorTest
Tests run: 4, Failures: 0, Errors: 0, Skipped: 0, Time elapsed: 132.278 sec
Running org.apache.activemq.usecases.TwoBrokerTopicSendReceiveUsingJavaConfigurationTest
Tests run: 1, Failures: 0, Errors: 0, Skipped: 0, Time elapsed: 9.41 sec
Running org.apache.activemq.usecases.ThreeBrokerTempQueueNetworkTest
Tests run: 3, Failures: 0, Errors: 0, Skipped: 0, Time elapsed: 35.871 sec
Running org.apache.activemq.usecases.JdbcDurableSubDupTest
Tests run: 2, Failures: 0, Errors: 0, Skipped: 0, Time elapsed: 267.095 sec
Running org.apache.activemq.usecases.TwoBrokerTopicSendReceiveLotsOfMessagesUsingTcpTest
Tests run: 1, Failures: 0, Errors: 0, Skipped: 0, Time elapsed: 12.445 sec
Running org.apache.activemq.usecases.SubscribeClosePublishThenConsumeTest
Tests run: 1, Failures: 0, Errors: 0, Skipped: 0, Time elapsed: 0.92 sec
Running org.apache.activemq.usecases.AMQStackOverFlowTest
Tests run: 1, Failures: 0, Errors: 0, Skipped: 0, Time elapsed: 5.601 sec
Running org.apache.activemq.usecases.TopicProducerFlowControlTest
Tests run: 1, Failures: 0, Errors: 0, Skipped: 0, Time elapsed: 54.407 sec
Running org.apache.activemq.usecases.ThreeBrokerQueueNetworkTest
Tests run: 13, Failures: 0, Errors: 0, Skipped: 0, Time elapsed: 181.512 sec
Running org.apache.activemq.usecases.ThreeBrokerTopicNetworkTest
Tests run: 9, Failures: 0, Errors: 0, Skipped: 0, Time elapsed: 90.786 sec
Running org.apache.activemq.usecases.ExceptionListenerTest
Tests run: 1, Failures: 0, Errors: 0, Skipped: 0, Time elapsed: 0.025 sec
Running org.apache.activemq.usecases.PublishOnDurableTopicConsumedMessageTest
Tests run: 1, Failures: 0, Errors: 0, Skipped: 0, Time elapsed: 1.696 sec
Running org.apache.activemq.usecases.AdvisoryTopicDeletionTest
Tests run: 2, Failures: 0, Errors: 0, Skipped: 0, Time elapsed: 0.668 sec
Running org.apache.activemq.usecases.TwoBrokerVirtualDestDinamicallyIncludedDestTest
Tests run: 3, Failures: 0, Errors: 0, Skipped: 0, Time elapsed: 42.599 sec
Running org.apache.activemq.usecases.ChangeSentMessageTest
Tests run: 1, Failures: 0, Errors: 0, Skipped: 0, Time elapsed: 0.687 sec
Running org.apache.activemq.usecases.KahaDurableSubscriptionTest
Tests run: 10, Failures: 0, Errors: 0, Skipped: 0, Time elapsed: 22.336 sec
Running org.apache.activemq.usecases.CompositePublishTest
Tests run: 1, Failures: 0, Errors: 0, Skipped: 0, Time elapsed: 62.497 sec
Running org.apache.activemq.usecases.ManagedDurableSubscriptionTest
Tests run: 1, Failures: 0, Errors: 0, Skipped: 0, Time elapsed: 0.782 sec
Running org.apache.activemq.usecases.CompositeConsumeTest
Tests run: 1, Failures: 0, Errors: 0, Skipped: 0, Time elapsed: 0.652 sec
Running org.apache.activemq.usecases.RequestReplyNoAdvisoryNetworkTest
Tests run: 3, Failures: 0, Errors: 0, Skipped: 0, Time elapsed: 25.357 sec
Running org.apache.activemq.usecases.NoDuplicateOnTopicNetworkTest
Tests run: 8, Failures: 0, Errors: 0, Skipped: 0, Time elapsed: 140.019 sec
Running org.apache.activemq.usecases.TransientQueueRedeliverTest
Tests run: 4, Failures: 0, Errors: 0, Skipped: 0, Time elapsed: 24.804 sec
Running org.apache.activemq.usecases.AMQStoreDurableSubscriptionTest
Tests run: 10, Failures: 0, Errors: 0, Skipped: 0, Time elapsed: 24.797 sec
Running org.apache.activemq.usecases.TwoBrokerNetworkLoadBalanceTest
Tests run: 1, Failures: 0, Errors: 0, Skipped: 0, Time elapsed: 6.414 sec
Running org.apache.activemq.usecases.MulticastDiscoveryOnFaultyNetworkTest
Tests run: 2, Failures: 0, Errors: 0, Skipped: 0, Time elapsed: 115.485 sec
Running org.apache.activemq.usecases.QueueMemoryFullMultiBrokersTest
Tests run: 1, Failures: 0, Errors: 0, Skipped: 0, Time elapsed: 14.435 sec
Running org.apache.activemq.usecases.ExpiredMessagesWithNoConsumerTest
Tests run: 9, Failures: 2, Errors: 0, Skipped: 0, Time elapsed: 855.402 sec <<< FAILURE!
Running org.apache.activemq.usecases.NetworkOfTwentyBrokersTest
Tests run: 5, Failures: 0, Errors: 0, Skipped: 0, Time elapsed: 110.942 sec
Running org.apache.activemq.usecases.StartAndStopClientAndBrokerDoesNotLeaveThreadsRunningTest
Tests run: 1, Failures: 0, Errors: 0, Skipped: 0, Time elapsed: 2.597 sec
Running org.apache.activemq.usecases.DurableUnsubscribeTest
Tests run: 2, Failures: 0, Errors: 0, Skipped: 0, Time elapsed: 16.45 sec
Running org.apache.activemq.usecases.DiscriminatingConsumerLoadTest
Tests run: 2, Failures: 0, Errors: 0, Skipped: 0, Time elapsed: 59.629 sec
Running org.apache.activemq.usecases.ReliableReconnectTest
Tests run: 1, Failures: 0, Errors: 0, Skipped: 0, Time elapsed: 8.149 sec
Running org.apache.activemq.usecases.TwoBrokerTopicSendReceiveTest
Tests run: 1, Failures: 0, Errors: 0, Skipped: 0, Time elapsed: 10.029 sec
Running org.apache.activemq.usecases.TwoBrokerQueueSendReceiveTest
Tests run: 1, Failures: 0, Errors: 0, Skipped: 0, Time elapsed: 10.064 sec
Running org.apache.activemq.usecases.ThreeBrokerStompTemporaryQueueTest
Tests run: 1, Failures: 0, Errors: 0, Skipped: 0, Time elapsed: 25.511 sec
Running org.apache.activemq.usecases.ConsumeQueuePrefetchTest
Tests run: 4, Failures: 0, Errors: 0, Skipped: 0, Time elapsed: 6.103 sec
Running org.apache.activemq.usecases.MessageGroupNewConsumerTest
Tests run: 1, Failures: 0, Errors: 0, Skipped: 0, Time elapsed: 4.058 sec
Running org.apache.activemq.usecases.TopicRedeliverTest
Tests run: 4, Failures: 0, Errors: 0, Skipped: 0, Time elapsed: 24.783 sec
Running org.apache.activemq.usecases.ThreeBrokerQueueNetworkUsingTcpTest
Tests run: 13, Failures: 0, Errors: 0, Skipped: 0, Time elapsed: 183.856 sec
Running org.apache.activemq.usecases.MultiBrokersMultiClientsUsingTcpTest
Tests run: 2, Failures: 0, Errors: 0, Skipped: 0, Time elapsed: 35.359 sec
Running org.apache.activemq.usecases.TwoBrokerNetworkConnectorWildcardStaticallyIncludedDestinationTest
Tests run: 4, Failures: 0, Errors: 0, Skipped: 0, Time elapsed: 54.116 sec
Running org.apache.activemq.usecases.DurableSubProcessTest
Tests run: 1, Failures: 0, Errors: 0, Skipped: 0, Time elapsed: 240.961 sec
Running org.apache.activemq.selector.SelectorParserTest
Tests run: 2, Failures: 0, Errors: 0, Skipped: 0, Time elapsed: 0.125 sec
Running org.apache.activemq.selector.SelectorTest
Tests run: 20, Failures: 0, Errors: 0, Skipped: 0, Time elapsed: 0.401 sec
Running org.apache.activemq.JmsTopicTransactionTest
Tests run: 14, Failures: 0, Errors: 0, Skipped: 0, Time elapsed: 20.021 sec
Running org.apache.activemq.ExpiryHogTest
Tests run: 1, Failures: 0, Errors: 0, Skipped: 0, Time elapsed: 41.786 sec
Running org.apache.activemq.OnePrefetchAsyncConsumerTest
Tests run: 1, Failures: 0, Errors: 0, Skipped: 0, Time elapsed: 6.549 sec
Running org.apache.activemq.MessageEvictionTest
Tests run: 3, Failures: 0, Errors: 0, Skipped: 0, Time elapsed: 93.39 sec
Running org.apache.activemq.JmsTopicSelectorTest
Tests run: 3, Failures: 0, Errors: 0, Skipped: 0, Time elapsed: 8.732 sec
Running org.apache.activemq.JmsTopicRedeliverTest
Tests run: 1, Failures: 0, Errors: 0, Skipped: 0, Time elapsed: 1.605 sec
Running org.apache.activemq.util.LRUCacheTest
Tests run: 1, Failures: 0, Errors: 0, Skipped: 0, Time elapsed: 12.383 sec
Running org.apache.activemq.util.LinkedNodeTest
Tests run: 3, Failures: 0, Errors: 0, Skipped: 0, Time elapsed: 0.026 sec
Running org.apache.activemq.util.ReflectionSupportTest
Tests run: 3, Failures: 0, Errors: 0, Skipped: 0, Time elapsed: 0.079 sec
Running org.apache.activemq.util.URISupportTest
Tests run: 12, Failures: 0, Errors: 0, Skipped: 0, Time elapsed: 0.035 sec
Running org.apache.activemq.util.DataByteArrayInputStreamTest
Tests run: 1, Failures: 0, Errors: 0, Skipped: 0, Time elapsed: 8.321 sec
Running org.apache.activemq.util.BitArrayBinTest
Tests run: 5, Failures: 0, Errors: 0, Skipped: 0, Time elapsed: 0.108 sec
Running org.apache.activemq.util.DataByteArrayOutputStreamTest
Tests run: 1, Failures: 0, Errors: 0, Skipped: 0, Time elapsed: 0.026 sec
Running org.apache.activemq.util.MarshallingSupportTest
Tests run: 1, Failures: 0, Errors: 0, Skipped: 0, Time elapsed: 0.039 sec
Running org.apache.activemq.broker.scheduler.JobSchedulerTest
Tests run: 9, Failures: 0, Errors: 0, Skipped: 0, Time elapsed: 24.363 sec
Running org.apache.activemq.broker.scheduler.JobSchedulerStoreTest
Tests run: 1, Failures: 0, Errors: 0, Skipped: 0, Time elapsed: 1.749 sec
Running org.apache.activemq.broker.scheduler.JobSchedulerManagementTest
Tests run: 7, Failures: 0, Errors: 0, Skipped: 0, Time elapsed: 76.554 sec
Running org.apache.activemq.broker.scheduler.JmsSchedulerTest
Tests run: 5, Failures: 0, Errors: 0, Skipped: 0, Time elapsed: 86.873 sec
Running org.apache.activemq.broker.scheduler.CronParserTest
Tests run: 13, Failures: 0, Errors: 0, Skipped: 0, Time elapsed: 0.149 sec
Running org.apache.activemq.broker.scheduler.JmsCronSchedulerTest
Tests run: 2, Failures: 0, Errors: 0, Skipped: 0, Time elapsed: 198.578 sec
Running org.apache.activemq.broker.advisory.AdvisoryDuplexNetworkBridgeTest
Tests run: 2, Failures: 0, Errors: 0, Skipped: 0, Time elapsed: 11.339 sec
Running org.apache.activemq.broker.advisory.AdvisoryNetworkBridgeTest
Tests run: 2, Failures: 0, Errors: 0, Skipped: 0, Time elapsed: 10.526 sec
Running org.apache.activemq.broker.advisory.AdvisoryBrokerTest
Tests run: 6, Failures: 0, Errors: 0, Skipped: 0, Time elapsed: 0.749 sec
Running org.apache.activemq.broker.advisory.AdvisoryJmxTest
Tests run: 1, Failures: 0, Errors: 0, Skipped: 0, Time elapsed: 0.656 sec
Running org.apache.activemq.broker.message.security.MessageAuthenticationTest
Tests run: 1, Failures: 0, Errors: 0, Skipped: 0, Time elapsed: 0.643 sec
Running org.apache.activemq.broker.RecoveryBrokerTest
Tests run: 9, Failures: 0, Errors: 0, Skipped: 0, Time elapsed: 31.054 sec
Running org.apache.activemq.broker.OutOfOrderXMLTest
Tests run: 1, Failures: 0, Errors: 0, Skipped: 0, Time elapsed: 1.766 sec
Running org.apache.activemq.broker.ft.TopicMasterSlaveTest
Tests run: 1, Failures: 0, Errors: 0, Skipped: 0, Time elapsed: 14.853 sec
Running org.apache.activemq.broker.ft.DbRestartJDBCQueueTest
Tests run: 1, Failures: 0, Errors: 0, Skipped: 0, Time elapsed: 18.798 sec
Running org.apache.activemq.broker.ft.MasterSlaveSlaveDieTest
Tests run: 1, Failures: 0, Errors: 0, Skipped: 0, Time elapsed: 2.377 sec
Running org.apache.activemq.broker.ft.QueueMasterSlaveSingleUrlTest
Tests run: 1, Failures: 0, Errors: 0, Skipped: 0, Time elapsed: 7.33 sec
Running org.apache.activemq.broker.ft.MasterSlaveProducerFlowControlTest
Tests run: 6, Failures: 0, Errors: 0, Skipped: 0, Time elapsed: 25.697 sec
Running org.apache.activemq.broker.ft.MasterSlaveSlaveShutdownTest
Tests run: 1, Failures: 0, Errors: 0, Skipped: 0, Time elapsed: 33.097 sec
Running org.apache.activemq.broker.ft.QueueMasterSlaveTestUsingSharedFileTest
Tests run: 1, Failures: 0, Errors: 0, Skipped: 0, Time elapsed: 17.612 sec
Running org.apache.activemq.broker.ft.QueueMasterSlaveUsingMasterConnectorElementTest
Tests run: 1, Failures: 0, Errors: 0, Skipped: 0, Time elapsed: 17.755 sec
Running org.apache.activemq.broker.ft.TransactedTopicMasterSlaveTest
Build timed out (after 575 minutes). Marking the build as aborted.
Sending e-mails to: dev@activemq.apache.org
[locks-and-latches] Releasing all the locks
[locks-and-latches] All the locks released
ERROR: Failed to parse POMs
hudson.remoting.ChannelClosedException: channel is already closed
	at hudson.remoting.Channel.send(Channel.java:486)
	at hudson.remoting.ProxyOutputStream._write(ProxyOutputStream.java:123)
	at hudson.remoting.ProxyOutputStream.write(ProxyOutputStream.java:103)
	at hudson.remoting.RemoteOutputStream.write(RemoteOutputStream.java:110)
	at java.io.BufferedOutputStream.flushBuffer(BufferedOutputStream.java:65)
	at java.io.BufferedOutputStream.flush(BufferedOutputStream.java:123)
	at java.io.BufferedOutputStream.flush(BufferedOutputStream.java:124)
	at java.io.ObjectOutputStream$BlockDataOutputStream.flush(ObjectOutputStream.java:1793)
	at java.io.ObjectOutputStream.flush(ObjectOutputStream.java:699)
	at hudson.remoting.Channel.send(Channel.java:492)
	at hudson.remoting.Request.call(Request.java:161)
	at hudson.remoting.Channel.call(Channel.java:668)
	at hudson.maven.ProcessCache$MavenProcess.call(ProcessCache.java:156)
	at hudson.maven.MavenModuleSetBuild$RunnerImpl.doRun(MavenModuleSetBuild.java:775)
	at hudson.model.AbstractBuild$AbstractRunner.run(AbstractBuild.java:448)
	at hudson.model.Run.run(Run.java:1376)
	at hudson.maven.MavenModuleSetBuild.run(MavenModuleSetBuild.java:479)
	at hudson.model.ResourceController.execute(ResourceController.java:88)
	at hudson.model.Executor.run(Executor.java:230)
Caused by: java.io.IOException: Unexpected termination of the channel
	at hudson.remoting.Channel$ReaderThread.run(Channel.java:1037)
Caused by: java.io.EOFException
	at java.io.ObjectInputStream$BlockDataInputStream.peekByte(ObjectInputStream.java:2553)
	at java.io.ObjectInputStream.readObject0(ObjectInputStream.java:1296)
	at java.io.ObjectInputStream.readObject(ObjectInputStream.java:350)
	at hudson.remoting.Channel$ReaderThread.run(Channel.java:1031)
FATAL: channel is already closed
hudson.remoting.ChannelClosedException: channel is already closed
	at hudson.remoting.Channel.send(Channel.java:486)
	at hudson.remoting.Request.call(Request.java:110)
	at hudson.remoting.Channel.call(Channel.java:668)
	at hudson.Launcher$RemoteLauncher.kill(Launcher.java:812)
	at hudson.model.AbstractBuild$AbstractRunner.run(AbstractBuild.java:471)
	at hudson.model.Run.run(Run.java:1376)
	at hudson.maven.MavenModuleSetBuild.run(MavenModuleSetBuild.java:479)
	at hudson.model.ResourceController.execute(ResourceController.java:88)
	at hudson.model.Executor.run(Executor.java:230)
Caused by: java.io.IOException: Unexpected termination of the channel
	at hudson.remoting.Channel$ReaderThread.run(Channel.java:1037)
Caused by: java.io.EOFException
	at java.io.ObjectInputStream$BlockDataInputStream.peekByte(ObjectInputStream.java:2553)
	at java.io.ObjectInputStream.readObject0(ObjectInputStream.java:1296)
	at java.io.ObjectInputStream.readObject(ObjectInputStream.java:350)
	at hudson.remoting.Channel$ReaderThread.run(Channel.java:1031)


Mime
View raw message