activemq-dev mailing list archives

Site index · List index
Message view « Date » · « Thread »
Top « Date » · « Thread »
From Apache Jenkins Server <jenk...@builds.apache.org>
Subject Build failed in Jenkins: ActiveMQ #721
Date Thu, 04 Aug 2011 21:38:15 GMT
See <https://builds.apache.org/job/ActiveMQ/721/changes>

Changes:

[gtully] resolve intermittent failure with this test, fix up the sync

------------------------------------------
[...truncated 9415 lines...]
Running org.apache.activemq.openwire.v5.ConnectionInfoTest
Tests run: 1, Failures: 0, Errors: 0, Skipped: 0, Time elapsed: 0.451 sec
Running org.apache.activemq.JmsQueueWildcardSendReceiveTest
Tests run: 4, Failures: 0, Errors: 0, Skipped: 0, Time elapsed: 1.872 sec
Running org.apache.activemq.MessageEvictionTest
Tests run: 3, Failures: 0, Errors: 0, Skipped: 0, Time elapsed: 98.337 sec
Running org.apache.activemq.usecases.TwoBrokerQueueClientsReconnectTest
Tests run: 9, Failures: 0, Errors: 0, Skipped: 0, Time elapsed: 66.745 sec
Running org.apache.activemq.usecases.MultiBrokersMultiClientsUsingTcpTest
Tests run: 2, Failures: 0, Errors: 0, Skipped: 0, Time elapsed: 35.728 sec
Running org.apache.activemq.openwire.v4.JournalTopicAckTest
Tests run: 1, Failures: 0, Errors: 0, Skipped: 0, Time elapsed: 0.188 sec
Running org.apache.activemq.broker.CreateDestinationsOnStartupViaXBeanTest
Tests run: 1, Failures: 0, Errors: 0, Skipped: 0, Time elapsed: 3.636 sec
Running org.apache.activemq.broker.policy.RoundRobinDispatchPolicyTest
Tests run: 9, Failures: 0, Errors: 0, Skipped: 0, Time elapsed: 3.476 sec
Running org.apache.activemq.network.jms.TopicBridgeXBeanTest
Tests run: 1, Failures: 0, Errors: 0, Skipped: 0, Time elapsed: 1.072 sec
Running org.apache.activemq.transport.stomp.StompNIOSSLTest
Tests run: 52, Failures: 0, Errors: 0, Skipped: 0, Time elapsed: 197.131 sec
Running org.apache.activemq.test.rollback.RollbacksWhileConsumingLargeQueueTest
Tests run: 2, Failures: 0, Errors: 0, Skipped: 0, Time elapsed: 5.426 sec
Running org.apache.activemq.test.retroactive.RetroactiveConsumerTestWithSimpleMessageListTest
Tests run: 1, Failures: 0, Errors: 0, Skipped: 0, Time elapsed: 1.683 sec
Running org.apache.activemq.openwire.v3.ReplayCommandTest
Tests run: 1, Failures: 0, Errors: 0, Skipped: 0, Time elapsed: 0.181 sec
Running org.apache.activemq.openwire.v8.ConnectionControlTest
Tests run: 1, Failures: 0, Errors: 0, Skipped: 0, Time elapsed: 0.175 sec
Running org.apache.activemq.filter.BadDummyPolicyConfigTest
Tests run: 3, Failures: 0, Errors: 0, Skipped: 0, Time elapsed: 0.131 sec
Running org.apache.activemq.openwire.v5.ControlCommandTest
Tests run: 1, Failures: 0, Errors: 0, Skipped: 0, Time elapsed: 0.18 sec
Running org.apache.activemq.openwire.v4.SessionInfoTest
Tests run: 1, Failures: 0, Errors: 0, Skipped: 0, Time elapsed: 0.41 sec
Running org.apache.activemq.openwire.v2.ConsumerControlTest
Tests run: 1, Failures: 0, Errors: 0, Skipped: 0, Time elapsed: 0.181 sec
Running org.apache.activemq.broker.policy.PerDurableConsumerDeadLetterTest
Tests run: 4, Failures: 0, Errors: 0, Skipped: 0, Time elapsed: 2.319 sec
Running org.apache.activemq.openwire.v6.MessageDispatchTest
Tests run: 1, Failures: 0, Errors: 0, Skipped: 0, Time elapsed: 0.242 sec
Running org.apache.activemq.openwire.v6.MessageDispatchNotificationTest
Tests run: 1, Failures: 0, Errors: 0, Skipped: 0, Time elapsed: 0.2 sec
Running org.apache.activemq.JMSMessageTest
Tests run: 28, Failures: 0, Errors: 0, Skipped: 0, Time elapsed: 1.571 sec
Running org.apache.activemq.openwire.v4.ProducerAckTest
Tests run: 1, Failures: 0, Errors: 0, Skipped: 0, Time elapsed: 0.266 sec
Running org.apache.activemq.openwire.v6.SessionInfoTest
Tests run: 1, Failures: 0, Errors: 0, Skipped: 0, Time elapsed: 0.174 sec
Running org.apache.activemq.openwire.v1.MessageDispatchNotificationTest
Tests run: 1, Failures: 0, Errors: 0, Skipped: 0, Time elapsed: 0.194 sec
Running org.apache.activemq.thread.PooledTaskRunnerTest
Tests run: 3, Failures: 0, Errors: 0, Skipped: 0, Time elapsed: 0.241 sec
Running org.apache.activemq.usecases.MessageGroupDelayedTest
Tests run: 6, Failures: 0, Errors: 0, Skipped: 0, Time elapsed: 36.42 sec
Running org.apache.activemq.broker.store.TransactionStoreTest
Tests run: 1, Failures: 0, Errors: 0, Skipped: 0, Time elapsed: 0.374 sec
Running org.apache.activemq.bugs.AMQ3145Test
Tests run: 1, Failures: 0, Errors: 0, Skipped: 0, Time elapsed: 6.94 sec
Running org.apache.activemq.openwire.v5.RemoveInfoTest
Tests run: 1, Failures: 0, Errors: 0, Skipped: 0, Time elapsed: 0.181 sec
Running org.apache.activemq.openwire.v8.ConnectionIdTest
Tests run: 1, Failures: 0, Errors: 0, Skipped: 0, Time elapsed: 0.168 sec
Running org.apache.activemq.test.JmsTopicSendReceiveWithTwoConnectionsTest
Tests run: 1, Failures: 0, Errors: 0, Skipped: 0, Time elapsed: 1.623 sec
Running org.apache.activemq.openwire.v6.DataArrayResponseTest
Tests run: 1, Failures: 0, Errors: 0, Skipped: 0, Time elapsed: 0.182 sec
Running org.apache.activemq.openwire.v4.SubscriptionInfoTest
Tests run: 1, Failures: 0, Errors: 0, Skipped: 0, Time elapsed: 0.181 sec
Running org.apache.activemq.broker.region.QueuePurgeTest
Running org.apache.activemq.usecases.ConsumeTopicPrefetchTest
Tests run: 3, Failures: 0, Errors: 0, Skipped: 0, Time elapsed: 0.874 sec
Running org.apache.activemq.openwire.v5.MessagePullTest
Tests run: 1, Failures: 0, Errors: 0, Skipped: 0, Time elapsed: 0.199 sec
Running org.apache.activemq.transport.tcp.SslTransportServerTest
Tests run: 2, Failures: 0, Errors: 0, Skipped: 0, Time elapsed: 2.078 sec
Running org.apache.activemq.bugs.AMQ2401Test
Tests run: 1, Failures: 0, Errors: 0, Skipped: 0, Time elapsed: 15.084 sec
Running org.apache.activemq.network.ForwardingBridgeTest
Tests run: 4, Failures: 0, Errors: 0, Skipped: 0, Time elapsed: 8.43 sec
Running org.apache.activemq.JMSQueueRedeliverTest
Tests run: 1, Failures: 0, Errors: 0, Skipped: 0, Time elapsed: 1.62 sec
Running org.apache.activemq.xbean.MultipleTestsWithEmbeddedBrokerTest
Tests run: 2, Failures: 0, Errors: 0, Skipped: 0, Time elapsed: 0.569 sec
Running org.apache.activemq.JmsDurableTopicTransactionTest
Tests run: 14, Failures: 0, Errors: 0, Skipped: 0, Time elapsed: 20.213 sec
Running org.apache.activemq.openwire.v6.SessionIdTest
Tests run: 1, Failures: 0, Errors: 0, Skipped: 0, Time elapsed: 0.166 sec
Running org.apache.activemq.openwire.v8.SessionInfoTest
Tests run: 1, Failures: 0, Errors: 0, Skipped: 0, Time elapsed: 0.176 sec
Running org.apache.activemq.bugs.JmsDurableTopicSlowReceiveTest
Tests run: 2, Failures: 0, Errors: 0, Skipped: 0, Time elapsed: 110.958 sec
Running org.apache.activemq.kaha.impl.index.VMIndexLinkedListTest
Tests run: 17, Failures: 0, Errors: 0, Skipped: 0, Time elapsed: 0.055 sec
Running org.apache.activemq.openwire.v6.SubscriptionInfoTest
Tests run: 1, Failures: 0, Errors: 0, Skipped: 0, Time elapsed: 0.179 sec
Running org.apache.activemq.openwire.v5.DataResponseTest
Tests run: 1, Failures: 0, Errors: 0, Skipped: 0, Time elapsed: 0.183 sec
Running org.apache.activemq.openwire.v1.ReplayCommandTest
Tests run: 1, Failures: 0, Errors: 0, Skipped: 0, Time elapsed: 0.168 sec
Running org.apache.activemq.openwire.v7.DestinationInfoTest
Tests run: 1, Failures: 0, Errors: 0, Skipped: 0, Time elapsed: 0.187 sec
Running org.apache.activemq.openwire.v5.ResponseTest
Tests run: 1, Failures: 0, Errors: 0, Skipped: 0, Time elapsed: 0.171 sec
Running org.apache.activemq.JMSExclusiveConsumerTest
Tests run: 5, Failures: 0, Errors: 0, Skipped: 0, Time elapsed: 5.826 sec
Running org.apache.activemq.openwire.v4.ShutdownInfoTest
Tests run: 1, Failures: 0, Errors: 0, Skipped: 0, Time elapsed: 0.171 sec
Running org.apache.activemq.ConsumerReceiveWithTimeoutTest
Tests run: 1, Failures: 0, Errors: 0, Skipped: 0, Time elapsed: 10.596 sec
Running org.apache.activemq.bugs.JMSDurableTopicNoLocalTest
Tests run: 1, Failures: 0, Errors: 0, Skipped: 0, Time elapsed: 6.503 sec
Running org.apache.activemq.openwire.v8.ControlCommandTest
Tests run: 1, Failures: 0, Errors: 0, Skipped: 0, Time elapsed: 0.171 sec
Running org.apache.activemq.usecases.ObjectMessageNotSerializableTest
Tests run: 2, Failures: 0, Errors: 0, Skipped: 0, Time elapsed: 4.389 sec
Running org.apache.activemq.test.JmsTopicSendReceiveWithEmbeddedBrokerAndUserIDTest
Tests run: 2, Failures: 0, Errors: 0, Skipped: 0, Time elapsed: 7.185 sec
Running org.apache.activemq.openwire.v2.MessageIdTest
Tests run: 1, Failures: 0, Errors: 0, Skipped: 0, Time elapsed: 0.171 sec
Running org.apache.activemq.openwire.v2.LastPartialCommandTest
Tests run: 1, Failures: 0, Errors: 0, Skipped: 0, Time elapsed: 0.175 sec
Running org.apache.activemq.broker.virtual.FilteredQueueTest
Tests run: 1, Failures: 0, Errors: 0, Skipped: 0, Time elapsed: 2.556 sec
Running org.apache.activemq.openwire.v4.DataArrayResponseTest
Tests run: 1, Failures: 0, Errors: 0, Skipped: 0, Time elapsed: 0.189 sec
Running org.apache.activemq.openwire.v4.TransactionInfoTest
Tests run: 1, Failures: 0, Errors: 0, Skipped: 0, Time elapsed: 0.18 sec
Running org.apache.activemq.broker.ft.TransactedTopicMasterSlaveTest
Tests run: 15, Failures: 0, Errors: 0, Skipped: 0, Time elapsed: 99.383 sec
Running org.apache.activemq.broker.advisory.AdvisoryNetworkBridgeTest
Tests run: 2, Failures: 0, Errors: 0, Skipped: 0, Time elapsed: 10.525 sec
Running org.apache.activemq.openwire.v4.NetworkBridgeFilterTest
Tests run: 1, Failures: 0, Errors: 0, Skipped: 0, Time elapsed: 0.169 sec
Running org.apache.activemq.JmsTopicSendReceiveTest
Tests run: 1, Failures: 0, Errors: 0, Skipped: 0, Time elapsed: 0.64 sec
Running org.apache.activemq.transport.failover.ReconnectTest
Tests run: 1, Failures: 0, Errors: 0, Skipped: 0, Time elapsed: 20.089 sec
Running org.apache.activemq.broker.policy.AbortSlowConsumerTest
Tests run: 19, Failures: 0, Errors: 0, Skipped: 0, Time elapsed: 137.705 sec
Running org.apache.activemq.openwire.v5.MessageIdTest
Tests run: 1, Failures: 0, Errors: 0, Skipped: 0, Time elapsed: 0.173 sec
Running org.apache.activemq.blob.FTPBlobDownloadStrategyTest
Tests run: 3, Failures: 0, Errors: 0, Skipped: 0, Time elapsed: 1.716 sec
Running org.apache.activemq.openwire.v1.SessionIdTest
Tests run: 1, Failures: 0, Errors: 0, Skipped: 0, Time elapsed: 0.166 sec
Running org.apache.activemq.broker.policy.IndividualDeadLetterViaXmlTest
Tests run: 4, Failures: 0, Errors: 0, Skipped: 0, Time elapsed: 3.255 sec
Running org.apache.activemq.openwire.v6.IntegerResponseTest
Tests run: 1, Failures: 0, Errors: 0, Skipped: 0, Time elapsed: 0.172 sec
Running org.apache.activemq.transport.stomp.StompTest
Tests run: 52, Failures: 0, Errors: 0, Skipped: 0, Time elapsed: 177.284 sec
Running org.apache.activemq.openwire.v1.MessageAckTest
Tests run: 1, Failures: 0, Errors: 0, Skipped: 0, Time elapsed: 0.195 sec
Running org.apache.activemq.openwire.v3.SubscriptionInfoTest
Tests run: 1, Failures: 0, Errors: 0, Skipped: 0, Time elapsed: 0.18 sec
Running org.apache.activemq.usecases.DurableSubscriptionReactivationTest
Tests run: 2, Failures: 0, Errors: 0, Skipped: 0, Time elapsed: 9.131 sec
Running org.apache.activemq.store.kahadb.NoSpaceIOTest
Tests run: 1, Failures: 0, Errors: 0, Skipped: 1, Time elapsed: 0.067 sec
Running org.apache.activemq.transport.stomp.StompAdvisoryTest
Tests run: 7, Failures: 0, Errors: 0, Skipped: 0, Time elapsed: 28.385 sec
Running org.apache.activemq.openwire.v1.FlushCommandTest
Tests run: 1, Failures: 0, Errors: 0, Skipped: 0, Time elapsed: 0.17 sec
Running org.apache.activemq.openwire.v6.RemoveInfoTest
Tests run: 1, Failures: 0, Errors: 0, Skipped: 0, Time elapsed: 0.18 sec
Running org.apache.activemq.openwire.v7.ExceptionResponseTest
Tests run: 1, Failures: 0, Errors: 0, Skipped: 0, Time elapsed: 0.196 sec
Running org.apache.activemq.usecases.BrowseOverNetworkTest
Tests run: 3, Failures: 1, Errors: 0, Skipped: 0, Time elapsed: 55.905 sec <<< FAILURE!
Running org.apache.activemq.openwire.v3.KeepAliveInfoTest
Tests run: 1, Failures: 0, Errors: 0, Skipped: 0, Time elapsed: 0.171 sec
Running org.apache.activemq.store.jdbc.JDBCNegativeQueueTest
Tests run: 7, Failures: 0, Errors: 0, Skipped: 0, Time elapsed: 1,040.719 sec
Running org.apache.activemq.bugs.AMQ2584ConcurrentDlqTest
Tests run: 1, Failures: 0, Errors: 0, Skipped: 0, Time elapsed: 117.816 sec
Running org.apache.activemq.openwire.v5.ConsumerInfoTest
Tests run: 1, Failures: 0, Errors: 0, Skipped: 0, Time elapsed: 0.242 sec
Running org.apache.activemq.openwire.v2.PartialCommandTest
Tests run: 1, Failures: 0, Errors: 0, Skipped: 0, Time elapsed: 0.168 sec
Running org.apache.activemq.openwire.v8.ConnectionErrorTest
Tests run: 1, Failures: 0, Errors: 0, Skipped: 0, Time elapsed: 0.175 sec
Running org.apache.activemq.openwire.v1.ProducerInfoTest
Tests run: 1, Failures: 0, Errors: 0, Skipped: 0, Time elapsed: 0.188 sec
Running org.apache.activemq.store.kahadb.KahaDBStoreOrderTest
Tests run: 2, Failures: 0, Errors: 0, Skipped: 0, Time elapsed: 5.955 sec
Running org.apache.activemq.openwire.v2.JournalTransactionTest
Tests run: 1, Failures: 0, Errors: 0, Skipped: 0, Time elapsed: 0.189 sec
Running org.apache.activemq.security.SecurityJMXTest
Tests run: 2, Failures: 0, Errors: 0, Skipped: 0, Time elapsed: 6.308 sec
Running org.apache.activemq.xbean.XBeanStartFalseTest
Tests run: 1, Failures: 0, Errors: 0, Skipped: 0, Time elapsed: 1.088 sec
Running org.apache.activemq.openwire.v3.NetworkBridgeFilterTest
Tests run: 1, Failures: 0, Errors: 0, Skipped: 0, Time elapsed: 0.189 sec
Running org.apache.activemq.openwire.v2.SessionIdTest
Tests run: 1, Failures: 0, Errors: 0, Skipped: 0, Time elapsed: 0.171 sec
Running org.apache.activemq.broker.scheduler.CronParserTest
Tests run: 13, Failures: 0, Errors: 0, Skipped: 0, Time elapsed: 0.154 sec
Running org.apache.activemq.transport.tcp.InactivityMonitorTest
Tests run: 3, Failures: 0, Errors: 0, Skipped: 0, Time elapsed: 16.307 sec
Running org.apache.activemq.transport.discovery.DiscoveryNetworkReconnectTest
Build timed out (after 575 minutes). Marking the build as aborted.
[locks-and-latches] Releasing all the locks
[locks-and-latches] All the locks released
ERROR: Failed to parse POMs
hudson.remoting.ChannelClosedException: channel is already closed
	at hudson.remoting.Channel.send(Channel.java:480)
	at hudson.remoting.ProxyOutputStream._write(ProxyOutputStream.java:123)
	at hudson.remoting.ProxyOutputStream.write(ProxyOutputStream.java:103)
	at hudson.remoting.RemoteOutputStream.write(RemoteOutputStream.java:110)
	at java.io.BufferedOutputStream.flushBuffer(BufferedOutputStream.java:65)
	at java.io.BufferedOutputStream.flush(BufferedOutputStream.java:123)
	at java.io.BufferedOutputStream.flush(BufferedOutputStream.java:124)
	at java.io.ObjectOutputStream$BlockDataOutputStream.flush(ObjectOutputStream.java:1793)
	at java.io.ObjectOutputStream.flush(ObjectOutputStream.java:699)
	at hudson.remoting.Channel.send(Channel.java:486)
	at hudson.remoting.Request.call(Request.java:149)
	at hudson.remoting.Channel.call(Channel.java:661)
	at hudson.maven.ProcessCache$MavenProcess.call(ProcessCache.java:156)
	at hudson.maven.MavenModuleSetBuild$RunnerImpl.doRun(MavenModuleSetBuild.java:736)
	at hudson.model.AbstractBuild$AbstractRunner.run(AbstractBuild.java:429)
	at hudson.model.Run.run(Run.java:1374)
	at hudson.maven.MavenModuleSetBuild.run(MavenModuleSetBuild.java:467)
	at hudson.model.ResourceController.execute(ResourceController.java:88)
	at hudson.model.Executor.run(Executor.java:145)
Caused by: java.io.IOException: Unexpected termination of the channel
	at hudson.remoting.Channel$ReaderThread.run(Channel.java:1019)
Caused by: java.io.EOFException
	at java.io.ObjectInputStream$BlockDataInputStream.peekByte(ObjectInputStream.java:2553)
	at java.io.ObjectInputStream.readObject0(ObjectInputStream.java:1296)
	at java.io.ObjectInputStream.readObject(ObjectInputStream.java:350)
	at hudson.remoting.Channel$ReaderThread.run(Channel.java:1013)
FATAL: channel is already closed
hudson.remoting.ChannelClosedException: channel is already closed
	at hudson.remoting.Channel.send(Channel.java:480)
	at hudson.remoting.Request.call(Request.java:105)
	at hudson.remoting.Channel.call(Channel.java:661)
	at hudson.Launcher$RemoteLauncher.kill(Launcher.java:812)
	at hudson.model.AbstractBuild$AbstractRunner.run(AbstractBuild.java:452)
	at hudson.model.Run.run(Run.java:1374)
	at hudson.maven.MavenModuleSetBuild.run(MavenModuleSetBuild.java:467)
	at hudson.model.ResourceController.execute(ResourceController.java:88)
	at hudson.model.Executor.run(Executor.java:145)
Caused by: java.io.IOException: Unexpected termination of the channel
	at hudson.remoting.Channel$ReaderThread.run(Channel.java:1019)
Caused by: java.io.EOFException
	at java.io.ObjectInputStream$BlockDataInputStream.peekByte(ObjectInputStream.java:2553)
	at java.io.ObjectInputStream.readObject0(ObjectInputStream.java:1296)
	at java.io.ObjectInputStream.readObject(ObjectInputStream.java:350)
	at hudson.remoting.Channel$ReaderThread.run(Channel.java:1013)


Mime
View raw message