activemq-dev mailing list archives

Site index · List index
Message view « Date » · « Thread »
Top « Date » · « Thread »
From Apache Jenkins Server <jenk...@builds.apache.org>
Subject Build failed in Jenkins: ActiveMQ #727
Date Fri, 12 Aug 2011 10:11:33 GMT
See <https://builds.apache.org/job/ActiveMQ/727/>

------------------------------------------
[...truncated 10173 lines...]



[INFO] [enforcer:enforce {execution: default}]
[INFO] [bundle:cleanVersions {execution: cleanVersions}]
[INFO] [remote-resources:process {execution: default}]
[INFO] [resources:resources {execution: default-resources}]
[INFO] Using 'UTF-8' encoding to copy filtered resources.
[INFO] skip non existing resourceDirectory <https://builds.apache.org/job/ActiveMQ/ws/activemq-pool/src/main/resources>
[INFO] Copying 3 resources
[INFO] [compiler:compile {execution: default-compile}]
[INFO] Compiling 16 source files to <https://builds.apache.org/job/ActiveMQ/ws/activemq-pool/target/classes>
[INFO] [resources:testResources {execution: default-testResources}]
[INFO] Using 'UTF-8' encoding to copy filtered resources.
[INFO] Copying 2 resources
[INFO] Copying 3 resources
[INFO] [compiler:testCompile {execution: default-testCompile}]
[INFO] Compiling 6 source files to <https://builds.apache.org/job/ActiveMQ/ws/activemq-pool/target/test-classes>
[INFO] [surefire:test {execution: default-test}]
[INFO] Surefire report directory: <https://builds.apache.org/job/ActiveMQ/ws/activemq-pool/target/surefire-reports>

-------------------------------------------------------
 T E S T S
-------------------------------------------------------
Running org.apache.activemq.pool.ConnectionFailureEvictsFromPoolTest
Tests run: 1, Failures: 0, Errors: 0, Skipped: 0, Time elapsed: 2.696 sec
Running org.apache.activemq.pool.PooledTopicPublisherTest
Tests run: 3, Failures: 0, Errors: 0, Skipped: 0, Time elapsed: 2.384 sec
Running org.apache.activemq.pool.XAConnectionPoolTest
Tests run: 1, Failures: 0, Errors: 0, Skipped: 0, Time elapsed: 0.018 sec
Running org.apache.activemq.pool.ConnectionExpiryEvictsFromPoolTest
Tests run: 2, Failures: 0, Errors: 0, Skipped: 0, Time elapsed: 6.062 sec
Running org.apache.activemq.pool.PooledConnectionFactoryWithTemporaryDestinationsTest
Tests run: 2, Failures: 0, Errors: 0, Skipped: 0, Time elapsed: 4.225 sec
Running org.apache.activemq.pool.JmsSendReceiveTwoConnectionsWithSenderUsingPoolTest
Tests run: 1, Failures: 0, Errors: 0, Skipped: 0, Time elapsed: 1.156 sec

Results :

Tests run: 10, Failures: 0, Errors: 0, Skipped: 0

[JENKINS] Recording test results
[INFO] [bundle:bundle {execution: default-bundle}]
[INFO] [ianal:verify-legal-files {execution: default}]
[INFO] Checking legal files in: activemq-pool-5.6-SNAPSHOT.jar
[INFO] [install:install {execution: default-install}]
[INFO] Installing <https://builds.apache.org/job/ActiveMQ/ws/activemq-pool/target/activemq-pool-5.6-SNAPSHOT.jar>
to <https://builds.apache.org/job/ActiveMQ/ws/.repository/org/apache/activemq/activemq-pool/5.6-SNAPSHOT/activemq-pool-5.6-SNAPSHOT.jar>
[INFO] [bundle:install {execution: default-install}]
[INFO] Installing org/apache/activemq/activemq-pool/5.6-SNAPSHOT/activemq-pool-5.6-SNAPSHOT.jar
[INFO] Writing OBR metadata
[INFO] Preparing source:jar
[JENKINS] Archiving <https://builds.apache.org/job/ActiveMQ/ws/activemq-pool/pom.xml>
to /home/hudson/hudson/jobs/ActiveMQ/modules/org.apache.activemq$activemq-pool/builds/2011-08-12_00-36-37/archive/org.apache.activemq/activemq-pool/5.6-SNAPSHOT/activemq-pool-5.6-SNAPSHOT.pom
[JENKINS] Archiving <https://builds.apache.org/job/ActiveMQ/ws/activemq-pool/target/activemq-pool-5.6-SNAPSHOT.jar>
to /home/hudson/hudson/jobs/ActiveMQ/modules/org.apache.activemq$activemq-pool/builds/2011-08-12_00-36-37/archive/org.apache.activemq/activemq-pool/5.6-SNAPSHOT/activemq-pool-5.6-SNAPSHOT.jar
[INFO] [enforcer:enforce {execution: default}]
[INFO] [bundle:cleanVersions {execution: cleanVersions}]
[INFO] [source:jar {execution: default-cli}]
[INFO] Building jar: <https://builds.apache.org/job/ActiveMQ/ws/activemq-pool/target/activemq-pool-5.6-SNAPSHOT-sources.jar>
[JENKINS] Archiving <https://builds.apache.org/job/ActiveMQ/ws/activemq-pool/target/activemq-pool-5.6-SNAPSHOT-sources.jar>
to /home/hudson/hudson/jobs/ActiveMQ/modules/org.apache.activemq$activemq-pool/builds/2011-08-12_00-36-37/archive/org.apache.activemq/activemq-pool/5.6-SNAPSHOT/activemq-pool-5.6-SNAPSHOT-sources.jar
[INFO] ------------------------------------------------------------------------
[INFO] Building ActiveMQ :: Spring
[INFO]    task-segment: [clean, install, source:jar]
[INFO] ------------------------------------------------------------------------
[INFO] [clean:clean {execution: default-clean}]
Downloading: http://repository.springsource.com/maven/bundles/external/org/jencks/jencks/2.2/jencks-2.2.pom
[INFO] Unable to find resource 'org.jencks:jencks:pom:2.2' in repository com.springsource.repository.bundles.external
(http://repository.springsource.com/maven/bundles/external)
Downloading: http://repo1.maven.org/maven2/org/jencks/jencks/2.2/jencks-2.2.pom

Downloading: http://repository.springsource.com/maven/bundles/external/org/jencks/jencks-parent/2.2/jencks-parent-2.2.pom
[INFO] Unable to find resource 'org.jencks:jencks-parent:pom:2.2' in repository com.springsource.repository.bundles.external
(http://repository.springsource.com/maven/bundles/external)
Downloading: http://repo1.maven.org/maven2/org/jencks/jencks-parent/2.2/jencks-parent-2.2.pom

Downloading: http://repository.springsource.com/maven/bundles/external/org/apache/geronimo/components/geronimo-connector/2.1.2/geronimo-connector-2.1.2.pom
[INFO] Unable to find resource 'org.apache.geronimo.components:geronimo-connector:pom:2.1.2'
in repository com.springsource.repository.bundles.external (http://repository.springsource.com/maven/bundles/external)
Downloading: http://repo1.maven.org/maven2/org/apache/geronimo/components/geronimo-connector/2.1.2/geronimo-connector-2.1.2.pom

Downloading: http://repository.springsource.com/maven/bundles/external/org/apache/geronimo/components/geronimo-txmanager-parent/2.1.2/geronimo-txmanager-parent-2.1.2.pom
[INFO] Unable to find resource 'org.apache.geronimo.components:geronimo-txmanager-parent:pom:2.1.2'
in repository com.springsource.repository.bundles.external (http://repository.springsource.com/maven/bundles/external)
Downloading: http://repo1.maven.org/maven2/org/apache/geronimo/components/geronimo-txmanager-parent/2.1.2/geronimo-txmanager-parent-2.1.2.pom

Downloading: http://repository.springsource.com/maven/bundles/external/org/apache/geronimo/genesis/config/project-config/1.5/project-config-1.5.pom
[INFO] Unable to find resource 'org.apache.geronimo.genesis.config:project-config:pom:1.5'
in repository com.springsource.repository.bundles.external (http://repository.springsource.com/maven/bundles/external)
Downloading: http://repo1.maven.org/maven2/org/apache/geronimo/genesis/config/project-config/1.5/project-config-1.5.pom

Downloading: http://people.apache.org/repo/m2-incubating-repository//org/apache/geronimo/genesis/config/config/1.5/config-1.5.pom
[INFO] Unable to find resource 'org.apache.geronimo.genesis.config:config:pom:1.5' in repository
apache-incubator (http://people.apache.org/repo/m2-incubating-repository/)
Downloading: http://repository.springsource.com/maven/bundles/external/org/apache/geronimo/genesis/config/config/1.5/config-1.5.pom
[INFO] Unable to find resource 'org.apache.geronimo.genesis.config:config:pom:1.5' in repository
com.springsource.repository.bundles.external (http://repository.springsource.com/maven/bundles/external)
Downloading: http://repo1.maven.org/maven2/org/apache/geronimo/genesis/config/config/1.5/config-1.5.pom

Downloading: http://people.apache.org/repo/m2-incubating-repository//org/apache/geronimo/genesis/genesis/1.5/genesis-1.5.pom
[INFO] Unable to find resource 'org.apache.geronimo.genesis:genesis:pom:1.5' in repository
apache-incubator (http://people.apache.org/repo/m2-incubating-repository/)
Downloading: http://repository.springsource.com/maven/bundles/external/org/apache/geronimo/genesis/genesis/1.5/genesis-1.5.pom
[INFO] Unable to find resource 'org.apache.geronimo.genesis:genesis:pom:1.5' in repository
com.springsource.repository.bundles.external (http://repository.springsource.com/maven/bundles/external)
Downloading: http://repo1.maven.org/maven2/org/apache/geronimo/genesis/genesis/1.5/genesis-1.5.pom

Downloading: http://repository.springsource.com/maven/bundles/external/jencks/xapool-without-pool/1.4/xapool-without-pool-1.4.pom
[INFO] Unable to find resource 'jencks:xapool-without-pool:pom:1.4' in repository com.springsource.repository.bundles.external
(http://repository.springsource.com/maven/bundles/external)
Downloading: http://repo1.maven.org/maven2/jencks/xapool-without-pool/1.4/xapool-without-pool-1.4.pom

Downloading: http://repository.springsource.com/maven/bundles/external/commons-dbcp/commons-dbcp/1.2.2/commons-dbcp-1.2.2.pom
[INFO] Unable to find resource 'commons-dbcp:commons-dbcp:pom:1.2.2' in repository com.springsource.repository.bundles.external
(http://repository.springsource.com/maven/bundles/external)
Downloading: http://repo1.maven.org/maven2/commons-dbcp/commons-dbcp/1.2.2/commons-dbcp-1.2.2.pom

Downloading: http://repository.springsource.com/maven/bundles/external/org/springframework/osgi/spring-osgi-core/1.2.1/spring-osgi-core-1.2.1.pom
[INFO] Unable to find resource 'org.springframework.osgi:spring-osgi-core:pom:1.2.1' in repository
com.springsource.repository.bundles.external (http://repository.springsource.com/maven/bundles/external)
Downloading: http://repo1.maven.org/maven2/org/springframework/osgi/spring-osgi-core/1.2.1/spring-osgi-core-1.2.1.pom

Downloading: http://repository.springsource.com/maven/bundles/external/org/springframework/osgi/spring-osgi/1.2.1/spring-osgi-1.2.1.pom
[INFO] Unable to find resource 'org.springframework.osgi:spring-osgi:pom:1.2.1' in repository
com.springsource.repository.bundles.external (http://repository.springsource.com/maven/bundles/external)
Downloading: http://repo1.maven.org/maven2/org/springframework/osgi/spring-osgi/1.2.1/spring-osgi-1.2.1.pom

Downloading: http://repository.springsource.com/maven/bundles/external/org/springframework/osgi/spring-osgi-io/1.2.1/spring-osgi-io-1.2.1.pom
[INFO] Unable to find resource 'org.springframework.osgi:spring-osgi-io:pom:1.2.1' in repository
com.springsource.repository.bundles.external (http://repository.springsource.com/maven/bundles/external)
Downloading: http://repo1.maven.org/eclipse//org/springframework/osgi/spring-osgi-io/1.2.1/spring-osgi-io-1.2.1.pom
[INFO] Unable to find resource 'org.springframework.osgi:spring-osgi-io:pom:1.2.1' in repository
eclipse-repository (http://repo1.maven.org/eclipse/)
Downloading: http://repository.springsource.com/maven/bundles/release/org/springframework/osgi/spring-osgi-io/1.2.1/spring-osgi-io-1.2.1.pom
[INFO] Unable to find resource 'org.springframework.osgi:spring-osgi-io:pom:1.2.1' in repository
com.springsource.repository.bundles.release (http://repository.springsource.com/maven/bundles/release)
Downloading: http://maven.springframework.org/release/org/springframework/osgi/spring-osgi-io/1.2.1/spring-osgi-io-1.2.1.pom
[INFO] Unable to find resource 'org.springframework.osgi:spring-osgi-io:pom:1.2.1' in repository
spring-release (http://maven.springframework.org/release)
Downloading: http://maven.springframework.org/external/org/springframework/osgi/spring-osgi-io/1.2.1/spring-osgi-io-1.2.1.pom
[INFO] Unable to find resource 'org.springframework.osgi:spring-osgi-io:pom:1.2.1' in repository
spring-external (http://maven.springframework.org/external)
Downloading: http://maven.springframework.org/milestone/org/springframework/osgi/spring-osgi-io/1.2.1/spring-osgi-io-1.2.1.pom
[INFO] Unable to find resource 'org.springframework.osgi:spring-osgi-io:pom:1.2.1' in repository
spring-milestone (http://maven.springframework.org/milestone)
Downloading: http://springframework.svn.sourceforge.net/svnroot/springframework/repos/repo-ext//org/springframework/osgi/spring-osgi-io/1.2.1/spring-osgi-io-1.2.1.pom
[INFO] Unable to find resource 'org.springframework.osgi:spring-osgi-io:pom:1.2.1' in repository
spring-ext (http://springframework.svn.sourceforge.net/svnroot/springframework/repos/repo-ext/)
Downloading: http://maven.springframework.org/snapshot/org/springframework/osgi/spring-osgi-io/1.2.1/spring-osgi-io-1.2.1.pom
[INFO] Unable to find resource 'org.springframework.osgi:spring-osgi-io:pom:1.2.1' in repository
spring-snapshot (http://maven.springframework.org/snapshot)
Downloading: http://maven.springframework.org/osgi/org/springframework/osgi/spring-osgi-io/1.2.1/spring-osgi-io-1.2.1.pom
[INFO] Unable to find resource 'org.springframework.osgi:spring-osgi-io:pom:1.2.1' in repository
i21-s3-osgi-repo (http://maven.springframework.org/osgi)
Downloading: http://repo1.maven.org/maven2/org/springframework/osgi/spring-osgi-io/1.2.1/spring-osgi-io-1.2.1.pom

Downloading: http://repository.springsource.com/maven/bundles/external/commons-dbcp/commons-dbcp/1.2.2/commons-dbcp-1.2.2.jar
Downloading: http://repository.springsource.com/maven/bundles/external/org/jencks/jencks/2.2/jencks-2.2.jar
Downloading: http://repository.springsource.com/maven/bundles/external/jencks/xapool-without-pool/1.4/xapool-without-pool-1.4.jar
Downloading: http://repository.springsource.com/maven/bundles/external/org/springframework/osgi/spring-osgi-core/1.2.1/spring-osgi-core-1.2.1.jar
Downloading: http://repository.springsource.com/maven/bundles/external/org/apache/geronimo/components/geronimo-connector/2.1.2/geronimo-connector-2.1.2.jar
[INFO] Unable to find resource 'commons-dbcp:commons-dbcp:jar:1.2.2' in repository com.springsource.repository.bundles.external
(http://repository.springsource.com/maven/bundles/external)
Downloading: http://repo1.maven.org/maven2/commons-dbcp/commons-dbcp/1.2.2/commons-dbcp-1.2.2.jar
[INFO] Unable to find resource 'jencks:xapool-without-pool:jar:1.4' in repository com.springsource.repository.bundles.external
(http://repository.springsource.com/maven/bundles/external)
Downloading: http://repo1.maven.org/maven2/jencks/xapool-without-pool/1.4/xapool-without-pool-1.4.jar
[INFO] [INFO] Unable to find resource 'org.apache.geronimo.components:geronimo-connector:jar:2.1.2'
in repository com.springsource.repository.bundles.external (http://repository.springsource.com/maven/bundles/external)
Unable to find resource 'org.springframework.osgi:spring-osgi-core:jar:1.2.1' in repository
com.springsource.repository.bundles.external (http://repository.springsource.com/maven/bundles/external)
[INFO] Unable to find resource 'org.jencks:jencks:jar:2.2' in repository com.springsource.repository.bundles.external
(http://repository.springsource.com/maven/bundles/external)
Downloading: http://repo1.maven.org/maven2/org/apache/geronimo/components/geronimo-connector/2.1.2/geronimo-connector-2.1.2.jar
Downloading: http://repo1.maven.org/maven2/org/springframework/osgi/spring-osgi-core/1.2.1/spring-osgi-core-1.2.1.jar
Downloading: http://repo1.maven.org/maven2/org/jencks/jencks/2.2/jencks-2.2.jar





[INFO] snapshot org.apache.activemq:activemq-pool:5.6-SNAPSHOT: checking for updates from
com.springsource.repository.bundles.external
[INFO] snapshot org.apache.activemq:activemq-pool:5.6-SNAPSHOT: checking for updates from
apache.snapshots
Downloading: http://repository.springsource.com/maven/bundles/external/org/springframework/osgi/spring-osgi-io/1.2.1/spring-osgi-io-1.2.1.jar
[INFO] Unable to find resource 'org.springframework.osgi:spring-osgi-io:jar:1.2.1' in repository
com.springsource.repository.bundles.external (http://repository.springsource.com/maven/bundles/external)
Downloading: http://repo1.maven.org/eclipse//org/springframework/osgi/spring-osgi-io/1.2.1/spring-osgi-io-1.2.1.jar
[INFO] Unable to find resource 'org.springframework.osgi:spring-osgi-io:jar:1.2.1' in repository
eclipse-repository (http://repo1.maven.org/eclipse/)
Downloading: http://repository.springsource.com/maven/bundles/release/org/springframework/osgi/spring-osgi-io/1.2.1/spring-osgi-io-1.2.1.jar
[INFO] Unable to find resource 'org.springframework.osgi:spring-osgi-io:jar:1.2.1' in repository
com.springsource.repository.bundles.release (http://repository.springsource.com/maven/bundles/release)
Downloading: http://maven.springframework.org/release/org/springframework/osgi/spring-osgi-io/1.2.1/spring-osgi-io-1.2.1.jar
[INFO] Unable to find resource 'org.springframework.osgi:spring-osgi-io:jar:1.2.1' in repository
spring-release (http://maven.springframework.org/release)
Downloading: http://maven.springframework.org/external/org/springframework/osgi/spring-osgi-io/1.2.1/spring-osgi-io-1.2.1.jar
[INFO] Unable to find resource 'org.springframework.osgi:spring-osgi-io:jar:1.2.1' in repository
spring-external (http://maven.springframework.org/external)
Downloading: http://maven.springframework.org/milestone/org/springframework/osgi/spring-osgi-io/1.2.1/spring-osgi-io-1.2.1.jar
[INFO] Unable to find resource 'org.springframework.osgi:spring-osgi-io:jar:1.2.1' in repository
spring-milestone (http://maven.springframework.org/milestone)
Downloading: http://springframework.svn.sourceforge.net/svnroot/springframework/repos/repo-ext//org/springframework/osgi/spring-osgi-io/1.2.1/spring-osgi-io-1.2.1.jar
[INFO] Unable to find resource 'org.springframework.osgi:spring-osgi-io:jar:1.2.1' in repository
spring-ext (http://springframework.svn.sourceforge.net/svnroot/springframework/repos/repo-ext/)
Downloading: http://maven.springframework.org/snapshot/org/springframework/osgi/spring-osgi-io/1.2.1/spring-osgi-io-1.2.1.jar
[INFO] Unable to find resource 'org.springframework.osgi:spring-osgi-io:jar:1.2.1' in repository
spring-snapshot (http://maven.springframework.org/snapshot)
Downloading: http://maven.springframework.org/osgi/org/springframework/osgi/spring-osgi-io/1.2.1/spring-osgi-io-1.2.1.jar
[INFO] Unable to find resource 'org.springframework.osgi:spring-osgi-io:jar:1.2.1' in repository
i21-s3-osgi-repo (http://maven.springframework.org/osgi)
Downloading: http://repo1.maven.org/maven2/org/springframework/osgi/spring-osgi-io/1.2.1/spring-osgi-io-1.2.1.jar

[INFO] [enforcer:enforce {execution: default}]
[INFO] [bundle:cleanVersions {execution: cleanVersions}]
[INFO] [remote-resources:process {execution: default}]
[INFO] [resources:resources {execution: default-resources}]
[INFO] Using 'UTF-8' encoding to copy filtered resources.
[INFO] Copying 0 resource
[INFO] Copying 3 resources
[INFO] [compiler:compile {execution: default-compile}]
[INFO] Compiling 3 source files to <https://builds.apache.org/job/ActiveMQ/ws/activemq-spring/target/classes>
[INFO] [resources:testResources {execution: default-testResources}]
[INFO] Using 'UTF-8' encoding to copy filtered resources.
[INFO] Copying 6 resources
[INFO] Copying 3 resources
[INFO] [compiler:testCompile {execution: default-testCompile}]
[INFO] Compiling 10 source files to <https://builds.apache.org/job/ActiveMQ/ws/activemq-spring/target/test-classes>
[INFO] [surefire:test {execution: default-test}]
[INFO] Surefire report directory: <https://builds.apache.org/job/ActiveMQ/ws/activemq-spring/target/surefire-reports>

-------------------------------------------------------
 T E S T S
-------------------------------------------------------
Running org.apache.bugs.AMQ2754Test
Tests run: 1, Failures: 0, Errors: 1, Skipped: 0, Time elapsed: 2.373 sec <<< FAILURE!
Running org.apache.activemq.spring.SpringTest
Tests run: 1, Failures: 0, Errors: 0, Skipped: 0, Time elapsed: 2.696 sec
Running org.apache.activemq.spring.ListenerTest
Build timed out (after 575 minutes). Marking the build as aborted.
Sending e-mails to: dev@activemq.apache.org
[locks-and-latches] Releasing all the locks
[locks-and-latches] All the locks released
ERROR: Failed to parse POMs
hudson.remoting.ChannelClosedException: channel is already closed
	at hudson.remoting.Channel.send(Channel.java:480)
	at hudson.remoting.ProxyOutputStream._write(ProxyOutputStream.java:123)
	at hudson.remoting.ProxyOutputStream.write(ProxyOutputStream.java:103)
	at hudson.remoting.RemoteOutputStream.write(RemoteOutputStream.java:110)
	at java.io.BufferedOutputStream.flushBuffer(BufferedOutputStream.java:65)
	at java.io.BufferedOutputStream.flush(BufferedOutputStream.java:123)
	at java.io.BufferedOutputStream.flush(BufferedOutputStream.java:124)
	at java.io.ObjectOutputStream$BlockDataOutputStream.flush(ObjectOutputStream.java:1793)
	at java.io.ObjectOutputStream.flush(ObjectOutputStream.java:699)
	at hudson.remoting.Channel.send(Channel.java:486)
	at hudson.remoting.Request.call(Request.java:149)
	at hudson.remoting.Channel.call(Channel.java:661)
	at hudson.maven.ProcessCache$MavenProcess.call(ProcessCache.java:156)
	at hudson.maven.MavenModuleSetBuild$RunnerImpl.doRun(MavenModuleSetBuild.java:736)
	at hudson.model.AbstractBuild$AbstractRunner.run(AbstractBuild.java:429)
	at hudson.model.Run.run(Run.java:1374)
	at hudson.maven.MavenModuleSetBuild.run(MavenModuleSetBuild.java:467)
	at hudson.model.ResourceController.execute(ResourceController.java:88)
	at hudson.model.Executor.run(Executor.java:145)
Caused by: java.io.IOException: Unexpected termination of the channel
	at hudson.remoting.Channel$ReaderThread.run(Channel.java:1019)
Caused by: java.io.EOFException
	at java.io.ObjectInputStream$BlockDataInputStream.peekByte(ObjectInputStream.java:2553)
	at java.io.ObjectInputStream.readObject0(ObjectInputStream.java:1296)
	at java.io.ObjectInputStream.readObject(ObjectInputStream.java:350)
	at hudson.remoting.Channel$ReaderThread.run(Channel.java:1013)
FATAL: channel is already closed
hudson.remoting.ChannelClosedException: channel is already closed
	at hudson.remoting.Channel.send(Channel.java:480)
	at hudson.remoting.Request.call(Request.java:105)
	at hudson.remoting.Channel.call(Channel.java:661)
	at hudson.Launcher$RemoteLauncher.kill(Launcher.java:812)
	at hudson.model.AbstractBuild$AbstractRunner.run(AbstractBuild.java:452)
	at hudson.model.Run.run(Run.java:1374)
	at hudson.maven.MavenModuleSetBuild.run(MavenModuleSetBuild.java:467)
	at hudson.model.ResourceController.execute(ResourceController.java:88)
	at hudson.model.Executor.run(Executor.java:145)
Caused by: java.io.IOException: Unexpected termination of the channel
	at hudson.remoting.Channel$ReaderThread.run(Channel.java:1019)
Caused by: java.io.EOFException
	at java.io.ObjectInputStream$BlockDataInputStream.peekByte(ObjectInputStream.java:2553)
	at java.io.ObjectInputStream.readObject0(ObjectInputStream.java:1296)
	at java.io.ObjectInputStream.readObject(ObjectInputStream.java:350)
	at hudson.remoting.Channel$ReaderThread.run(Channel.java:1013)


Mime
View raw message