activemq-dev mailing list archives

Site index · List index
Message view « Date » · « Thread »
Top « Date » · « Thread »
From Apache Jenkins Server <jenk...@builds.apache.org>
Subject Build failed in Jenkins: ActiveMQ #709
Date Tue, 26 Jul 2011 10:03:15 GMT
See <https://builds.apache.org/job/ActiveMQ/709/changes>

Changes:

[tabish] fix for: https://issues.apache.org/jira/browse/AMQ-3414

use schedule instead of scheduleAtFixedRate since we don't need read or write check tasks
to "catch up" if delayed for some reason only to fire once the resources allow for it and
then return to the standard delay for the next execution.

[dejanb] https://issues.apache.org/jira/browse/AMQ-3411 - user/pass for consolne commands

[dejanb] https://issues.apache.org/jira/browse/AMQ-3415 - rss field to show message timestamp

------------------------------------------
[...truncated 13933 lines...]
from the specified remote repositories:
  com.springsource.repository.bundles.external (http://repository.springsource.com/maven/bundles/external),
  central (http://repo1.maven.org/maven2),
  Nexus (http://repository.apache.org/snapshots)


	at org.apache.maven.lifecycle.DefaultLifecycleExecutor.executeGoals(DefaultLifecycleExecutor.java:711)
	at org.apache.maven.lifecycle.DefaultLifecycleExecutor.executeGoalWithLifecycle(DefaultLifecycleExecutor.java:556)
	at org.apache.maven.lifecycle.DefaultLifecycleExecutor.executeGoal(DefaultLifecycleExecutor.java:535)
	at org.apache.maven.lifecycle.DefaultLifecycleExecutor.executeGoalAndHandleFailures(DefaultLifecycleExecutor.java:387)
	at org.apache.maven.lifecycle.DefaultLifecycleExecutor.executeTaskSegments(DefaultLifecycleExecutor.java:348)
	at org.apache.maven.lifecycle.DefaultLifecycleExecutor.execute(DefaultLifecycleExecutor.java:180)
	at org.apache.maven.lifecycle.LifecycleExecutorInterceptor.execute(LifecycleExecutorInterceptor.java:65)
	at org.apache.maven.DefaultMaven.doExecute(DefaultMaven.java:328)
	at org.apache.maven.DefaultMaven.execute(DefaultMaven.java:138)
	at org.apache.maven.cli.MavenCli.main(MavenCli.java:362)
	at sun.reflect.NativeMethodAccessorImpl.invoke0(Native Method)
	at sun.reflect.NativeMethodAccessorImpl.invoke(NativeMethodAccessorImpl.java:39)
	at sun.reflect.DelegatingMethodAccessorImpl.invoke(DelegatingMethodAccessorImpl.java:25)
	at java.lang.reflect.Method.invoke(Method.java:597)
	at org.codehaus.classworlds.Launcher.launchEnhanced(Launcher.java:315)
	at org.codehaus.classworlds.Launcher.launch(Launcher.java:255)
	at hudson.maven.agent.Main.launch(Main.java:185)
	at hudson.maven.MavenBuilder.call(MavenBuilder.java:164)
	at hudson.maven.MavenModuleSetBuild$Builder.call(MavenModuleSetBuild.java:987)
	at hudson.maven.MavenModuleSetBuild$Builder.call(MavenModuleSetBuild.java:918)
	at hudson.remoting.UserRequest.perform(UserRequest.java:118)
	at hudson.remoting.UserRequest.perform(UserRequest.java:48)
	at hudson.remoting.Request$2.run(Request.java:270)
	at java.util.concurrent.Executors$RunnableAdapter.call(Executors.java:441)
	at java.util.concurrent.FutureTask$Sync.innerRun(FutureTask.java:303)
	at java.util.concurrent.FutureTask.run(FutureTask.java:138)
	at java.util.concurrent.ThreadPoolExecutor$Worker.runTask(ThreadPoolExecutor.java:886)
	at java.util.concurrent.ThreadPoolExecutor$Worker.run(ThreadPoolExecutor.java:908)
	at java.lang.Thread.run(Thread.java:619)
Caused by: org.apache.maven.artifact.resolver.MultipleArtifactsNotFoundException: Missing:
----------
1) com.thoughtworks.xstream:xstream:jar:1.2.2

  Try downloading the file manually from the project website.

  Then, install it using the command: 
      mvn install:install-file -DgroupId=com.thoughtworks.xstream -DartifactId=xstream -Dversion=1.2.2
-Dpackaging=jar -Dfile=/path/to/file

  Alternatively, if you host your own repository you can deploy the file there: 
      mvn deploy:deploy-file -DgroupId=com.thoughtworks.xstream -DartifactId=xstream -Dversion=1.2.2
-Dpackaging=jar -Dfile=/path/to/file -Durl=[url] -DrepositoryId=[id]

  Path to dependency: 
  	1) org.apache.maven.plugins:maven-war-plugin:maven-plugin:2.1-alpha-2
  	2) com.thoughtworks.xstream:xstream:jar:1.2.2

2) org.apache.maven.shared:maven-filtering:jar:1.0-beta-1

  Try downloading the file manually from the project website.

  Then, install it using the command: 
      mvn install:install-file -DgroupId=org.apache.maven.shared -DartifactId=maven-filtering
-Dversion=1.0-beta-1 -Dpackaging=jar -Dfile=/path/to/file

  Alternatively, if you host your own repository you can deploy the file there: 
      mvn deploy:deploy-file -DgroupId=org.apache.maven.shared -DartifactId=maven-filtering
-Dversion=1.0-beta-1 -Dpackaging=jar -Dfile=/path/to/file -Durl=[url] -DrepositoryId=[id]

  Path to dependency: 
  	1) org.apache.maven.plugins:maven-war-plugin:maven-plugin:2.1-alpha-2
  	2) org.apache.maven.shared:maven-filtering:jar:1.0-beta-1

3) org.apache.maven:maven-archiver:jar:2.3

  Try downloading the file manually from the project website.

  Then, install it using the command: 
      mvn install:install-file -DgroupId=org.apache.maven -DartifactId=maven-archiver -Dversion=2.3
-Dpackaging=jar -Dfile=/path/to/file

  Alternatively, if you host your own repository you can deploy the file there: 
      mvn deploy:deploy-file -DgroupId=org.apache.maven -DartifactId=maven-archiver -Dversion=2.3
-Dpackaging=jar -Dfile=/path/to/file -Durl=[url] -DrepositoryId=[id]

  Path to dependency: 
  	1) org.apache.maven.plugins:maven-war-plugin:maven-plugin:2.1-alpha-2
  	2) org.apache.maven:maven-archiver:jar:2.3

4) org.codehaus.plexus:plexus-interpolation:jar:1.2

  Try downloading the file manually from the project website.

  Then, install it using the command: 
      mvn install:install-file -DgroupId=org.codehaus.plexus -DartifactId=plexus-interpolation
-Dversion=1.2 -Dpackaging=jar -Dfile=/path/to/file

  Alternatively, if you host your own repository you can deploy the file there: 
      mvn deploy:deploy-file -DgroupId=org.codehaus.plexus -DartifactId=plexus-interpolation
-Dversion=1.2 -Dpackaging=jar -Dfile=/path/to/file -Durl=[url] -DrepositoryId=[id]

  Path to dependency: 
  	1) org.apache.maven.plugins:maven-war-plugin:maven-plugin:2.1-alpha-2
  	2) org.apache.maven.shared:maven-filtering:jar:1.0-beta-1
  	3) org.codehaus.plexus:plexus-interpolation:jar:1.2

----------
4 required artifacts are missing.

for artifact: 
  org.apache.maven.plugins:maven-war-plugin:maven-plugin:2.1-alpha-2

from the specified remote repositories:
  com.springsource.repository.bundles.external (http://repository.springsource.com/maven/bundles/external),
  central (http://repo1.maven.org/maven2),
  Nexus (http://repository.apache.org/snapshots)


	at org.apache.maven.artifact.resolver.DefaultArtifactResolver.resolveTransitively(DefaultArtifactResolver.java:360)
	at org.apache.maven.artifact.resolver.DefaultArtifactResolver.resolveTransitively(DefaultArtifactResolver.java:304)
	at org.apache.maven.plugin.DefaultPluginManager.ensurePluginContainerIsComplete(DefaultPluginManager.java:835)
	at org.apache.maven.plugin.DefaultPluginManager.getConfiguredMojo(DefaultPluginManager.java:647)
	at org.apache.maven.plugin.DefaultPluginManager.executeMojo(DefaultPluginManager.java:468)
	at hudson.maven.agent.PluginManagerInterceptor.executeMojo(PluginManagerInterceptor.java:182)
	at org.apache.maven.lifecycle.DefaultLifecycleExecutor.executeGoals(DefaultLifecycleExecutor.java:694)
	... 28 more
[INFO] ------------------------------------------------------------------------
[INFO] Error for project: ActiveMQ :: Blueprint (during clean)
[INFO] ------------------------------------------------------------------------
[INFO] A required plugin was not found: Plugin could not be found - check that the goal name
is correct: Unable to download the artifact from any repository

Try downloading the file manually from the project website.

Then, install it using the command: 
    mvn install:install-file -DgroupId=org.apache.maven.plugins -DartifactId=maven-install-plugin
-Dversion=2.2 -Dpackaging=maven-plugin -Dfile=/path/to/file

Alternatively, if you host your own repository you can deploy the file there: 
    mvn deploy:deploy-file -DgroupId=org.apache.maven.plugins -DartifactId=maven-install-plugin
-Dversion=2.2 -Dpackaging=maven-plugin -Dfile=/path/to/file -Durl=[url] -DrepositoryId=[id]


  org.apache.maven.plugins:maven-install-plugin:maven-plugin:2.2

from the specified remote repositories:
  central (http://repo1.maven.org/maven2),
  Nexus (http://repository.apache.org/snapshots)


  org.apache.maven.plugins:maven-install-plugin:maven-plugin:2.2

from the specified remote repositories:
  central (http://repo1.maven.org/maven2),
  Nexus (http://repository.apache.org/snapshots)


[INFO] ------------------------------------------------------------------------
[INFO] Trace
org.apache.maven.BuildFailureException: A required plugin was not found: Plugin could not
be found - check that the goal name is correct: Unable to download the artifact from any repository

Try downloading the file manually from the project website.

Then, install it using the command: 
    mvn install:install-file -DgroupId=org.apache.maven.plugins -DartifactId=maven-install-plugin
-Dversion=2.2 -Dpackaging=maven-plugin -Dfile=/path/to/file

Alternatively, if you host your own repository you can deploy the file there: 
    mvn deploy:deploy-file -DgroupId=org.apache.maven.plugins -DartifactId=maven-install-plugin
-Dversion=2.2 -Dpackaging=maven-plugin -Dfile=/path/to/file -Durl=[url] -DrepositoryId=[id]


  org.apache.maven.plugins:maven-install-plugin:maven-plugin:2.2

from the specified remote repositories:
  central (http://repo1.maven.org/maven2),
  Nexus (http://repository.apache.org/snapshots)


  org.apache.maven.plugins:maven-install-plugin:maven-plugin:2.2

from the specified remote repositories:
  central (http://repo1.maven.org/maven2),
  Nexus (http://repository.apache.org/snapshots)


	at org.apache.maven.lifecycle.DefaultLifecycleExecutor.executeGoal(DefaultLifecycleExecutor.java:544)
	at org.apache.maven.lifecycle.DefaultLifecycleExecutor.executeGoalAndHandleFailures(DefaultLifecycleExecutor.java:387)
	at org.apache.maven.lifecycle.DefaultLifecycleExecutor.executeTaskSegments(DefaultLifecycleExecutor.java:348)
	at org.apache.maven.lifecycle.DefaultLifecycleExecutor.execute(DefaultLifecycleExecutor.java:180)
	at org.apache.maven.lifecycle.LifecycleExecutorInterceptor.execute(LifecycleExecutorInterceptor.java:65)
	at org.apache.maven.DefaultMaven.doExecute(DefaultMaven.java:328)
	at org.apache.maven.DefaultMaven.execute(DefaultMaven.java:138)
	at org.apache.maven.cli.MavenCli.main(MavenCli.java:362)
	at sun.reflect.NativeMethodAccessorImpl.invoke0(Native Method)
	at sun.reflect.NativeMethodAccessorImpl.invoke(NativeMethodAccessorImpl.java:39)
	at sun.reflect.DelegatingMethodAccessorImpl.invoke(DelegatingMethodAccessorImpl.java:25)
	at java.lang.reflect.Method.invoke(Method.java:597)
	at org.codehaus.classworlds.Launcher.launchEnhanced(Launcher.java:315)
	at org.codehaus.classworlds.Launcher.launch(Launcher.java:255)
	at hudson.maven.agent.Main.launch(Main.java:185)
	at hudson.maven.MavenBuilder.call(MavenBuilder.java:164)
	at hudson.maven.MavenModuleSetBuild$Builder.call(MavenModuleSetBuild.java:987)
	at hudson.maven.MavenModuleSetBuild$Builder.call(MavenModuleSetBuild.java:918)
	at hudson.remoting.UserRequest.perform(UserRequest.java:118)
	at hudson.remoting.UserRequest.perform(UserRequest.java:48)
	at hudson.remoting.Request$2.run(Request.java:270)
	at java.util.concurrent.Executors$RunnableAdapter.call(Executors.java:441)
	at java.util.concurrent.FutureTask$Sync.innerRun(FutureTask.java:303)
	at java.util.concurrent.FutureTask.run(FutureTask.java:138)
	at java.util.concurrent.ThreadPoolExecutor$Worker.runTask(ThreadPoolExecutor.java:886)
	at java.util.concurrent.ThreadPoolExecutor$Worker.run(ThreadPoolExecutor.java:908)
	at java.lang.Thread.run(Thread.java:619)
Caused by: org.apache.maven.plugin.PluginNotFoundException: Plugin could not be found - check
that the goal name is correct: Unable to download the artifact from any repository

Try downloading the file manually from the project website.

Then, install it using the command: 
    mvn install:install-file -DgroupId=org.apache.maven.plugins -DartifactId=maven-install-plugin
-Dversion=2.2 -Dpackaging=maven-plugin -Dfile=/path/to/file

Alternatively, if you host your own repository you can deploy the file there: 
    mvn deploy:deploy-file -DgroupId=org.apache.maven.plugins -DartifactId=maven-install-plugin
-Dversion=2.2 -Dpackaging=maven-plugin -Dfile=/path/to/file -Durl=[url] -DrepositoryId=[id]


  org.apache.maven.plugins:maven-install-plugin:maven-plugin:2.2

from the specified remote repositories:
  central (http://repo1.maven.org/maven2),
  Nexus (http://repository.apache.org/snapshots)


  org.apache.maven.plugins:maven-install-plugin:maven-plugin:2.2

from the specified remote repositories:
  central (http://repo1.maven.org/maven2),
  Nexus (http://repository.apache.org/snapshots)


	at org.apache.maven.plugin.DefaultPluginManager.verifyVersionedPlugin(DefaultPluginManager.java:253)
	at org.apache.maven.plugin.DefaultPluginManager.verifyPlugin(DefaultPluginManager.java:184)
	at org.apache.maven.plugin.DefaultPluginManager.loadPluginDescriptor(DefaultPluginManager.java:1642)
	at org.apache.maven.lifecycle.DefaultLifecycleExecutor.verifyPlugin(DefaultLifecycleExecutor.java:1540)
	at org.apache.maven.lifecycle.DefaultLifecycleExecutor.bindPluginToLifecycle(DefaultLifecycleExecutor.java:1503)
	at org.apache.maven.lifecycle.DefaultLifecycleExecutor.constructLifecycleMappings(DefaultLifecycleExecutor.java:1282)
	at org.apache.maven.lifecycle.DefaultLifecycleExecutor.executeGoal(DefaultLifecycleExecutor.java:534)
	... 26 more
Caused by: org.apache.maven.wagon.ResourceDoesNotExistException: Unable to download the artifact
from any repository
	at org.apache.maven.artifact.manager.DefaultWagonManager.getArtifact(DefaultWagonManager.java:404)
	at org.apache.maven.artifact.resolver.DefaultArtifactResolver.resolve(DefaultArtifactResolver.java:216)
	at org.apache.maven.artifact.resolver.DefaultArtifactResolver.resolve(DefaultArtifactResolver.java:90)
	at org.apache.maven.plugin.DefaultPluginManager.verifyVersionedPlugin(DefaultPluginManager.java:212)
	... 32 more
[INFO] ------------------------------------------------------------------------
[INFO] BUILD ERRORS
[INFO] ------------------------------------------------------------------------
[INFO] Total time: 531 minutes 54 seconds
[INFO] Finished at: Tue Jul 26 10:03:11 UTC 2011
[INFO] Final Memory: 140M/1646M
[INFO] ------------------------------------------------------------------------
Sending e-mails to: dev@activemq.apache.org
Sending e-mails to: dev@activemq.apache.org
Sending e-mails to: dev@activemq.apache.org
Sending e-mails to: dev@activemq.apache.org
channel stopped
[locks-and-latches] Releasing all the locks
[locks-and-latches] All the locks released


Mime
View raw message