activemq-dev mailing list archives

Site index · List index
Message view « Date » · « Thread »
Top « Date » · « Thread »
From Apache Jenkins Server <jenk...@builds.apache.org>
Subject Build failed in Jenkins: ActiveMQ #678
Date Wed, 29 Jun 2011 07:40:21 GMT
See <https://builds.apache.org/job/ActiveMQ/678/changes>

Changes:

[gtully] https://issues.apache.org/jira/browse/AMQ-3289 - fix missing dummy arg for blob in
initial insert

[tabish] fix for: https://issues.apache.org/jira/browse/AMQ-2524

When destinations are removed via JMX or by auto remove of inactive destinations an existing
producer registration can be left with a reference to a resource that no longer exists but
appears valid.  The destination should be marked as disposed so that a producer send can check
to see if it should discard its current reference to the destination and either recreate it
or update its cache to point to the currect destination resource.

[dejanb] https://issues.apache.org/jira/browse/AMQ-3379 - unique property eviction strategy
- remove oldest if there's no duplicates

------------------------------------------
[...truncated 13144 lines...]
[INFO] Processing war project
[INFO] Copying webapp resources[<https://builds.apache.org/job/ActiveMQ/ws/activemq-web-demo/src/main/webapp]>
[INFO] Webapp assembled in[234 msecs]
[INFO] Building war: <https://builds.apache.org/job/ActiveMQ/ws/activemq-web-demo/target/activemq-web-demo-5.6-SNAPSHOT.war>
[INFO] [ianal:verify-legal-files {execution: default}]
[INFO] Checking legal files in: activemq-web-demo-5.6-SNAPSHOT.war
[INFO] [install:install {execution: default-install}]
[INFO] Installing <https://builds.apache.org/job/ActiveMQ/ws/activemq-web-demo/target/activemq-web-demo-5.6-SNAPSHOT.war>
to <https://builds.apache.org/job/ActiveMQ/ws/.repository/org/apache/activemq/activemq-web-demo/5.6-SNAPSHOT/activemq-web-demo-5.6-SNAPSHOT.war>
[INFO] Preparing source:jar
Downloading: http://repository.apache.org/snapshots/org/apache/activemq/activemq-camel/5.6-SNAPSHOT/activemq-camel-5.6-SNAPSHOT.jar
[JENKINS] Archiving <https://builds.apache.org/job/ActiveMQ/ws/activemq-web-demo/pom.xml>
to /home/hudson/hudson/jobs/ActiveMQ/modules/org.apache.activemq$activemq-web-demo/builds/2011-06-29_00-23-38/archive/org.apache.activemq/activemq-web-demo/5.6-SNAPSHOT/activemq-web-demo-5.6-SNAPSHOT.pom
[JENKINS] Archiving <https://builds.apache.org/job/ActiveMQ/ws/activemq-web-demo/target/activemq-web-demo-5.6-SNAPSHOT.war>
to /home/hudson/hudson/jobs/ActiveMQ/modules/org.apache.activemq$activemq-web-demo/builds/2011-06-29_00-23-38/archive/org.apache.activemq/activemq-web-demo/5.6-SNAPSHOT/activemq-web-demo-5.6-SNAPSHOT.war
[INFO] [enforcer:enforce {execution: default}]
[INFO] [bundle:cleanVersions {execution: cleanVersions}]
[INFO] [source:jar {execution: default-cli}]
[INFO] Building jar: <https://builds.apache.org/job/ActiveMQ/ws/activemq-web-demo/target/activemq-web-demo-5.6-SNAPSHOT-sources.jar>
[JENKINS] Archiving <https://builds.apache.org/job/ActiveMQ/ws/activemq-web-demo/target/activemq-web-demo-5.6-SNAPSHOT-sources.jar>
to /home/hudson/hudson/jobs/ActiveMQ/modules/org.apache.activemq$activemq-web-demo/builds/2011-06-29_00-23-38/archive/org.apache.activemq/activemq-web-demo/5.6-SNAPSHOT/activemq-web-demo-5.6-SNAPSHOT-sources.jar
[INFO] ------------------------------------------------------------------------
[INFO] Building ActiveMQ :: XMPP
[INFO]    task-segment: [clean, install, source:jar]
[INFO] ------------------------------------------------------------------------
Downloading: http://download.java.net/maven/2/org/jvnet/jaxb2/maven2/maven-jaxb2-plugin/0.7.2/maven-jaxb2-plugin-0.7.2.pom
[WARNING] Unable to get resource 'org.jvnet.jaxb2.maven2:maven-jaxb2-plugin:pom:0.7.2' from
repository maven2-repository.dev.java.net (http://download.java.net/maven/2): Error transferring
file: Server returned HTTP response code: 503 for URL: http://download.java.net/maven/2/org/jvnet/jaxb2/maven2/maven-jaxb2-plugin/0.7.2/maven-jaxb2-plugin-0.7.2.pom
Downloading: http://download.java.net/maven/1/org.jvnet.jaxb2.maven2/poms/maven-jaxb2-plugin-0.7.2.pom
[WARNING] Unable to get resource 'org.jvnet.jaxb2.maven2:maven-jaxb2-plugin:pom:0.7.2' from
repository maven-repository.dev.java.net (http://download.java.net/maven/1): Error transferring
file: Server returned HTTP response code: 503 for URL: http://download.java.net/maven/1/org.jvnet.jaxb2.maven2/poms/maven-jaxb2-plugin-0.7.2.pom
Downloading: http://repository.apache.org/snapshots/org/jvnet/jaxb2/maven2/maven-jaxb2-plugin/0.7.2/maven-jaxb2-plugin-0.7.2.pom
[INFO] Unable to find resource 'org.jvnet.jaxb2.maven2:maven-jaxb2-plugin:pom:0.7.2' in repository
apache.snapshots (https://repository.apache.org/content/repositories/snapshots/)
Downloading: http://repo1.maven.org/maven2/org/jvnet/jaxb2/maven2/maven-jaxb2-plugin/0.7.2/maven-jaxb2-plugin-0.7.2.pom
[INFO] Unable to find resource 'org.jvnet.jaxb2.maven2:maven-jaxb2-plugin:pom:0.7.2' in repository
central (http://repo1.maven.org/maven2)
Downloading: http://download.java.net/maven/2/org/jvnet/jaxb2/maven2/maven-jaxb2-plugin/0.7.2/maven-jaxb2-plugin-0.7.2.pom
[WARNING] Unable to get resource 'org.jvnet.jaxb2.maven2:maven-jaxb2-plugin:pom:0.7.2' from
repository maven2-repository.dev.java.net (http://download.java.net/maven/2): Error transferring
file: Server returned HTTP response code: 503 for URL: http://download.java.net/maven/2/org/jvnet/jaxb2/maven2/maven-jaxb2-plugin/0.7.2/maven-jaxb2-plugin-0.7.2.pom
Downloading: http://download.java.net/maven/1/org.jvnet.jaxb2.maven2/poms/maven-jaxb2-plugin-0.7.2.pom
[WARNING] Unable to get resource 'org.jvnet.jaxb2.maven2:maven-jaxb2-plugin:pom:0.7.2' from
repository maven-repository.dev.java.net (http://download.java.net/maven/1): Error transferring
file: Server returned HTTP response code: 503 for URL: http://download.java.net/maven/1/org.jvnet.jaxb2.maven2/poms/maven-jaxb2-plugin-0.7.2.pom
Downloading: http://repository.springsource.com/maven/bundles/external/org/jvnet/jaxb2/maven2/maven-jaxb2-plugin/0.7.2/maven-jaxb2-plugin-0.7.2.pom
[INFO] Unable to find resource 'org.jvnet.jaxb2.maven2:maven-jaxb2-plugin:pom:0.7.2' in repository
com.springsource.repository.bundles.external (http://repository.springsource.com/maven/bundles/external)
Downloading: http://repo1.maven.org/maven2/org/jvnet/jaxb2/maven2/maven-jaxb2-plugin/0.7.2/maven-jaxb2-plugin-0.7.2.pom
[INFO] Unable to find resource 'org.jvnet.jaxb2.maven2:maven-jaxb2-plugin:pom:0.7.2' in repository
central (http://repo1.maven.org/maven2)
Downloading: http://download.java.net/maven/2/org/jvnet/jaxb2/maven2/maven-jaxb2-plugin/0.7.2/maven-jaxb2-plugin-0.7.2.pom
[WARNING] Unable to get resource 'org.jvnet.jaxb2.maven2:maven-jaxb2-plugin:pom:0.7.2' from
repository maven2-repository.dev.java.net (http://download.java.net/maven/2): Error transferring
file: Server returned HTTP response code: 503 for URL: http://download.java.net/maven/2/org/jvnet/jaxb2/maven2/maven-jaxb2-plugin/0.7.2/maven-jaxb2-plugin-0.7.2.pom
Downloading: http://download.java.net/maven/1/org.jvnet.jaxb2.maven2/poms/maven-jaxb2-plugin-0.7.2.pom
[WARNING] Unable to get resource 'org.jvnet.jaxb2.maven2:maven-jaxb2-plugin:pom:0.7.2' from
repository maven-repository.dev.java.net (http://download.java.net/maven/1): Error transferring
file: Server returned HTTP response code: 503 for URL: http://download.java.net/maven/1/org.jvnet.jaxb2.maven2/poms/maven-jaxb2-plugin-0.7.2.pom
Downloading: http://repository.apache.org/snapshots/org/jvnet/jaxb2/maven2/maven-jaxb2-plugin/0.7.2/maven-jaxb2-plugin-0.7.2.pom
[INFO] Unable to find resource 'org.jvnet.jaxb2.maven2:maven-jaxb2-plugin:pom:0.7.2' in repository
apache.snapshots (https://repository.apache.org/content/repositories/snapshots/)
Downloading: http://repo1.maven.org/maven2/org/jvnet/jaxb2/maven2/maven-jaxb2-plugin/0.7.2/maven-jaxb2-plugin-0.7.2.pom
[INFO] Unable to find resource 'org.jvnet.jaxb2.maven2:maven-jaxb2-plugin:pom:0.7.2' in repository
central (http://repo1.maven.org/maven2)
Downloading: http://download.java.net/maven/2/org/jvnet/jaxb2/maven2/maven-jaxb2-plugin/0.7.2/maven-jaxb2-plugin-0.7.2.pom
[WARNING] Unable to get resource 'org.jvnet.jaxb2.maven2:maven-jaxb2-plugin:pom:0.7.2' from
repository maven2-repository.dev.java.net (http://download.java.net/maven/2): Error transferring
file: Server returned HTTP response code: 503 for URL: http://download.java.net/maven/2/org/jvnet/jaxb2/maven2/maven-jaxb2-plugin/0.7.2/maven-jaxb2-plugin-0.7.2.pom
Downloading: http://download.java.net/maven/1/org.jvnet.jaxb2.maven2/poms/maven-jaxb2-plugin-0.7.2.pom
[WARNING] Unable to get resource 'org.jvnet.jaxb2.maven2:maven-jaxb2-plugin:pom:0.7.2' from
repository maven-repository.dev.java.net (http://download.java.net/maven/1): Error transferring
file: Server returned HTTP response code: 503 for URL: http://download.java.net/maven/1/org.jvnet.jaxb2.maven2/poms/maven-jaxb2-plugin-0.7.2.pom
Downloading: http://repository.springsource.com/maven/bundles/external/org/jvnet/jaxb2/maven2/maven-jaxb2-plugin/0.7.2/maven-jaxb2-plugin-0.7.2.pom
[INFO] Unable to find resource 'org.jvnet.jaxb2.maven2:maven-jaxb2-plugin:pom:0.7.2' in repository
com.springsource.repository.bundles.external (http://repository.springsource.com/maven/bundles/external)
Downloading: http://repo1.maven.org/maven2/org/jvnet/jaxb2/maven2/maven-jaxb2-plugin/0.7.2/maven-jaxb2-plugin-0.7.2.pom
[INFO] Unable to find resource 'org.jvnet.jaxb2.maven2:maven-jaxb2-plugin:pom:0.7.2' in repository
central (http://repo1.maven.org/maven2)
[INFO] Preparing source:jar
Downloading: http://download.java.net/maven/2/org/jvnet/jaxb2/maven2/maven-jaxb2-plugin/0.7.2/maven-jaxb2-plugin-0.7.2.pom
[WARNING] Unable to get resource 'org.jvnet.jaxb2.maven2:maven-jaxb2-plugin:pom:0.7.2' from
repository maven2-repository.dev.java.net (http://download.java.net/maven/2): Error transferring
file: Server returned HTTP response code: 503 for URL: http://download.java.net/maven/2/org/jvnet/jaxb2/maven2/maven-jaxb2-plugin/0.7.2/maven-jaxb2-plugin-0.7.2.pom
Downloading: http://download.java.net/maven/1/org.jvnet.jaxb2.maven2/poms/maven-jaxb2-plugin-0.7.2.pom
[WARNING] Unable to get resource 'org.jvnet.jaxb2.maven2:maven-jaxb2-plugin:pom:0.7.2' from
repository maven-repository.dev.java.net (http://download.java.net/maven/1): Error transferring
file: Server returned HTTP response code: 503 for URL: http://download.java.net/maven/1/org.jvnet.jaxb2.maven2/poms/maven-jaxb2-plugin-0.7.2.pom
Downloading: http://repository.apache.org/snapshots/org/jvnet/jaxb2/maven2/maven-jaxb2-plugin/0.7.2/maven-jaxb2-plugin-0.7.2.pom
[INFO] Unable to find resource 'org.jvnet.jaxb2.maven2:maven-jaxb2-plugin:pom:0.7.2' in repository
apache.snapshots (https://repository.apache.org/content/repositories/snapshots/)
Downloading: http://repo1.maven.org/maven2/org/jvnet/jaxb2/maven2/maven-jaxb2-plugin/0.7.2/maven-jaxb2-plugin-0.7.2.pom
[INFO] Unable to find resource 'org.jvnet.jaxb2.maven2:maven-jaxb2-plugin:pom:0.7.2' in repository
central (http://repo1.maven.org/maven2)
Downloading: http://download.java.net/maven/2/org/jvnet/jaxb2/maven2/maven-jaxb2-plugin/0.7.2/maven-jaxb2-plugin-0.7.2.pom
[WARNING] Unable to get resource 'org.jvnet.jaxb2.maven2:maven-jaxb2-plugin:pom:0.7.2' from
repository maven2-repository.dev.java.net (http://download.java.net/maven/2): Error transferring
file: Server returned HTTP response code: 503 for URL: http://download.java.net/maven/2/org/jvnet/jaxb2/maven2/maven-jaxb2-plugin/0.7.2/maven-jaxb2-plugin-0.7.2.pom
Downloading: http://download.java.net/maven/1/org.jvnet.jaxb2.maven2/poms/maven-jaxb2-plugin-0.7.2.pom
[WARNING] Unable to get resource 'org.jvnet.jaxb2.maven2:maven-jaxb2-plugin:pom:0.7.2' from
repository maven-repository.dev.java.net (http://download.java.net/maven/1): Error transferring
file: Server returned HTTP response code: 503 for URL: http://download.java.net/maven/1/org.jvnet.jaxb2.maven2/poms/maven-jaxb2-plugin-0.7.2.pom
Downloading: http://repository.springsource.com/maven/bundles/external/org/jvnet/jaxb2/maven2/maven-jaxb2-plugin/0.7.2/maven-jaxb2-plugin-0.7.2.pom
[INFO] Unable to find resource 'org.jvnet.jaxb2.maven2:maven-jaxb2-plugin:pom:0.7.2' in repository
com.springsource.repository.bundles.external (http://repository.springsource.com/maven/bundles/external)
Downloading: http://repo1.maven.org/maven2/org/jvnet/jaxb2/maven2/maven-jaxb2-plugin/0.7.2/maven-jaxb2-plugin-0.7.2.pom
[INFO] Unable to find resource 'org.jvnet.jaxb2.maven2:maven-jaxb2-plugin:pom:0.7.2' in repository
central (http://repo1.maven.org/maven2)
[INFO] ------------------------------------------------------------------------
[INFO] SKIPPING ActiveMQ :: Web Console
[INFO]    task-segment: [clean, install, source:jar]
[INFO] This project has been banned from further executions due to previous failures.
[INFO] ------------------------------------------------------------------------
[INFO] ------------------------------------------------------------------------
[INFO] SKIPPING ActiveMQ :: Assembly
[INFO]    task-segment: [clean, install, source:jar]
[INFO] This project has been banned from further executions due to previous failures.
[INFO] ------------------------------------------------------------------------
[INFO] 
[INFO] 
[INFO] ------------------------------------------------------------------------
[INFO] Reactor Summary:
[INFO] ------------------------------------------------------------------------
[INFO] ActiveMQ .............................................. SUCCESS [2:32.246s]
[INFO] ActiveMQ :: KahaDB .................................... SUCCESS [1:41.213s]
[INFO] ActiveMQ :: JAAS ...................................... SUCCESS [1:19.747s]
[INFO] Openwire Generator .................................... SUCCESS [13.210s]
[INFO] ActiveMQ :: jmdns 1.0 ................................. SUCCESS [3.814s]
[INFO] ActiveMQ :: Core ...................................... SUCCESS [6:51:54.406s]
[INFO] ActiveMQ :: RA ........................................ SUCCESS [1:37.949s]
[INFO] ActiveMQ :: Pool ...................................... SUCCESS [22.085s]
[INFO] ActiveMQ :: Spring .................................... SUCCESS [1:29.932s]
[INFO] ActiveMQ :: Camel ..................................... SUCCESS [3:04.007s]
[INFO] ActiveMQ :: Console ................................... SUCCESS [15.747s]
[INFO] ActiveMQ :: Optional .................................. SUCCESS [3:52.937s]
[INFO] ActiveMQ :: Jar Bundle ................................ SUCCESS [29.798s]
[INFO] ActiveMQ :: File Server ............................... SUCCESS [21.889s]
[INFO] ActiveMQ :: Blueprint ................................. SUCCESS [18.646s]
[INFO] ActiveMQ :: Apache Karaf .............................. SUCCESS [24.876s]
[INFO] ActiveMQ :: RAR ....................................... SUCCESS [55.588s]
[INFO] ActiveMQ :: Run Jar ................................... SUCCESS [4.031s]
[INFO] ActiveMQ Tooling ...................................... SUCCESS [2.068s]
[INFO] ActiveMQ :: Memory Usage Test Plugin .................. SUCCESS [23.106s]
[INFO] ActiveMQ :: Performance Test Plugin ................... SUCCESS [7.345s]
[INFO] ActiveMQ :: StartUp Plugin ............................ SUCCESS [9.057s]
[INFO] ActiveMQ :: Web ....................................... SUCCESS [9.844s]
[INFO] ActiveMQ :: Web Demo .................................. SUCCESS [2:20.066s]
[INFO] ActiveMQ :: XMPP ...................................... FAILED [3.164s]
[INFO] ActiveMQ :: Web Console ............................... SKIPPED (dependency build failed
or was skipped)
[INFO] ActiveMQ :: Assembly .................................. SKIPPED (dependency build failed
or was skipped)
[INFO] ------------------------------------------------------------------------
[INFO] Error for project: ActiveMQ :: XMPP (during source:jar)
[INFO] ------------------------------------------------------------------------
[INFO] Error building POM (may not be this project's POM).


Project ID: org.jvnet.jaxb2.maven2:maven-jaxb2-plugin

Reason: POM 'org.jvnet.jaxb2.maven2:maven-jaxb2-plugin' not found in repository: Unable to
download the artifact from any repository

  org.jvnet.jaxb2.maven2:maven-jaxb2-plugin:pom:0.7.2

from the specified remote repositories:
  com.springsource.repository.bundles.external (http://repository.springsource.com/maven/bundles/external),
  central (http://repo1.maven.org/maven2),
  maven2-repository.dev.java.net (http://download.java.net/maven/2),
  Nexus (http://repository.apache.org/snapshots),
  maven-repository.dev.java.net (http://download.java.net/maven/1)

 for project org.jvnet.jaxb2.maven2:maven-jaxb2-plugin


[INFO] ------------------------------------------------------------------------
[INFO] Trace
org.apache.maven.lifecycle.LifecycleExecutionException: Unable to build project for plugin
'org.jvnet.jaxb2.maven2:maven-jaxb2-plugin': POM 'org.jvnet.jaxb2.maven2:maven-jaxb2-plugin'
not found in repository: Unable to download the artifact from any repository

  org.jvnet.jaxb2.maven2:maven-jaxb2-plugin:pom:0.7.2

from the specified remote repositories:
  com.springsource.repository.bundles.external (http://repository.springsource.com/maven/bundles/external),
  central (http://repo1.maven.org/maven2),
  maven2-repository.dev.java.net (http://download.java.net/maven/2),
  Nexus (http://repository.apache.org/snapshots),
  maven-repository.dev.java.net (http://download.java.net/maven/1)

 for project org.jvnet.jaxb2.maven2:maven-jaxb2-plugin
	at org.apache.maven.lifecycle.DefaultLifecycleExecutor.verifyPlugin(DefaultLifecycleExecutor.java:1557)
	at org.apache.maven.lifecycle.DefaultLifecycleExecutor.bindPluginToLifecycle(DefaultLifecycleExecutor.java:1503)
	at org.apache.maven.lifecycle.DefaultLifecycleExecutor.constructLifecycleMappings(DefaultLifecycleExecutor.java:1282)
	at org.apache.maven.lifecycle.DefaultLifecycleExecutor.forkProjectLifecycle(DefaultLifecycleExecutor.java:1060)
	at org.apache.maven.lifecycle.DefaultLifecycleExecutor.forkLifecycle(DefaultLifecycleExecutor.java:1038)
	at org.apache.maven.lifecycle.DefaultLifecycleExecutor.executeGoals(DefaultLifecycleExecutor.java:643)
	at org.apache.maven.lifecycle.DefaultLifecycleExecutor.executeStandaloneGoal(DefaultLifecycleExecutor.java:569)
	at org.apache.maven.lifecycle.DefaultLifecycleExecutor.executeGoal(DefaultLifecycleExecutor.java:539)
	at org.apache.maven.lifecycle.DefaultLifecycleExecutor.executeGoalAndHandleFailures(DefaultLifecycleExecutor.java:387)
	at org.apache.maven.lifecycle.DefaultLifecycleExecutor.executeTaskSegments(DefaultLifecycleExecutor.java:348)
	at org.apache.maven.lifecycle.DefaultLifecycleExecutor.execute(DefaultLifecycleExecutor.java:180)
	at org.apache.maven.lifecycle.LifecycleExecutorInterceptor.execute(LifecycleExecutorInterceptor.java:65)
	at org.apache.maven.DefaultMaven.doExecute(DefaultMaven.java:328)
	at org.apache.maven.DefaultMaven.execute(DefaultMaven.java:138)
	at org.apache.maven.cli.MavenCli.main(MavenCli.java:362)
	at sun.reflect.NativeMethodAccessorImpl.invoke0(Native Method)
	at sun.reflect.NativeMethodAccessorImpl.invoke(NativeMethodAccessorImpl.java:39)
	at sun.reflect.DelegatingMethodAccessorImpl.invoke(DelegatingMethodAccessorImpl.java:25)
	at java.lang.reflect.Method.invoke(Method.java:597)
	at org.codehaus.classworlds.Launcher.launchEnhanced(Launcher.java:315)
	at org.codehaus.classworlds.Launcher.launch(Launcher.java:255)
	at hudson.maven.agent.Main.launch(Main.java:185)
	at hudson.maven.MavenBuilder.call(MavenBuilder.java:164)
	at hudson.maven.MavenModuleSetBuild$Builder.call(MavenModuleSetBuild.java:987)
	at hudson.maven.MavenModuleSetBuild$Builder.call(MavenModuleSetBuild.java:918)
	at hudson.remoting.UserRequest.perform(UserRequest.java:118)
	at hudson.remoting.UserRequest.perform(UserRequest.java:48)
	at hudson.remoting.Request$2.run(Request.java:270)
	at java.util.concurrent.Executors$RunnableAdapter.call(Executors.java:441)
	at java.util.concurrent.FutureTask$Sync.innerRun(FutureTask.java:303)
	at java.util.concurrent.FutureTask.run(FutureTask.java:138)
	at java.util.concurrent.ThreadPoolExecutor$Worker.runTask(ThreadPoolExecutor.java:886)
	at java.util.concurrent.ThreadPoolExecutor$Worker.run(ThreadPoolExecutor.java:908)
	at java.lang.Thread.run(Thread.java:619)
Caused by: org.apache.maven.plugin.InvalidPluginException: Unable to build project for plugin
'org.jvnet.jaxb2.maven2:maven-jaxb2-plugin': POM 'org.jvnet.jaxb2.maven2:maven-jaxb2-plugin'
not found in repository: Unable to download the artifact from any repository

  org.jvnet.jaxb2.maven2:maven-jaxb2-plugin:pom:0.7.2

from the specified remote repositories:
  com.springsource.repository.bundles.external (http://repository.springsource.com/maven/bundles/external),
  central (http://repo1.maven.org/maven2),
  maven2-repository.dev.java.net (http://download.java.net/maven/2),
  Nexus (http://repository.apache.org/snapshots),
  maven-repository.dev.java.net (http://download.java.net/maven/1)

 for project org.jvnet.jaxb2.maven2:maven-jaxb2-plugin
	at org.apache.maven.plugin.DefaultPluginManager.checkRequiredMavenVersion(DefaultPluginManager.java:293)
	at org.apache.maven.plugin.DefaultPluginManager.verifyVersionedPlugin(DefaultPluginManager.java:205)
	at org.apache.maven.plugin.DefaultPluginManager.verifyPlugin(DefaultPluginManager.java:184)
	at org.apache.maven.plugin.DefaultPluginManager.loadPluginDescriptor(DefaultPluginManager.java:1642)
	at org.apache.maven.lifecycle.DefaultLifecycleExecutor.verifyPlugin(DefaultLifecycleExecutor.java:1540)
	... 33 more
Caused by: org.apache.maven.project.ProjectBuildingException: POM 'org.jvnet.jaxb2.maven2:maven-jaxb2-plugin'
not found in repository: Unable to download the artifact from any repository

  org.jvnet.jaxb2.maven2:maven-jaxb2-plugin:pom:0.7.2

from the specified remote repositories:
  com.springsource.repository.bundles.external (http://repository.springsource.com/maven/bundles/external),
  central (http://repo1.maven.org/maven2),
  maven2-repository.dev.java.net (http://download.java.net/maven/2),
  Nexus (http://repository.apache.org/snapshots),
  maven-repository.dev.java.net (http://download.java.net/maven/1)

 for project org.jvnet.jaxb2.maven2:maven-jaxb2-plugin
	at org.apache.maven.project.DefaultMavenProjectBuilder.findModelFromRepository(DefaultMavenProjectBuilder.java:605)
	at org.apache.maven.project.DefaultMavenProjectBuilder.buildFromRepository(DefaultMavenProjectBuilder.java:251)
	at org.apache.maven.plugin.DefaultPluginManager.checkRequiredMavenVersion(DefaultPluginManager.java:277)
	... 37 more
Caused by: org.apache.maven.artifact.resolver.ArtifactNotFoundException: Unable to download
the artifact from any repository

  org.jvnet.jaxb2.maven2:maven-jaxb2-plugin:pom:0.7.2

from the specified remote repositories:
  com.springsource.repository.bundles.external (http://repository.springsource.com/maven/bundles/external),
  central (http://repo1.maven.org/maven2),
  maven2-repository.dev.java.net (http://download.java.net/maven/2),
  Nexus (http://repository.apache.org/snapshots),
  maven-repository.dev.java.net (http://download.java.net/maven/1)


	at org.apache.maven.artifact.resolver.DefaultArtifactResolver.resolve(DefaultArtifactResolver.java:228)
	at org.apache.maven.artifact.resolver.DefaultArtifactResolver.resolve(DefaultArtifactResolver.java:90)
	at org.apache.maven.project.DefaultMavenProjectBuilder.findModelFromRepository(DefaultMavenProjectBuilder.java:558)
	... 39 more
Caused by: org.apache.maven.wagon.ResourceDoesNotExistException: Unable to download the artifact
from any repository
	at org.apache.maven.artifact.manager.DefaultWagonManager.getArtifact(DefaultWagonManager.java:404)
	at org.apache.maven.artifact.resolver.DefaultArtifactResolver.resolve(DefaultArtifactResolver.java:216)
	... 41 more
[INFO] ------------------------------------------------------------------------
[INFO] BUILD ERRORS
[INFO] ------------------------------------------------------------------------
[INFO] Total time: 436 minutes 13 seconds
[INFO] Finished at: Wed Jun 29 07:40:17 UTC 2011
[INFO] Final Memory: 163M/1686M
[INFO] ------------------------------------------------------------------------
Sending e-mails to: dev@activemq.apache.org
Sending e-mails to: dev@activemq.apache.org
Sending e-mails to: dev@activemq.apache.org
channel stopped
[locks-and-latches] Releasing all the locks
[locks-and-latches] All the locks released


Mime
View raw message