activemq-dev mailing list archives

Site index · List index
Message view « Date » · « Thread »
Top « Date » · « Thread »
From Apache Jenkins Server <hud...@hudson.apache.org>
Subject Build failed in Jenkins: ActiveMQ #667
Date Mon, 06 Jun 2011 20:02:44 GMT
See <https://builds.apache.org/hudson/job/ActiveMQ/667/changes>

Changes:

[dejanb] https://issues.apache.org/jira/browse/AMQ-3351 - moving LocationMarshaller to kahadb
module, so it can work well in osgi environment

------------------------------------------
[...truncated 12209 lines...]
[WARNING] *** CHECKSUM FAILED - Error retrieving checksum file for com/sun/xml/dtd-parser/dtd-parser/1.0/dtd-parser-1.0.jar
- IGNORING
Downloading: http://download.java.net/maven/2/org/kohsuke/rngom/rngom/20061207/rngom-20061207.jar
Downloading: http://download.java.net/maven/2/org/jvnet/jaxb2/maven2/maven-jaxb2-plugin-raw/0.7.2/maven-jaxb2-plugin-raw-0.7.2.jar
[INFO] Unable to find resource 'javax.xml.stream:stax-api:jar:1.0-2' in repository maven2-repository.dev.java.net
(http://download.java.net/maven/2)
Downloading: http://download.java.net/maven/1/javax.xml.stream/jars/stax-api-1.0-2.jar
[INFO] Unable to find resource 'com.sun.xml.bind:jaxb-impl:jar:2.1.12' in repository maven2-repository.dev.java.net
(http://download.java.net/maven/2)
Downloading: http://download.java.net/maven/1/com.sun.xml.bind/jars/jaxb-impl-2.1.12.jar
33K downloaded  (maven-jaxb2-plugin-raw-0.7.2.jar)
Downloading: http://download.java.net/maven/2/javax/xml/bind/jaxb-api/2.1/jaxb-api-2.1.jar
[INFO] Unable to find resource 'javax.xml.bind:jaxb-api:jar:2.1' in repository maven2-repository.dev.java.net
(http://download.java.net/maven/2)
Downloading: http://download.java.net/maven/1/javax.xml.bind/jars/jaxb-api-2.1.jar
22K downloaded  (stax-api-1.0-2.jar)
289K downloaded  (rngom-20061207.jar)
101K downloaded  (jaxb-api-2.1.jar)
[WARNING] *** CHECKSUM FAILED - Error retrieving checksum file for org/kohsuke/rngom/rngom/20061207/rngom-20061207.jar
- IGNORING
2104K downloaded  (jaxb2-basics-jaxb-xjc-2.1.12.jar)
847K downloaded  (jaxb-impl-2.1.12.jar)
[INFO] [jaxb2:generate {execution: default}]
Cannot find CatalogManager.properties
[INFO] [remote-resources:process {execution: default}]
[INFO] [resources:resources {execution: default-resources}]
[INFO] Using 'UTF-8' encoding to copy filtered resources.
[INFO] Copying 35 resources
[INFO] Copying 0 resource
[INFO] Copying 1 resource
[INFO] Copying 3 resources
[INFO] [compiler:compile {execution: default-compile}]
[INFO] Compiling 145 source files to <https://builds.apache.org/hudson/job/ActiveMQ/ws/activemq-xmpp/target/classes>
[INFO] [resources:testResources {execution: default-testResources}]
[INFO] Using 'UTF-8' encoding to copy filtered resources.
[INFO] Copying 2 resources
[INFO] Copying 3 resources
[INFO] [compiler:testCompile {execution: default-testCompile}]
[INFO] Compiling 2 source files to <https://builds.apache.org/hudson/job/ActiveMQ/ws/activemq-xmpp/target/test-classes>
[INFO] [surefire:test {execution: default-test}]
[INFO] Surefire report directory: <https://builds.apache.org/hudson/job/ActiveMQ/ws/activemq-xmpp/target/surefire-reports>

-------------------------------------------------------
 T E S T S
-------------------------------------------------------
Running org.apache.activemq.transport.xmpp.XmppTest
Tests run: 4, Failures: 0, Errors: 0, Skipped: 0, Time elapsed: 25.491 sec

Results :

Tests run: 4, Failures: 0, Errors: 0, Skipped: 0

[JENKINS] Recording test results
[INFO] [jar:jar {execution: default-jar}]
[INFO] Building jar: <https://builds.apache.org/hudson/job/ActiveMQ/ws/activemq-xmpp/target/activemq-xmpp-5.6-SNAPSHOT.jar>
[INFO] [ianal:verify-legal-files {execution: default}]
[INFO] Checking legal files in: activemq-xmpp-5.6-SNAPSHOT.jar
[INFO] [install:install {execution: default-install}]
[INFO] Installing <https://builds.apache.org/hudson/job/ActiveMQ/ws/activemq-xmpp/target/activemq-xmpp-5.6-SNAPSHOT.jar>
to <https://builds.apache.org/hudson/job/ActiveMQ/ws/.repository/org/apache/activemq/activemq-xmpp/5.6-SNAPSHOT/activemq-xmpp-5.6-SNAPSHOT.jar>
[INFO] Preparing source:jar
[JENKINS] Archiving <https://builds.apache.org/hudson/job/ActiveMQ/ws/activemq-xmpp/pom.xml>
to /home/hudson/hudson/jobs/ActiveMQ/modules/org.apache.activemq$activemq-xmpp/builds/2011-06-06_12-08-14/archive/org.apache.activemq/activemq-xmpp/5.6-SNAPSHOT/activemq-xmpp-5.6-SNAPSHOT.pom
[JENKINS] Archiving <https://builds.apache.org/hudson/job/ActiveMQ/ws/activemq-xmpp/target/activemq-xmpp-5.6-SNAPSHOT.jar>
to /home/hudson/hudson/jobs/ActiveMQ/modules/org.apache.activemq$activemq-xmpp/builds/2011-06-06_12-08-14/archive/org.apache.activemq/activemq-xmpp/5.6-SNAPSHOT/activemq-xmpp-5.6-SNAPSHOT.jar
[INFO] [enforcer:enforce {execution: default}]
[INFO] [bundle:cleanVersions {execution: cleanVersions}]
[INFO] [jaxb2:generate {execution: default}]
[INFO] Skipped XJC execution.  Generated sources were up-to-date.
[INFO] [source:jar {execution: default-cli}]
[INFO] Building jar: <https://builds.apache.org/hudson/job/ActiveMQ/ws/activemq-xmpp/target/activemq-xmpp-5.6-SNAPSHOT-sources.jar>
[JENKINS] Archiving <https://builds.apache.org/hudson/job/ActiveMQ/ws/activemq-xmpp/target/activemq-xmpp-5.6-SNAPSHOT-sources.jar>
to /home/hudson/hudson/jobs/ActiveMQ/modules/org.apache.activemq$activemq-xmpp/builds/2011-06-06_12-08-14/archive/org.apache.activemq/activemq-xmpp/5.6-SNAPSHOT/activemq-xmpp-5.6-SNAPSHOT-sources.jar
[INFO] ------------------------------------------------------------------------
[INFO] SKIPPING ActiveMQ :: Web Console
[INFO]    task-segment: [clean, install, source:jar]
[INFO] This project has been banned from further executions due to previous failures.
[INFO] ------------------------------------------------------------------------
[INFO] ------------------------------------------------------------------------
[INFO] SKIPPING ActiveMQ :: Assembly
[INFO]    task-segment: [clean, install, source:jar]
[INFO] This project has been banned from further executions due to previous failures.
[INFO] ------------------------------------------------------------------------
[INFO] 
[INFO] 
[INFO] ------------------------------------------------------------------------
[INFO] Reactor Summary:
[INFO] ------------------------------------------------------------------------
[INFO] ActiveMQ .............................................. SUCCESS [4:23.367s]
[INFO] ActiveMQ :: KahaDB .................................... SUCCESS [1:27.268s]
[INFO] ActiveMQ :: JAAS ...................................... SUCCESS [1:21.619s]
[INFO] Openwire Generator .................................... SUCCESS [14.194s]
[INFO] ActiveMQ :: jmdns 1.0 ................................. SUCCESS [4.367s]
[INFO] ActiveMQ :: Core ...................................... SUCCESS [7:10:33.294s]
[INFO] ActiveMQ :: RA ........................................ SUCCESS [1:42.470s]
[INFO] ActiveMQ :: Pool ...................................... SUCCESS [27.307s]
[INFO] ActiveMQ :: Spring .................................... SUCCESS [1:37.847s]
[INFO] ActiveMQ :: Camel ..................................... SUCCESS [3:04.954s]
[INFO] ActiveMQ :: Console ................................... FAILED [20:28.761s]
[INFO] ActiveMQ :: Optional .................................. SKIPPED (dependency build failed
or was skipped)
[INFO] ActiveMQ :: Jar Bundle ................................ SKIPPED (dependency build failed
or was skipped)
[INFO] ActiveMQ :: File Server ............................... SUCCESS [33.999s]
[INFO] ActiveMQ :: Blueprint ................................. SUCCESS [17.744s]
[INFO] ActiveMQ :: Apache Karaf .............................. SKIPPED (dependency build failed
or was skipped)
[INFO] ActiveMQ :: RAR ....................................... SKIPPED (dependency build failed
or was skipped)
[INFO] ActiveMQ :: Run Jar ................................... SKIPPED (dependency build failed
or was skipped)
[INFO] ActiveMQ Tooling ...................................... SUCCESS [2.020s]
[INFO] ActiveMQ :: Memory Usage Test Plugin .................. SKIPPED (dependency build failed
or was skipped)
[INFO] ActiveMQ :: Performance Test Plugin ................... SKIPPED (dependency build failed
or was skipped)
[INFO] ActiveMQ :: StartUp Plugin ............................ SKIPPED (dependency build failed
or was skipped)
[INFO] ActiveMQ :: Web ....................................... SUCCESS [23.701s]
[INFO] ActiveMQ :: Web Demo .................................. SUCCESS [3:36.582s]
[INFO] ActiveMQ :: XMPP ...................................... SUCCESS [57.333s]
[INFO] ActiveMQ :: Web Console ............................... SKIPPED (dependency build failed
or was skipped)
[INFO] ActiveMQ :: Assembly .................................. SKIPPED (dependency build failed
or was skipped)
[INFO] ------------------------------------------------------------------------
[INFO] Error for project: ActiveMQ :: Console (during install)
[INFO] ------------------------------------------------------------------------
[INFO] Failed to resolve artifact.

Missing:
----------
1) net.sf.josql:josql:jar:1.5

  Try downloading the file manually from the project website.

  Then, install it using the command: 
      mvn install:install-file -DgroupId=net.sf.josql -DartifactId=josql -Dversion=1.5 -Dpackaging=jar
-Dfile=/path/to/file

  Alternatively, if you host your own repository you can deploy the file there: 
      mvn deploy:deploy-file -DgroupId=net.sf.josql -DartifactId=josql -Dversion=1.5 -Dpackaging=jar
-Dfile=/path/to/file -Durl=[url] -DrepositoryId=[id]

  Path to dependency: 
  	1) org.apache.activemq:activemq-console:bundle:5.6-SNAPSHOT
  	2) net.sf.josql:josql:jar:1.5

----------
1 required artifact is missing.

for artifact: 
  org.apache.activemq:activemq-console:bundle:5.6-SNAPSHOT

from the specified remote repositories:
  com.springsource.repository.bundles.external (http://repository.springsource.com/maven/bundles/external),
  central (http://repo1.maven.org/maven2),
  com.fusesource.m2 (http://repo.fusesource.com/nexus/content/groups/public/),
  Nexus (http://repository.apache.org/snapshots)



[INFO] ------------------------------------------------------------------------
[INFO] Trace
org.apache.maven.lifecycle.LifecycleExecutionException: Missing:
----------
1) net.sf.josql:josql:jar:1.5

  Try downloading the file manually from the project website.

  Then, install it using the command: 
      mvn install:install-file -DgroupId=net.sf.josql -DartifactId=josql -Dversion=1.5 -Dpackaging=jar
-Dfile=/path/to/file

  Alternatively, if you host your own repository you can deploy the file there: 
      mvn deploy:deploy-file -DgroupId=net.sf.josql -DartifactId=josql -Dversion=1.5 -Dpackaging=jar
-Dfile=/path/to/file -Durl=[url] -DrepositoryId=[id]

  Path to dependency: 
  	1) org.apache.activemq:activemq-console:bundle:5.6-SNAPSHOT
  	2) net.sf.josql:josql:jar:1.5

----------
1 required artifact is missing.

for artifact: 
  org.apache.activemq:activemq-console:bundle:5.6-SNAPSHOT

from the specified remote repositories:
  com.springsource.repository.bundles.external (http://repository.springsource.com/maven/bundles/external),
  central (http://repo1.maven.org/maven2),
  com.fusesource.m2 (http://repo.fusesource.com/nexus/content/groups/public/),
  Nexus (http://repository.apache.org/snapshots)


	at org.apache.maven.lifecycle.DefaultLifecycleExecutor.executeGoals(DefaultLifecycleExecutor.java:711)
	at org.apache.maven.lifecycle.DefaultLifecycleExecutor.executeGoalWithLifecycle(DefaultLifecycleExecutor.java:556)
	at org.apache.maven.lifecycle.DefaultLifecycleExecutor.executeGoal(DefaultLifecycleExecutor.java:535)
	at org.apache.maven.lifecycle.DefaultLifecycleExecutor.executeGoalAndHandleFailures(DefaultLifecycleExecutor.java:387)
	at org.apache.maven.lifecycle.DefaultLifecycleExecutor.executeTaskSegments(DefaultLifecycleExecutor.java:348)
	at org.apache.maven.lifecycle.DefaultLifecycleExecutor.execute(DefaultLifecycleExecutor.java:180)
	at org.apache.maven.lifecycle.LifecycleExecutorInterceptor.execute(LifecycleExecutorInterceptor.java:65)
	at org.apache.maven.DefaultMaven.doExecute(DefaultMaven.java:328)
	at org.apache.maven.DefaultMaven.execute(DefaultMaven.java:138)
	at org.apache.maven.cli.MavenCli.main(MavenCli.java:362)
	at sun.reflect.NativeMethodAccessorImpl.invoke0(Native Method)
	at sun.reflect.NativeMethodAccessorImpl.invoke(NativeMethodAccessorImpl.java:39)
	at sun.reflect.DelegatingMethodAccessorImpl.invoke(DelegatingMethodAccessorImpl.java:25)
	at java.lang.reflect.Method.invoke(Method.java:597)
	at org.codehaus.classworlds.Launcher.launchEnhanced(Launcher.java:315)
	at org.codehaus.classworlds.Launcher.launch(Launcher.java:255)
	at hudson.maven.agent.Main.launch(Main.java:185)
	at hudson.maven.MavenBuilder.call(MavenBuilder.java:164)
	at hudson.maven.MavenModuleSetBuild$Builder.call(MavenModuleSetBuild.java:987)
	at hudson.maven.MavenModuleSetBuild$Builder.call(MavenModuleSetBuild.java:918)
	at hudson.remoting.UserRequest.perform(UserRequest.java:118)
	at hudson.remoting.UserRequest.perform(UserRequest.java:48)
	at hudson.remoting.Request$2.run(Request.java:270)
	at java.util.concurrent.Executors$RunnableAdapter.call(Executors.java:441)
	at java.util.concurrent.FutureTask$Sync.innerRun(FutureTask.java:303)
	at java.util.concurrent.FutureTask.run(FutureTask.java:138)
	at java.util.concurrent.ThreadPoolExecutor$Worker.runTask(ThreadPoolExecutor.java:886)
	at java.util.concurrent.ThreadPoolExecutor$Worker.run(ThreadPoolExecutor.java:908)
	at java.lang.Thread.run(Thread.java:619)
Caused by: org.apache.maven.artifact.resolver.MultipleArtifactsNotFoundException: Missing:
----------
1) net.sf.josql:josql:jar:1.5

  Try downloading the file manually from the project website.

  Then, install it using the command: 
      mvn install:install-file -DgroupId=net.sf.josql -DartifactId=josql -Dversion=1.5 -Dpackaging=jar
-Dfile=/path/to/file

  Alternatively, if you host your own repository you can deploy the file there: 
      mvn deploy:deploy-file -DgroupId=net.sf.josql -DartifactId=josql -Dversion=1.5 -Dpackaging=jar
-Dfile=/path/to/file -Durl=[url] -DrepositoryId=[id]

  Path to dependency: 
  	1) org.apache.activemq:activemq-console:bundle:5.6-SNAPSHOT
  	2) net.sf.josql:josql:jar:1.5

----------
1 required artifact is missing.

for artifact: 
  org.apache.activemq:activemq-console:bundle:5.6-SNAPSHOT

from the specified remote repositories:
  com.springsource.repository.bundles.external (http://repository.springsource.com/maven/bundles/external),
  central (http://repo1.maven.org/maven2),
  com.fusesource.m2 (http://repo.fusesource.com/nexus/content/groups/public/),
  Nexus (http://repository.apache.org/snapshots)


	at org.apache.maven.artifact.resolver.DefaultArtifactResolver.resolveTransitively(DefaultArtifactResolver.java:360)
	at org.apache.maven.artifact.resolver.DefaultArtifactResolver.resolveTransitively(DefaultArtifactResolver.java:304)
	at org.apache.maven.plugin.DefaultPluginManager.resolveTransitiveDependencies(DefaultPluginManager.java:1499)
	at org.apache.maven.plugin.DefaultPluginManager.executeMojo(DefaultPluginManager.java:442)
	at hudson.maven.agent.PluginManagerInterceptor.executeMojo(PluginManagerInterceptor.java:182)
	at org.apache.maven.lifecycle.DefaultLifecycleExecutor.executeGoals(DefaultLifecycleExecutor.java:694)
	... 28 more
[INFO] ------------------------------------------------------------------------
[INFO] BUILD ERRORS
[INFO] ------------------------------------------------------------------------
[INFO] Total time: 473 minutes 51 seconds
[INFO] Finished at: Mon Jun 06 20:02:34 UTC 2011
[INFO] Final Memory: 127M/1640M
[INFO] ------------------------------------------------------------------------
Sending e-mails to: dev@activemq.apache.org
Sending e-mails to: dev@activemq.apache.org
channel stopped
[locks-and-latches] Releasing all the locks
[locks-and-latches] All the locks released


Mime
View raw message