activemq-dev mailing list archives

Site index · List index
Message view « Date » · « Thread »
Top « Date » · « Thread »
From Apache Jenkins Server <hud...@hudson.apache.org>
Subject Build failed in Jenkins: ActiveMQ #652
Date Thu, 19 May 2011 07:40:16 GMT
See <https://builds.apache.org/hudson/job/ActiveMQ/652/changes>

Changes:

[dejanb] https://issues.apache.org/jira/browse/AMQ-3135 - ConnectionInfo.clientIp - supporting
duplex network case

------------------------------------------
[...truncated 9517 lines...]
Tests run: 1, Failures: 0, Errors: 0, Skipped: 0, Time elapsed: 0.171 sec
Running org.apache.activemq.openwire.v6.TransactionInfoTest
Tests run: 1, Failures: 0, Errors: 0, Skipped: 0, Time elapsed: 0.172 sec
Running org.apache.activemq.memory.buffer.OrderBasedMemoryBufferTest
Tests run: 1, Failures: 0, Errors: 0, Skipped: 0, Time elapsed: 0.129 sec
Running org.apache.activemq.bugs.AMQ2512Test
Tests run: 1, Failures: 0, Errors: 0, Skipped: 0, Time elapsed: 119.82 sec
Running org.apache.activemq.openwire.v1.ActiveMQQueueTest
Tests run: 1, Failures: 0, Errors: 0, Skipped: 0, Time elapsed: 0.198 sec
Running org.apache.activemq.openwire.v2.ResponseTest
Tests run: 1, Failures: 0, Errors: 0, Skipped: 0, Time elapsed: 0.168 sec
Running org.apache.activemq.openwire.v2.WireFormatInfoTest
Tests run: 1, Failures: 0, Errors: 0, Skipped: 0, Time elapsed: 0.168 sec
Running org.apache.activemq.bugs.AMQ2832Test
Tests run: 1, Failures: 0, Errors: 0, Skipped: 0, Time elapsed: 10.72 sec
Running org.apache.activemq.broker.virtual.CompositeQueueTest
Tests run: 1, Failures: 0, Errors: 0, Skipped: 0, Time elapsed: 1.173 sec
Running org.apache.activemq.filter.DummyPolicyTest
Tests run: 1, Failures: 0, Errors: 0, Skipped: 0, Time elapsed: 0.37 sec
Running org.apache.activemq.openwire.v4.LocalTransactionIdTest
Tests run: 1, Failures: 0, Errors: 0, Skipped: 0, Time elapsed: 0.17 sec
Running org.apache.activemq.openwire.v2.ReplayCommandTest
Tests run: 1, Failures: 0, Errors: 0, Skipped: 0, Time elapsed: 1.157 sec
Running org.apache.activemq.JmsRollbackRedeliveryTest
Tests run: 9, Failures: 0, Errors: 0, Skipped: 0, Time elapsed: 10.761 sec
Running org.apache.activemq.ExclusiveConsumerTest
Tests run: 6, Failures: 0, Errors: 0, Skipped: 0, Time elapsed: 2.686 sec
Running org.apache.activemq.broker.MessageExpirationTest
Tests run: 13, Failures: 0, Errors: 0, Skipped: 0, Time elapsed: 24.007 sec
Running org.apache.activemq.usecases.AMQStackOverFlowTest
Tests run: 1, Failures: 0, Errors: 0, Skipped: 0, Time elapsed: 5.73 sec
Running org.apache.activemq.openwire.v3.ProducerIdTest
Tests run: 1, Failures: 0, Errors: 0, Skipped: 0, Time elapsed: 0.165 sec
Running org.apache.activemq.ActiveMQMessageAuditTest
Tests run: 3, Failures: 0, Errors: 0, Skipped: 0, Time elapsed: 0.553 sec
Running org.apache.activemq.openwire.v4.MessageIdTest
Tests run: 1, Failures: 0, Errors: 0, Skipped: 0, Time elapsed: 0.166 sec
Running org.apache.activemq.openwire.v7.MessagePullTest
Tests run: 1, Failures: 0, Errors: 0, Skipped: 0, Time elapsed: 0.189 sec
Running org.apache.activemq.openwire.v1.JournalTransactionTest
Tests run: 1, Failures: 0, Errors: 0, Skipped: 0, Time elapsed: 0.183 sec
Running org.apache.activemq.JmsTopicRequestReplyTest
Tests run: 2, Failures: 0, Errors: 0, Skipped: 0, Time elapsed: 0.676 sec
Running org.apache.activemq.test.retroactive.RetroactiveConsumerTestWithDestinationBasedBufferTest
Tests run: 1, Failures: 0, Errors: 0, Skipped: 0, Time elapsed: 1.283 sec
Running org.apache.activemq.command.MessageTest
Tests run: 6, Failures: 0, Errors: 0, Skipped: 0, Time elapsed: 0.17 sec
Running org.apache.activemq.bugs.AMQ2645Test
Tests run: 1, Failures: 0, Errors: 0, Skipped: 0, Time elapsed: 8.552 sec
Running org.apache.activemq.transport.udp.UdpSendReceiveWithTwoConnectionsTest
Tests run: 1, Failures: 0, Errors: 0, Skipped: 0, Time elapsed: 1.66 sec
Running org.apache.activemq.bugs.AMQ2213Test
Tests run: 3, Failures: 0, Errors: 0, Skipped: 0, Time elapsed: 9.835 sec
Running org.apache.activemq.ActiveMQInputStreamTest
Tests run: 1, Failures: 0, Errors: 0, Skipped: 0, Time elapsed: 2.377 sec
Running org.apache.activemq.usecases.ThreeBrokerTopicNetworkUsingTcpTest
Tests run: 9, Failures: 0, Errors: 0, Skipped: 0, Time elapsed: 88.926 sec
Running org.apache.activemq.openwire.v8.JournalQueueAckTest
Tests run: 1, Failures: 0, Errors: 0, Skipped: 0, Time elapsed: 0.202 sec
Running org.apache.activemq.broker.policy.NoRetryDeadLetterTest
Tests run: 4, Failures: 0, Errors: 0, Skipped: 0, Time elapsed: 0.891 sec
Running org.apache.activemq.openwire.v4.MessageAckTest
Tests run: 1, Failures: 0, Errors: 0, Skipped: 0, Time elapsed: 0.192 sec
Running org.apache.activemq.ProducerFlowControlTest
Tests run: 6, Failures: 0, Errors: 0, Skipped: 0, Time elapsed: 25.622 sec
Running org.apache.activemq.broker.ft.DbRestartJDBCQueueTest
Tests run: 1, Failures: 0, Errors: 0, Skipped: 0, Time elapsed: 32.346 sec
Running org.apache.activemq.broker.ft.JDBCQueueMasterSlaveTest
Tests run: 1, Failures: 0, Errors: 0, Skipped: 0, Time elapsed: 38.211 sec
Running org.apache.activemq.openwire.v2.SubscriptionInfoTest
Tests run: 1, Failures: 0, Errors: 0, Skipped: 0, Time elapsed: 0.173 sec
Running org.apache.activemq.bugs.AMQ1893Test
Tests run: 1, Failures: 0, Errors: 0, Skipped: 0, Time elapsed: 397.972 sec
Running org.apache.activemq.openwire.v7.SessionInfoTest
Tests run: 1, Failures: 0, Errors: 0, Skipped: 0, Time elapsed: 0.206 sec
Running org.apache.activemq.usecases.TwoBrokerNetworkConnectorWildcardDynamicallyIncludedDestinationTest
Tests run: 4, Failures: 0, Errors: 0, Skipped: 0, Time elapsed: 55.324 sec
Running org.apache.activemq.openwire.v2.ActiveMQQueueTest
Tests run: 1, Failures: 0, Errors: 0, Skipped: 0, Time elapsed: 0.169 sec
Running org.apache.activemq.advisory.MasterSlaveTempQueueMemoryTest
Tests run: 6, Failures: 0, Errors: 0, Skipped: 0, Time elapsed: 44.645 sec
Running org.apache.activemq.openwire.v4.ControlCommandTest
Tests run: 1, Failures: 0, Errors: 0, Skipped: 0, Time elapsed: 0.174 sec
Running org.apache.activemq.openwire.v4.FlushCommandTest
Tests run: 1, Failures: 0, Errors: 0, Skipped: 0, Time elapsed: 0.173 sec
Running org.apache.activemq.openwire.v5.FlushCommandTest
Tests run: 1, Failures: 0, Errors: 0, Skipped: 0, Time elapsed: 0.171 sec
Running org.apache.activemq.broker.message.security.MessageAuthenticationTest
Tests run: 1, Failures: 0, Errors: 0, Skipped: 0, Time elapsed: 0.683 sec
Running org.apache.activemq.openwire.v3.JournalTopicAckTest
Tests run: 1, Failures: 0, Errors: 0, Skipped: 0, Time elapsed: 0.197 sec
Running org.apache.activemq.JMSConsumerTest
Tests run: 100, Failures: 0, Errors: 0, Skipped: 0, Time elapsed: 28.023 sec
Running org.apache.activemq.security.XBeanSecurityWithGuestNoCredentialsOnlyTest
Tests run: 5, Failures: 0, Errors: 0, Skipped: 0, Time elapsed: 11.598 sec
Running org.apache.activemq.openwire.v3.LastPartialCommandTest
Tests run: 1, Failures: 0, Errors: 0, Skipped: 0, Time elapsed: 0.179 sec
Running org.apache.activemq.JmsTopicTransactionTest
Tests run: 14, Failures: 0, Errors: 0, Skipped: 0, Time elapsed: 19.878 sec
Running org.apache.activemq.openwire.v2.TransactionInfoTest
Tests run: 1, Failures: 0, Errors: 0, Skipped: 0, Time elapsed: 0.173 sec
Running org.apache.activemq.test.JmsTopicSendReceiveTest
Tests run: 1, Failures: 0, Errors: 0, Skipped: 0, Time elapsed: 1.603 sec
Running org.apache.activemq.openwire.v7.ConsumerIdTest
Tests run: 1, Failures: 0, Errors: 0, Skipped: 0, Time elapsed: 0.167 sec
Running org.apache.activemq.openwire.v1.DataArrayResponseTest
Tests run: 1, Failures: 0, Errors: 0, Skipped: 0, Time elapsed: 0.178 sec
Running org.apache.activemq.jndi.ActiveMQInitialContextFactoryTest
Tests run: 3, Failures: 0, Errors: 0, Skipped: 0, Time elapsed: 0.16 sec
Running org.apache.activemq.usecases.NewConsumerCreatesDestinationTest
Tests run: 1, Failures: 0, Errors: 0, Skipped: 0, Time elapsed: 0.598 sec
Running org.apache.activemq.usecases.JournalDurableSubscriptionTest
Tests run: 10, Failures: 0, Errors: 0, Skipped: 0, Time elapsed: 59.583 sec
Running org.apache.activemq.openwire.v3.ControlCommandTest
Tests run: 1, Failures: 0, Errors: 0, Skipped: 0, Time elapsed: 0.167 sec
Running org.apache.activemq.openwire.v1.PartialCommandTest
Tests run: 1, Failures: 0, Errors: 0, Skipped: 0, Time elapsed: 0.165 sec
Running org.apache.activemq.bugs.AMQ2736Test
Tests run: 1, Failures: 0, Errors: 0, Skipped: 0, Time elapsed: 2.719 sec
Running org.apache.activemq.xbean.MultipleTestsWithEmbeddedBrokerAndPersistenceTest
Tests run: 2, Failures: 0, Errors: 0, Skipped: 0, Time elapsed: 2.491 sec
Running org.apache.activemq.openwire.v2.ProducerIdTest
Tests run: 1, Failures: 0, Errors: 0, Skipped: 0, Time elapsed: 0.171 sec
Running org.apache.activemq.config.BrokerXmlConfigFromJNDITest
Tests run: 1, Failures: 0, Errors: 0, Skipped: 0, Time elapsed: 2.98 sec
Running org.apache.activemq.security.JaasNetworkTest
Tests run: 1, Failures: 0, Errors: 0, Skipped: 0, Time elapsed: 6.769 sec
Running org.apache.activemq.store.kahadb.KahaDBMessagePriorityTest
Tests run: 14, Failures: 0, Errors: 0, Skipped: 0, Time elapsed: 228.65 sec
Running org.apache.activemq.security.JaasDualAuthenticationBrokerTest
Tests run: 2, Failures: 0, Errors: 0, Skipped: 0, Time elapsed: 0.184 sec
Running org.apache.activemq.openwire.v1.ExceptionResponseTest
Tests run: 1, Failures: 0, Errors: 0, Skipped: 0, Time elapsed: 0.175 sec
Running org.apache.activemq.CreateConsumerButDontStartConnectionWarningTest
Tests run: 1, Failures: 0, Errors: 0, Skipped: 0, Time elapsed: 2.628 sec
Running org.apache.activemq.bugs.ConnectionPerMessageTest
Tests run: 1, Failures: 0, Errors: 0, Skipped: 0, Time elapsed: 16.733 sec
Running org.apache.activemq.bugs.SparseAckReplayAfterStoreCleanupAMQStoreTest
Tests run: 1, Failures: 0, Errors: 0, Skipped: 0, Time elapsed: 8.674 sec
Running org.apache.activemq.openwire.v7.ConsumerInfoTest
Tests run: 1, Failures: 0, Errors: 0, Skipped: 0, Time elapsed: 0.195 sec
Running org.apache.activemq.openwire.v6.ConnectionErrorTest
Tests run: 1, Failures: 0, Errors: 0, Skipped: 0, Time elapsed: 0.17 sec
Running org.apache.activemq.openwire.v7.MessageDispatchNotificationTest
Tests run: 1, Failures: 0, Errors: 0, Skipped: 0, Time elapsed: 0.189 sec
Running org.apache.activemq.ActiveMQSslConnectionFactoryTest
Tests run: 4, Failures: 0, Errors: 0, Skipped: 0, Time elapsed: 9.035 sec
Running org.apache.activemq.broker.scheduler.JobSchedulerTest
Tests run: 9, Failures: 0, Errors: 0, Skipped: 0, Time elapsed: 29.681 sec
Running org.apache.activemq.bugs.AMQ2171Test
Tests run: 2, Failures: 0, Errors: 0, Skipped: 0, Time elapsed: 9.504 sec
Running org.apache.activemq.openwire.v1.RemoveSubscriptionInfoTest
Tests run: 1, Failures: 0, Errors: 0, Skipped: 0, Time elapsed: 0.175 sec
Running org.apache.activemq.openwire.v7.DiscoveryEventTest
Tests run: 1, Failures: 0, Errors: 0, Skipped: 0, Time elapsed: 0.165 sec
Running org.apache.activemq.openwire.v7.LocalTransactionIdTest
Tests run: 1, Failures: 0, Errors: 0, Skipped: 0, Time elapsed: 0.171 sec
Running org.apache.activemq.openwire.v8.ExceptionResponseTest
Tests run: 1, Failures: 0, Errors: 0, Skipped: 0, Time elapsed: 0.171 sec
Running org.apache.activemq.openwire.v7.TransactionInfoTest
Tests run: 1, Failures: 0, Errors: 0, Skipped: 0, Time elapsed: 0.178 sec
Running org.apache.activemq.store.jdbc.JDBCStoreBrokerTest
[JENKINS] Recording test results
Tests run: 129, Failures: 0, Errors: 0, Skipped: 0, Time elapsed: 357.187 sec
Running org.apache.activemq.openwire.v8.ProducerAckTest
Tests run: 1, Failures: 0, Errors: 0, Skipped: 0, Time elapsed: 0.175 sec
Running org.apache.activemq.kaha.impl.async.JournalImplTest
Tests run: 4, Failures: 0, Errors: 0, Skipped: 0, Time elapsed: 0.4 sec
Running org.apache.activemq.openwire.v7.FlushCommandTest
Tests run: 1, Failures: 0, Errors: 0, Skipped: 0, Time elapsed: 0.168 sec
Running org.apache.activemq.openwire.v2.ActiveMQMapMessageTest
Tests run: 1, Failures: 0, Errors: 0, Skipped: 0, Time elapsed: 0.212 sec
Running org.apache.activemq.usecases.DurableSubProcessWithRestartTest
Tests run: 1, Failures: 0, Errors: 0, Skipped: 1, Time elapsed: 0.107 sec
Running org.apache.activemq.openwire.v8.ProducerInfoTest
Tests run: 1, Failures: 0, Errors: 0, Skipped: 0, Time elapsed: 0.18 sec
Running org.apache.activemq.store.kahadb.KahaDBVersionTest
Tests run: 2, Failures: 0, Errors: 0, Skipped: 0, Time elapsed: 172.808 sec
Running org.apache.activemq.test.message.NestedMapMessageTest
Tests run: 1, Failures: 0, Errors: 0, Skipped: 0, Time elapsed: 3.44 sec
Running org.apache.activemq.ExpiryHogTest
Tests run: 1, Failures: 0, Errors: 0, Skipped: 0, Time elapsed: 41.94 sec
Running org.apache.activemq.ActiveMQConnectionFactoryTest
Tests run: 12, Failures: 0, Errors: 0, Skipped: 0, Time elapsed: 8.825 sec
Running org.apache.activemq.openwire.v6.DestinationInfoTest
Tests run: 1, Failures: 0, Errors: 0, Skipped: 0, Time elapsed: 0.177 sec
Running org.apache.activemq.xbean.XBeanConfigTest
Tests run: 1, Failures: 0, Errors: 0, Skipped: 0, Time elapsed: 1.157 sec
Running org.apache.activemq.QueueConsumerPriorityTest
Tests run: 1, Failures: 0, Errors: 0, Skipped: 0, Time elapsed: 5.663 sec
Running org.apache.activemq.openwire.v1.TransactionInfoTest
Tests run: 1, Failures: 0, Errors: 0, Skipped: 0, Time elapsed: 0.177 sec

Results :

Failed tests: 

Tests in error: 

Tests run: 3448, Failures: 4, Errors: 1, Skipped: 2

[ERROR] There are test failures.

Please refer to <https://builds.apache.org/hudson/job/ActiveMQ/ws/activemq-core/target/surefire-reports>
for the individual test results.
[locks-and-latches] Releasing all the locks
[locks-and-latches] All the locks released
ERROR: Processing failed due to a bug in the code. Please report this to jenkinsci-users@googlegroups.com
hudson.remoting.RequestAbortedException: hudson.remoting.RequestAbortedException: java.io.OptionalDataException
	at hudson.remoting.Request.call(Request.java:137)
	at hudson.remoting.Channel.call(Channel.java:643)
	at hudson.maven.ProcessCache$MavenProcess.call(ProcessCache.java:156)
	at hudson.maven.MavenModuleSetBuild$RunnerImpl.doRun(MavenModuleSetBuild.java:736)
	at hudson.model.AbstractBuild$AbstractRunner.run(AbstractBuild.java:429)
	at hudson.model.Run.run(Run.java:1374)
	at hudson.maven.MavenModuleSetBuild.run(MavenModuleSetBuild.java:467)
	at hudson.model.ResourceController.execute(ResourceController.java:88)
	at hudson.model.Executor.run(Executor.java:145)
Caused by: hudson.remoting.RequestAbortedException: java.io.OptionalDataException
	at hudson.remoting.Request.abort(Request.java:257)
	at hudson.remoting.Channel.terminate(Channel.java:694)
	at hudson.slaves.Channels$1.terminate(Channels.java:77)
	at hudson.remoting.Channel$ReaderThread.run(Channel.java:1016)
Caused by: java.io.OptionalDataException
	at java.io.ObjectInputStream.readObject0(ObjectInputStream.java:1339)
	at java.io.ObjectInputStream.readObject(ObjectInputStream.java:350)
	at hudson.remoting.Channel$ReaderThread.run(Channel.java:992)
project=hudson.maven.MavenModuleSet@1f9db378[ActiveMQ]
project.getModules()=[hudson.maven.MavenModule@4fbdb8af[ActiveMQ/org.apache.activemq:activemq-all][ActiveMQ/org.apache.activemq:activemq-all][relativePath:activemq-all],
hudson.maven.MavenModule@39e43b71[ActiveMQ/org.apache.activemq:activemq-blueprint][ActiveMQ/org.apache.activemq:activemq-blueprint][relativePath:activemq-blueprint],
hudson.maven.MavenModule@1b9288c2[ActiveMQ/org.apache.activemq:activemq-book][ActiveMQ/org.apache.activemq:activemq-book][relativePath:activemq-book],
hudson.maven.MavenModule@56f064e1[ActiveMQ/org.apache.activemq:activemq-camel][ActiveMQ/org.apache.activemq:activemq-camel][relativePath:activemq-camel],
hudson.maven.MavenModule@4f2f8060[ActiveMQ/org.apache.activemq:activemq-console][ActiveMQ/org.apache.activemq:activemq-console][relativePath:activemq-console],
hudson.maven.MavenModule@5cf74477[ActiveMQ/org.apache.activemq:activemq-core][ActiveMQ/org.apache.activemq:activemq-core][relativePath:activemq-core],
hudson.maven.MavenModule@25a732a4[ActiveMQ/org.apache.activemq:activemq-fileserver][ActiveMQ/org.apache.activemq:activemq-fileserver][relativePath:activemq-fileserver],
hudson.maven.MavenModule@53b49076[ActiveMQ/org.apache.activemq:activemq-groups][ActiveMQ/org.apache.activemq:activemq-groups][relativePath:activemq-groups],
hudson.maven.MavenModule@6f9f0c0e[ActiveMQ/org.apache.activemq:activemq-jaas][ActiveMQ/org.apache.activemq:activemq-jaas][relativePath:activemq-jaas],
hudson.maven.MavenModule@62a7fa9a[ActiveMQ/org.apache.activemq:activemq-jmdns_1.0][ActiveMQ/org.apache.activemq:activemq-jmdns_1.0][relativePath:activemq-jmdns_1.0],
hudson.maven.MavenModule@7fa57cea[ActiveMQ/org.apache.activemq:activemq-jpa-store][ActiveMQ/org.apache.activemq:activemq-jpa-store][relativePath:activemq-jpa-store],
hudson.maven.MavenModule@494f0b41[ActiveMQ/org.apache.activemq:activemq-karaf][ActiveMQ/org.apache.activemq:activemq-karaf][relativePath:activemq-karaf],
hudson.maven.MavenModule@2b0dfb46[ActiveMQ/org.apache.activemq:activemq-openwire-generator][ActiveMQ/org.apache.activemq:activemq-openwire-generator][relativePath:activemq-openwire-generator],
hudson.maven.MavenModule@453521ec[ActiveMQ/org.apache.activemq:activemq-optional][ActiveMQ/org.apache.activemq:activemq-optional][relativePath:activemq-optional],
hudson.maven.MavenModule@8c83f72[ActiveMQ/org.apache.activemq:activemq-parent][ActiveMQ/org.apache.activemq:activemq-parent][relativePath:],
hudson.maven.MavenModule@110c7887[ActiveMQ/org.apache.activemq:activemq-pool][ActiveMQ/org.apache.activemq:activemq-pool][relativePath:activemq-pool],
hudson.maven.MavenModule@1ba42493[ActiveMQ/org.apache.activemq:activemq-ra][ActiveMQ/org.apache.activemq:activemq-ra][relativePath:activemq-ra],
hudson.maven.MavenModule@284820da[ActiveMQ/org.apache.activemq:activemq-rar][ActiveMQ/org.apache.activemq:activemq-rar][relativePath:activemq-rar],
hudson.maven.MavenModule@4f69362e[ActiveMQ/org.apache.activemq:activemq-run][ActiveMQ/org.apache.activemq:activemq-run][relativePath:activemq-run],
hudson.maven.MavenModule@2b8d9248[ActiveMQ/org.apache.activemq:activemq-spring][ActiveMQ/org.apache.activemq:activemq-spring][relativePath:activemq-spring],
hudson.maven.MavenModule@3e98ae8d[ActiveMQ/org.apache.activemq:activemq-test-atomikos][ActiveMQ/org.apache.activemq:activemq-test-atomikos][relativePath:activemq-test-atomikos],
hudson.maven.MavenModule@208c4895[ActiveMQ/org.apache.activemq:activemq-web][ActiveMQ/org.apache.activemq:activemq-web][relativePath:activemq-web],
hudson.maven.MavenModule@6aed299a[ActiveMQ/org.apache.activemq:activemq-web-console][ActiveMQ/org.apache.activemq:activemq-web-console][relativePath:activemq-web-console],
hudson.maven.MavenModule@4443baa7[ActiveMQ/org.apache.activemq:activemq-web-demo][ActiveMQ/org.apache.activemq:activemq-web-demo][relativePath:activemq-web-demo],
hudson.maven.MavenModule@2556af33[ActiveMQ/org.apache.activemq:activemq-xmpp][ActiveMQ/org.apache.activemq:activemq-xmpp][relativePath:activemq-xmpp],
hudson.maven.MavenModule@18c44924[ActiveMQ/org.apache.activemq:apache-activemq][ActiveMQ/org.apache.activemq:apache-activemq][relativePath:assembly],
hudson.maven.MavenModule@484b2882[ActiveMQ/org.apache.activemq:kahadb][ActiveMQ/org.apache.activemq:kahadb][relativePath:kahadb],
hudson.maven.MavenModule@559be2c8[ActiveMQ/org.apache.activemq.tooling:activemq-tooling][ActiveMQ/org.apache.activemq.tooling:activemq-tooling][relativePath:activemq-tooling],
hudson.maven.MavenModule@737612[ActiveMQ/org.apache.activemq.tooling:maven-activemq-memtest-plugin][ActiveMQ/org.apache.activemq.tooling:maven-activemq-memtest-plugin][relativePath:activemq-tooling/maven-activemq-memtest-plugin],
hudson.maven.MavenModule@35ea1ccf[ActiveMQ/org.apache.activemq.tooling:maven-activemq-perf-plugin][ActiveMQ/org.apache.activemq.tooling:maven-activemq-perf-plugin][relativePath:activemq-tooling/maven-activemq-perf-plugin],
hudson.maven.MavenModule@f6a4c4a[ActiveMQ/org.apache.activemq.tooling:maven-activemq-plugin][ActiveMQ/org.apache.activemq.tooling:maven-activemq-plugin][relativePath:activemq-tooling/maven-activemq-plugin]]
project.getRootModule()=hudson.maven.MavenModule@8c83f72[ActiveMQ/org.apache.activemq:activemq-parent][ActiveMQ/org.apache.activemq:activemq-parent][relativePath:]
FATAL: hudson.remoting.RequestAbortedException: java.io.OptionalDataException
hudson.remoting.RequestAbortedException: hudson.remoting.RequestAbortedException: java.io.OptionalDataException
	at hudson.remoting.Request.call(Request.java:137)
	at hudson.remoting.Channel.call(Channel.java:643)
	at hudson.maven.ProcessCache$MavenProcess.call(ProcessCache.java:156)
	at hudson.maven.MavenModuleSetBuild$RunnerImpl.doRun(MavenModuleSetBuild.java:736)
	at hudson.model.AbstractBuild$AbstractRunner.run(AbstractBuild.java:429)
	at hudson.model.Run.run(Run.java:1374)
	at hudson.maven.MavenModuleSetBuild.run(MavenModuleSetBuild.java:467)
	at hudson.model.ResourceController.execute(ResourceController.java:88)
	at hudson.model.Executor.run(Executor.java:145)
Caused by: hudson.remoting.RequestAbortedException: java.io.OptionalDataException
	at hudson.remoting.Request.abort(Request.java:257)
	at hudson.remoting.Channel.terminate(Channel.java:694)
	at hudson.slaves.Channels$1.terminate(Channels.java:77)
	at hudson.remoting.Channel$ReaderThread.run(Channel.java:1016)
Caused by: java.io.OptionalDataException
	at java.io.ObjectInputStream.readObject0(ObjectInputStream.java:1339)
	at java.io.ObjectInputStream.readObject(ObjectInputStream.java:350)
	at hudson.remoting.Channel$ReaderThread.run(Channel.java:992)


Mime
View raw message