activemq-dev mailing list archives

Site index · List index
Message view « Date » · « Thread »
Top « Date » · « Thread »
From Apache Hudson Server <hud...@hudson.apache.org>
Subject Build failed in Jenkins: ActiveMQ-Trunk-Deploy #250
Date Wed, 09 Mar 2011 03:13:27 GMT
See <https://hudson.apache.org/hudson/job/ActiveMQ-Trunk-Deploy/250/changes>

Changes:

[bsnyder] AMQ-2968 - Add Apache commons daemon (jsvc/procrun) start/stop support.

[dejanb] https://issues.apache.org/jira/browse/AMQ-2632 - dispose the old transport listener
before rebalancing

[gtully] https://issues.apache.org/jira/browse/AMQ-3205 - Update ActivationSpec, patch applied
with thanks

[dejanb] give FailoverClusterTest a bit more time to reconnect

------------------------------------------
[...truncated 7660 lines...]
[INFO] No sources to compile
[INFO] [surefire:test {execution: default-test}]
Downloading: http://repository.apache.org/snapshots/org/apache/maven/surefire/surefire-junit/2.5/surefire-junit-2.5.pom
[INFO] Unable to find resource 'org.apache.maven.surefire:surefire-junit:pom:2.5' in repository
apache.snapshots (https://repository.apache.org/content/repositories/snapshots/)
Downloading: http://repo1.maven.org/maven2/org/apache/maven/surefire/surefire-junit/2.5/surefire-junit-2.5.pom

Downloading: http://repository.apache.org/snapshots/junit/junit/3.8.1/junit-3.8.1.jar
Downloading: http://repository.apache.org/snapshots/org/apache/maven/surefire/surefire-junit/2.5/surefire-junit-2.5.jar
[INFO] Unable to find resource 'junit:junit:jar:3.8.1' in repository apache.snapshots (https://repository.apache.org/content/repositories/snapshots/)
Downloading: http://repo1.maven.org/maven2/junit/junit/3.8.1/junit-3.8.1.jar
[INFO] Unable to find resource 'org.apache.maven.surefire:surefire-junit:jar:2.5' in repository
apache.snapshots (https://repository.apache.org/content/repositories/snapshots/)
Downloading: http://repo1.maven.org/maven2/org/apache/maven/surefire/surefire-junit/2.5/surefire-junit-2.5.jar


[INFO] Surefire report directory: <https://hudson.apache.org/hudson/job/ActiveMQ-Trunk-Deploy/ws/trunk/activemq-blueprint/target/surefire-reports>

-------------------------------------------------------
 T E S T S
-------------------------------------------------------
There are no tests to run.

Results :

Tests run: 0, Failures: 0, Errors: 0, Skipped: 0

[JENKINS] Recording test results[INFO] [bundle:bundle {execution: default-bundle}]

[WARNING] Warning building bundle org.apache.activemq:activemq-blueprint:bundle:5.5-SNAPSHOT
: Instructions in Export-Package that are never used: org\.apache\.activemq.*.*
[WARNING] Warning building bundle org.apache.activemq:activemq-blueprint:bundle:5.5-SNAPSHOT
: Superfluous export-package instructions: [org.apache.activemq**]
[INFO] Preparing source:jar
[WARNING] Removing: jar from forked lifecycle, to prevent recursive invocation.
[JENKINS] Archiving <https://hudson.apache.org/hudson/job/ActiveMQ-Trunk-Deploy/ws/trunk/activemq-blueprint/pom.xml>
to /home/hudson/hudson/jobs/ActiveMQ-Trunk-Deploy/modules/org.apache.activemq$activemq-blueprint/builds/2011-03-09_03-08-55/archive/org.apache.activemq/activemq-blueprint/5.5-SNAPSHOT/pom.xml
[JENKINS] Archiving <https://hudson.apache.org/hudson/job/ActiveMQ-Trunk-Deploy/ws/trunk/activemq-blueprint/target/activemq-blueprint-5.5-SNAPSHOT.jar>
to /home/hudson/hudson/jobs/ActiveMQ-Trunk-Deploy/modules/org.apache.activemq$activemq-blueprint/builds/2011-03-09_03-08-55/archive/org.apache.activemq/activemq-blueprint/5.5-SNAPSHOT/activemq-blueprint-5.5-SNAPSHOT.jar
[INFO] [enforcer:enforce {execution: default}]
[INFO] [bundle:cleanVersions {execution: cleanVersions}]
[INFO] [source:jar {execution: attach-sources}]
[INFO] Building jar: <https://hudson.apache.org/hudson/job/ActiveMQ-Trunk-Deploy/ws/trunk/activemq-blueprint/target/activemq-blueprint-5.5-SNAPSHOT-sources.jar>
[INFO] [javadoc:jar {execution: attach-javadocs}]
[INFO] [ianal:verify-legal-files {execution: default}]
[INFO] Checking legal files in: activemq-blueprint-5.5-SNAPSHOT.jar
[INFO] Checking legal files in: activemq-blueprint-5.5-SNAPSHOT-sources.jar
[INFO] [install:install {execution: default-install}]
[INFO] Installing <https://hudson.apache.org/hudson/job/ActiveMQ-Trunk-Deploy/ws/trunk/activemq-blueprint/target/activemq-blueprint-5.5-SNAPSHOT.jar>
to <https://hudson.apache.org/hudson/job/ActiveMQ-Trunk-Deploy/ws/.repository/org/apache/activemq/activemq-blueprint/5.5-SNAPSHOT/activemq-blueprint-5.5-SNAPSHOT.jar>
[INFO] Installing <https://hudson.apache.org/hudson/job/ActiveMQ-Trunk-Deploy/ws/trunk/activemq-blueprint/target/activemq-blueprint-5.5-SNAPSHOT-sources.jar>
to <https://hudson.apache.org/hudson/job/ActiveMQ-Trunk-Deploy/ws/.repository/org/apache/activemq/activemq-blueprint/5.5-SNAPSHOT/activemq-blueprint-5.5-SNAPSHOT-sources.jar>
[INFO] [bundle:install {execution: default-install}]
[INFO] Installing org/apache/activemq/activemq-blueprint/5.5-SNAPSHOT/activemq-blueprint-5.5-SNAPSHOT.jar
[INFO] Writing OBR metadata
[INFO] [deploy:deploy {execution: default-deploy}]
[INFO] Retrieving previous build number from apache.snapshots.https
Uploading: https://repository.apache.org/content/repositories/snapshots/org/apache/activemq/activemq-blueprint/5.5-SNAPSHOT/activemq-blueprint-5.5-SNAPSHOT.jar
8K uploaded  (activemq-blueprint-5.5-SNAPSHOT.jar)
[INFO] Retrieving previous metadata from apache.snapshots.https
[INFO] Uploading repository metadata for: 'snapshot org.apache.activemq:activemq-blueprint:5.5-SNAPSHOT'
[INFO] Retrieving previous metadata from apache.snapshots.https
[INFO] Uploading repository metadata for: 'artifact org.apache.activemq:activemq-blueprint'
[INFO] Uploading project information for activemq-blueprint 5.5-SNAPSHOT
[INFO] Retrieving previous build number from apache.snapshots.https
Uploading: https://repository.apache.org/content/repositories/snapshots/org/apache/activemq/activemq-blueprint/5.5-SNAPSHOT/activemq-blueprint-5.5-SNAPSHOT-sources.jar
6K uploaded  (activemq-blueprint-5.5-SNAPSHOT-sources.jar)
[INFO] [bundle:deploy {execution: default-deploy}]
[INFO] Remote OBR update disabled (enable with -DremoteOBR)
[JENKINS] Archiving <https://hudson.apache.org/hudson/job/ActiveMQ-Trunk-Deploy/ws/trunk/activemq-blueprint/target/activemq-blueprint-5.5-SNAPSHOT-sources.jar>
to /home/hudson/hudson/jobs/ActiveMQ-Trunk-Deploy/modules/org.apache.activemq$activemq-blueprint/builds/2011-03-09_03-08-55/archive/org.apache.activemq/activemq-blueprint/5.5-SNAPSHOT/activemq-blueprint-5.5-SNAPSHOT-sources.jar
[INFO] ------------------------------------------------------------------------
[INFO] SKIPPING ActiveMQ :: Apache Karaf
[INFO]    task-segment: [clean, deploy]
[INFO] This project has been banned from further executions due to previous failures.
[INFO] ------------------------------------------------------------------------
[INFO] ------------------------------------------------------------------------
[INFO] SKIPPING ActiveMQ :: RAR
[INFO]    task-segment: [clean, deploy]
[INFO] This project has been banned from further executions due to previous failures.
[INFO] ------------------------------------------------------------------------
[INFO] ------------------------------------------------------------------------
[INFO] SKIPPING ActiveMQ :: Run Jar
[INFO]    task-segment: [clean, deploy]
[INFO] This project has been banned from further executions due to previous failures.
[INFO] ------------------------------------------------------------------------
[INFO] ------------------------------------------------------------------------
[INFO] SKIPPING ActiveMQ :: Spring
[INFO]    task-segment: [clean, deploy]
[INFO] This project has been banned from further executions due to previous failures.
[INFO] ------------------------------------------------------------------------
[INFO] ------------------------------------------------------------------------
[INFO] Building ActiveMQ Tooling
[INFO]    task-segment: [clean, deploy]
[INFO] ------------------------------------------------------------------------
[INFO] [clean:clean {execution: default-clean}]
[INFO] [enforcer:enforce {execution: default}]
[INFO] [bundle:cleanVersions {execution: cleanVersions}]
[INFO] [remote-resources:process {execution: default}]
[INFO] [site:attach-descriptor {execution: default-attach-descriptor}]
[INFO] Preparing source:jar
[WARNING] Removing: jar from forked lifecycle, to prevent recursive invocation.
[JENKINS] Archiving <https://hudson.apache.org/hudson/job/ActiveMQ-Trunk-Deploy/ws/trunk/activemq-tooling/pom.xml>
to /home/hudson/hudson/jobs/ActiveMQ-Trunk-Deploy/modules/org.apache.activemq.tooling$activemq-tooling/builds/2011-03-09_03-08-55/archive/org.apache.activemq.tooling/activemq-tooling/5.5-SNAPSHOT/pom.xml
[INFO] [enforcer:enforce {execution: default}]
[INFO] [bundle:cleanVersions {execution: cleanVersions}]
[INFO] [source:jar {execution: attach-sources}]
[INFO] [javadoc:jar {execution: attach-javadocs}]
[INFO] Not executing Javadoc as the project is not a Java classpath-capable package
[INFO] [ianal:verify-legal-files {execution: default}]
[INFO] [install:install {execution: default-install}]
[INFO] Installing <https://hudson.apache.org/hudson/job/ActiveMQ-Trunk-Deploy/ws/trunk/activemq-tooling/pom.xml>
to <https://hudson.apache.org/hudson/job/ActiveMQ-Trunk-Deploy/ws/.repository/org/apache/activemq/tooling/activemq-tooling/5.5-SNAPSHOT/activemq-tooling-5.5-SNAPSHOT.pom>
[INFO] [deploy:deploy {execution: default-deploy}]
[INFO] Retrieving previous build number from apache.snapshots.https
Uploading: https://repository.apache.org/content/repositories/snapshots/org/apache/activemq/tooling/activemq-tooling/5.5-SNAPSHOT/activemq-tooling-5.5-SNAPSHOT.pom
1K uploaded  (activemq-tooling-5.5-SNAPSHOT.pom)
[INFO] Retrieving previous metadata from apache.snapshots.https
[INFO] Uploading repository metadata for: 'snapshot org.apache.activemq.tooling:activemq-tooling:5.5-SNAPSHOT'
[INFO] Retrieving previous metadata from apache.snapshots.https
[INFO] Uploading repository metadata for: 'artifact org.apache.activemq.tooling:activemq-tooling'
[JENKINS] Archiving <https://hudson.apache.org/hudson/job/ActiveMQ-Trunk-Deploy/ws/.repository/org/apache/activemq/tooling/activemq-tooling/5.5-SNAPSHOT/activemq-tooling-5.5-SNAPSHOT.pom>
to /home/hudson/hudson/jobs/ActiveMQ-Trunk-Deploy/modules/org.apache.activemq.tooling$activemq-tooling/builds/2011-03-09_03-08-55/archive/org.apache.activemq.tooling/activemq-tooling/5.5-SNAPSHOT/activemq-tooling-5.5-SNAPSHOT.pom
[INFO] ------------------------------------------------------------------------
[INFO] SKIPPING ActiveMQ :: Memory Usage Test Plugin
[INFO]    task-segment: [clean, deploy]
[INFO] This project has been banned from further executions due to previous failures.
[INFO] ------------------------------------------------------------------------
[INFO] ------------------------------------------------------------------------
[INFO] SKIPPING ActiveMQ :: Performance Test Plugin
[INFO]    task-segment: [clean, deploy]
[INFO] This project has been banned from further executions due to previous failures.
[INFO] ------------------------------------------------------------------------
[INFO] ------------------------------------------------------------------------
[INFO] SKIPPING ActiveMQ :: StartUp Plugin
[INFO]    task-segment: [clean, deploy]
[INFO] This project has been banned from further executions due to previous failures.
[INFO] ------------------------------------------------------------------------
[INFO] ------------------------------------------------------------------------
[INFO] SKIPPING ActiveMQ :: Web
[INFO]    task-segment: [clean, deploy]
[INFO] This project has been banned from further executions due to previous failures.
[INFO] ------------------------------------------------------------------------
[INFO] ------------------------------------------------------------------------
[INFO] SKIPPING ActiveMQ :: Web Demo
[INFO]    task-segment: [clean, deploy]
[INFO] This project has been banned from further executions due to previous failures.
[INFO] ------------------------------------------------------------------------
[INFO] ------------------------------------------------------------------------
[INFO] SKIPPING ActiveMQ :: XMPP
[INFO]    task-segment: [clean, deploy]
[INFO] This project has been banned from further executions due to previous failures.
[INFO] ------------------------------------------------------------------------
[INFO] ------------------------------------------------------------------------
[INFO] SKIPPING ActiveMQ :: Web Console
[INFO]    task-segment: [clean, deploy]
[INFO] This project has been banned from further executions due to previous failures.
[INFO] ------------------------------------------------------------------------
[INFO] ------------------------------------------------------------------------
[INFO] SKIPPING ActiveMQ :: Assembly
[INFO]    task-segment: [clean, deploy]
[INFO] This project has been banned from further executions due to previous failures.
[INFO] ------------------------------------------------------------------------
[INFO] 
[INFO] 
[INFO] ------------------------------------------------------------------------
[INFO] Reactor Summary:
[INFO] ------------------------------------------------------------------------
[INFO] ActiveMQ .............................................. SUCCESS [1:36.745s]
[INFO] ActiveMQ :: KahaDB .................................... FAILED [29.276s]
[INFO] ActiveMQ :: JAAS ...................................... SUCCESS [37.490s]
[INFO] Openwire Generator .................................... SUCCESS [28.552s]
[INFO] ActiveMQ :: jmdns 1.0 ................................. SUCCESS [9.223s]
[INFO] ActiveMQ :: Core ...................................... SKIPPED (dependency build failed
or was skipped)
[INFO] ActiveMQ :: RA ........................................ SKIPPED (dependency build failed
or was skipped)
[INFO] ActiveMQ :: Pool ...................................... SKIPPED (dependency build failed
or was skipped)
[INFO] ActiveMQ :: Camel ..................................... SKIPPED (dependency build failed
or was skipped)
[INFO] ActiveMQ :: Console ................................... SKIPPED (dependency build failed
or was skipped)
[INFO] ActiveMQ :: Optional .................................. SKIPPED (dependency build failed
or was skipped)
[INFO] ActiveMQ :: Jar Bundle ................................ SKIPPED (dependency build failed
or was skipped)
[INFO] ActiveMQ :: File Server ............................... SKIPPED (dependency build failed
or was skipped)
[INFO] ActiveMQ :: Blueprint ................................. SUCCESS [12.798s]
[INFO] ActiveMQ :: Apache Karaf .............................. SKIPPED (dependency build failed
or was skipped)
[INFO] ActiveMQ :: RAR ....................................... SKIPPED (dependency build failed
or was skipped)
[INFO] ActiveMQ :: Run Jar ................................... SKIPPED (dependency build failed
or was skipped)
[INFO] ActiveMQ :: Spring .................................... SKIPPED (dependency build failed
or was skipped)
[INFO] ActiveMQ Tooling ...................................... SUCCESS [2.450s]
[INFO] ActiveMQ :: Memory Usage Test Plugin .................. SKIPPED (dependency build failed
or was skipped)
[INFO] ActiveMQ :: Performance Test Plugin ................... SKIPPED (dependency build failed
or was skipped)
[INFO] ActiveMQ :: StartUp Plugin ............................ SKIPPED (dependency build failed
or was skipped)
[INFO] ActiveMQ :: Web ....................................... SKIPPED (dependency build failed
or was skipped)
[INFO] ActiveMQ :: Web Demo .................................. SKIPPED (dependency build failed
or was skipped)
[INFO] ActiveMQ :: XMPP ...................................... SKIPPED (dependency build failed
or was skipped)
[INFO] ActiveMQ :: Web Console ............................... SKIPPED (dependency build failed
or was skipped)
[INFO] ActiveMQ :: Assembly .................................. SKIPPED (dependency build failed
or was skipped)
[INFO] ------------------------------------------------------------------------
[INFO] Error for project: ActiveMQ :: KahaDB (during deploy)
[INFO] ------------------------------------------------------------------------
[INFO] Error deploying artifact: Failed to transfer file: https://repository.apache.org/content/repositories/snapshots/org/apache/activemq/kahadb/5.5-SNAPSHOT/kahadb-5.5-SNAPSHOT-javadoc.jar.
Return code is: 500

[INFO] ------------------------------------------------------------------------
[INFO] Trace
org.apache.maven.lifecycle.LifecycleExecutionException: Error deploying artifact: Failed to
transfer file: https://repository.apache.org/content/repositories/snapshots/org/apache/activemq/kahadb/5.5-SNAPSHOT/kahadb-5.5-SNAPSHOT-javadoc.jar.
Return code is: 500
	at org.apache.maven.lifecycle.DefaultLifecycleExecutor.executeGoals(DefaultLifecycleExecutor.java:719)
	at org.apache.maven.lifecycle.DefaultLifecycleExecutor.executeGoalWithLifecycle(DefaultLifecycleExecutor.java:556)
	at org.apache.maven.lifecycle.DefaultLifecycleExecutor.executeGoal(DefaultLifecycleExecutor.java:535)
	at org.apache.maven.lifecycle.DefaultLifecycleExecutor.executeGoalAndHandleFailures(DefaultLifecycleExecutor.java:387)
	at org.apache.maven.lifecycle.DefaultLifecycleExecutor.executeTaskSegments(DefaultLifecycleExecutor.java:348)
	at org.apache.maven.lifecycle.DefaultLifecycleExecutor.execute(DefaultLifecycleExecutor.java:180)
	at org.apache.maven.lifecycle.LifecycleExecutorInterceptor.execute(LifecycleExecutorInterceptor.java:65)
	at org.apache.maven.DefaultMaven.doExecute(DefaultMaven.java:328)
	at org.apache.maven.DefaultMaven.execute(DefaultMaven.java:138)
	at org.apache.maven.cli.MavenCli.main(MavenCli.java:362)
	at sun.reflect.NativeMethodAccessorImpl.invoke0(Native Method)
	at sun.reflect.NativeMethodAccessorImpl.invoke(NativeMethodAccessorImpl.java:39)
	at sun.reflect.DelegatingMethodAccessorImpl.invoke(DelegatingMethodAccessorImpl.java:25)
	at java.lang.reflect.Method.invoke(Method.java:597)
	at org.codehaus.classworlds.Launcher.launchEnhanced(Launcher.java:315)
	at org.codehaus.classworlds.Launcher.launch(Launcher.java:255)
	at hudson.maven.agent.Main.launch(Main.java:173)
	at hudson.maven.MavenBuilder.call(MavenBuilder.java:164)
	at hudson.maven.MavenModuleSetBuild$Builder.call(MavenModuleSetBuild.java:872)
	at hudson.maven.MavenModuleSetBuild$Builder.call(MavenModuleSetBuild.java:803)
	at hudson.remoting.UserRequest.perform(UserRequest.java:114)
	at hudson.remoting.UserRequest.perform(UserRequest.java:48)
	at hudson.remoting.Request$2.run(Request.java:270)
	at java.util.concurrent.Executors$RunnableAdapter.call(Executors.java:441)
	at java.util.concurrent.FutureTask$Sync.innerRun(FutureTask.java:303)
	at java.util.concurrent.FutureTask.run(FutureTask.java:138)
	at java.util.concurrent.ThreadPoolExecutor$Worker.runTask(ThreadPoolExecutor.java:886)
	at java.util.concurrent.ThreadPoolExecutor$Worker.run(ThreadPoolExecutor.java:908)
	at java.lang.Thread.run(Thread.java:619)
Caused by: org.apache.maven.plugin.MojoExecutionException: Error deploying artifact: Failed
to transfer file: https://repository.apache.org/content/repositories/snapshots/org/apache/activemq/kahadb/5.5-SNAPSHOT/kahadb-5.5-SNAPSHOT-javadoc.jar.
Return code is: 500
	at org.apache.maven.plugin.deploy.DeployMojo.execute(DeployMojo.java:189)
	at org.apache.maven.plugin.DefaultPluginManager.executeMojo(DefaultPluginManager.java:490)
	at hudson.maven.agent.PluginManagerInterceptor.executeMojo(PluginManagerInterceptor.java:182)
	at org.apache.maven.lifecycle.DefaultLifecycleExecutor.executeGoals(DefaultLifecycleExecutor.java:694)
	... 28 more
Caused by: org.apache.maven.artifact.deployer.ArtifactDeploymentException: Error deploying
artifact: Failed to transfer file: https://repository.apache.org/content/repositories/snapshots/org/apache/activemq/kahadb/5.5-SNAPSHOT/kahadb-5.5-SNAPSHOT-javadoc.jar.
Return code is: 500
	at org.apache.maven.artifact.deployer.DefaultArtifactDeployer.deploy(DefaultArtifactDeployer.java:121)
	at org.apache.maven.plugin.deploy.DeployMojo.execute(DeployMojo.java:184)
	... 31 more
Caused by: org.apache.maven.wagon.TransferFailedException: Failed to transfer file: https://repository.apache.org/content/repositories/snapshots/org/apache/activemq/kahadb/5.5-SNAPSHOT/kahadb-5.5-SNAPSHOT-javadoc.jar.
Return code is: 500
	at org.apache.maven.wagon.providers.http.LightweightHttpWagon.finishPutTransfer(LightweightHttpWagon.java:205)
	at org.apache.maven.wagon.AbstractWagon.putTransfer(AbstractWagon.java:413)
	at org.apache.maven.wagon.AbstractWagon.transfer(AbstractWagon.java:392)
	at org.apache.maven.wagon.AbstractWagon.putTransfer(AbstractWagon.java:365)
	at org.apache.maven.wagon.StreamWagon.put(StreamWagon.java:163)
	at org.apache.maven.artifact.manager.DefaultWagonManager.putRemoteFile(DefaultWagonManager.java:317)
	at org.apache.maven.artifact.manager.DefaultWagonManager.putArtifact(DefaultWagonManager.java:227)
	at org.apache.maven.artifact.deployer.DefaultArtifactDeployer.deploy(DefaultArtifactDeployer.java:107)
	... 32 more
[INFO] ------------------------------------------------------------------------
[INFO] BUILD ERRORS
[INFO] ------------------------------------------------------------------------
[INFO] Total time: 4 minutes 7 seconds
[INFO] Finished at: Wed Mar 09 03:13:25 UTC 2011
[INFO] Final Memory: 80M/1177M
[INFO] ------------------------------------------------------------------------
Sending e-mails to: dev@activemq.apache.org
channel stopped


Mime
View raw message