activemq-dev mailing list archives

Site index · List index
Message view « Date » · « Thread »
Top « Date » · « Thread »
From Apache Hudson Server <hud...@hudson.apache.org>
Subject Build failed in Hudson: ActiveMQ-Trunk-Deploy #225
Date Tue, 01 Feb 2011 03:50:41 GMT
See <https://hudson.apache.org/hudson/job/ActiveMQ-Trunk-Deploy/225/changes>

Changes:

[gtully] resolve regression in JDBCXACommitExceptionTest from https://issues.apache.org/activemq/browse/AMQ-2880
Change http://svn.apache.org/viewvc?rev=1064858&view=rev demostrated need to separate
jms transacted
session recovery from xa recovery.
Issue related to using XASession without transactions. https://issues.apache.org/jira/browse/AMQ-2659
fix makes XASession indicated it is transacted during commit processing so that a close does
not precipiate
an auto ack. ended transactions, available till forget will keep transacted=true

[gtully] it can take more than 30 seconds for network of 20 to get in line on a slower box,
so incease the default delay

------------------------------------------
[...truncated 14974 lines...]
	at org.apache.maven.plugin.DefaultBuildPluginManager.executeMojo(DefaultBuildPluginManager.java:107)
	at org.apache.maven.lifecycle.internal.MojoExecutor.execute(MojoExecutor.java:209)
	at org.apache.maven.lifecycle.internal.MojoExecutor.execute(MojoExecutor.java:153)
	at org.apache.maven.lifecycle.internal.MojoExecutor.execute(MojoExecutor.java:145)
	at org.apache.maven.lifecycle.internal.LifecycleModuleBuilder.buildProject(LifecycleModuleBuilder.java:84)
	at org.apache.maven.lifecycle.internal.LifecycleModuleBuilder.buildProject(LifecycleModuleBuilder.java:59)
	at org.apache.maven.lifecycle.internal.LifecycleStarter.singleThreadedBuild(LifecycleStarter.java:183)
	at org.apache.maven.lifecycle.internal.LifecycleStarter.execute(LifecycleStarter.java:161)
	at org.apache.maven.DefaultMaven.doExecute(DefaultMaven.java:319)
	at org.apache.maven.DefaultMaven.execute(DefaultMaven.java:156)
	at org.jvnet.hudson.maven3.launcher.Maven3Launcher.main(Maven3Launcher.java:79)
	at sun.reflect.NativeMethodAccessorImpl.invoke0(Native Method)
	at sun.reflect.NativeMethodAccessorImpl.invoke(NativeMethodAccessorImpl.java:39)
	at sun.reflect.DelegatingMethodAccessorImpl.invoke(DelegatingMethodAccessorImpl.java:25)
	at java.lang.reflect.Method.invoke(Method.java:597)
	at org.codehaus.plexus.classworlds.launcher.Launcher.launchStandard(Launcher.java:329)
	at org.codehaus.plexus.classworlds.launcher.Launcher.launch(Launcher.java:239)
	at org.jvnet.hudson.maven3.agent.Maven3Main.launch(Maven3Main.java:145)
	at hudson.maven.Maven3Builder.call(Maven3Builder.java:124)
	at hudson.maven.Maven3Builder.call(Maven3Builder.java:71)
	at hudson.remoting.UserRequest.perform(UserRequest.java:114)
	at hudson.remoting.UserRequest.perform(UserRequest.java:48)
	at hudson.remoting.Request$2.run(Request.java:270)
	at java.util.concurrent.Executors$RunnableAdapter.call(Executors.java:441)
	at java.util.concurrent.FutureTask$Sync.innerRun(FutureTask.java:303)
	at java.util.concurrent.FutureTask.run(FutureTask.java:138)
	at java.util.concurrent.ThreadPoolExecutor$Worker.runTask(ThreadPoolExecutor.java:886)
	at java.util.concurrent.ThreadPoolExecutor$Worker.run(ThreadPoolExecutor.java:908)
	at java.lang.Thread.run(Thread.java:619)
mojoFailed org.jvnet.jaxb2.maven2:maven-jaxb2-plugin:0.7.2(default)
projectFailed org.apache.activemq:activemq-xmpp:5.5-SNAPSHOT
[HUDSON] Archiving <https://hudson.apache.org/hudson/job/ActiveMQ-Trunk-Deploy/ws/trunk/activemq-xmpp/pom.xml>
to /home/hudson/hudson/jobs/ActiveMQ-Trunk-Deploy/modules/org.apache.activemq$activemq-xmpp/builds/2011-02-01_03-20-55/archive/org.apache.activemq/activemq-xmpp/5.5-SNAPSHOT/pom.xml
projectSkipped org.apache.activemq:activemq-web-console:5.5-SNAPSHOT
[INFO]                                                                         
[INFO] ------------------------------------------------------------------------
[INFO] Skipping ActiveMQ :: Web Console
[INFO] This project has been banned from the build due to previous failures.
[INFO] ------------------------------------------------------------------------
projectSkipped org.apache.activemq:apache-activemq:5.5-SNAPSHOT
[INFO]                                                                         
[INFO] ------------------------------------------------------------------------
[INFO] Skipping ActiveMQ :: Assembly
[INFO] This project has been banned from the build due to previous failures.
[INFO] ------------------------------------------------------------------------
sessionEnded
[INFO] ------------------------------------------------------------------------
[INFO] Reactor Summary:
[INFO] 
[INFO] ActiveMQ .......................................... SUCCESS [4:22.377s]
[INFO] ActiveMQ :: KahaDB ................................ SUCCESS [46.956s]
[INFO] ActiveMQ :: JAAS .................................. SUCCESS [1:22.517s]
[INFO] Openwire Generator ................................ SUCCESS [25.819s]
[INFO] ActiveMQ :: jmdns 1.0 ............................. SUCCESS [9.778s]
[INFO] ActiveMQ :: Core .................................. SUCCESS [4:11.427s]
[INFO] ActiveMQ :: RA .................................... SUCCESS [25.357s]
[INFO] ActiveMQ :: Pool .................................. SUCCESS [23.620s]
[INFO] ActiveMQ :: Camel ................................. SUCCESS [36.501s]
[INFO] ActiveMQ :: Console ............................... SUCCESS [18.450s]
[INFO] ActiveMQ :: Optional .............................. SUCCESS [1:19.580s]
[INFO] ActiveMQ :: Jar Bundle ............................ SUCCESS [21.110s]
[INFO] ActiveMQ :: File Server ........................... SUCCESS [43.786s]
[INFO] ActiveMQ :: Blueprint ............................. SUCCESS [27.988s]
[INFO] ActiveMQ :: Apache Karaf .......................... SUCCESS [22.562s]
[INFO] ActiveMQ :: RAR ................................... SUCCESS [1:31.012s]
[INFO] ActiveMQ :: Run Jar ............................... SUCCESS [8.597s]
[INFO] ActiveMQ :: Spring ................................ SUCCESS [22.056s]
[INFO] ActiveMQ Tooling .................................. SUCCESS [3.940s]
[INFO] ActiveMQ :: Memory Usage Test Plugin .............. SUCCESS [1:03.002s]
[INFO] ActiveMQ :: Performance Test Plugin ............... SUCCESS [14.021s]
[INFO] ActiveMQ :: StartUp Plugin ........................ SUCCESS [18.975s]
[INFO] ActiveMQ :: Web ................................... SUCCESS [20.245s]
[INFO] ActiveMQ :: Web Demo .............................. SUCCESS [1:57.194s]
[INFO] ActiveMQ :: XMPP .................................. FAILURE [28.906s]
[INFO] ActiveMQ :: Web Console ........................... SKIPPED
[INFO] ActiveMQ :: Assembly .............................. SKIPPED
[INFO] ------------------------------------------------------------------------
[INFO] BUILD FAILURE
[INFO] ------------------------------------------------------------------------
[INFO] Total time: 29:34.101s
[INFO] Finished at: Tue Feb 01 03:50:54 UTC 2011
[INFO] Final Memory: 85M/1775M
[INFO] ------------------------------------------------------------------------
mavenExecutionResult exceptions not empty
org.apache.maven.lifecycle.LifecycleExecutionException: Failed to execute goal org.jvnet.jaxb2.maven2:maven-jaxb2-plugin:0.7.2:generate
(default) on project activemq-xmpp: Execution default of goal org.jvnet.jaxb2.maven2:maven-jaxb2-plugin:0.7.2:generate
failed: A required class was missing while executing org.jvnet.jaxb2.maven2:maven-jaxb2-plugin:0.7.2:generate:
Could not initialize class com.sun.org.apache.xerces.internal.impl.xs.traversers.XSAttributeChecker
-----------------------------------------------------
realm =    plugin>org.jvnet.jaxb2.maven2:maven-jaxb2-plugin:0.7.2
strategy = org.codehaus.plexus.classworlds.strategy.SelfFirstStrategy
urls[0] = <https://hudson.apache.org/hudson/job/ActiveMQ-Trunk-Deploy/ws/.repository/org/jvnet/jaxb2/maven2/maven-jaxb2-plugin/0.7.2/maven-jaxb2-plugin-0.7.2.jar>
urls[1] = <https://hudson.apache.org/hudson/job/ActiveMQ-Trunk-Deploy/ws/.repository/org/jvnet/jaxb2/maven2/maven-jaxb2-plugin-raw/0.7.2/maven-jaxb2-plugin-raw-0.7.2.jar>
urls[2] = <https://hudson.apache.org/hudson/job/ActiveMQ-Trunk-Deploy/ws/.repository/org/codehaus/plexus/plexus-utils/1.1/plexus-utils-1.1.jar>
urls[3] = <https://hudson.apache.org/hudson/job/ActiveMQ-Trunk-Deploy/ws/.repository/junit/junit/3.8.1/junit-3.8.1.jar>
urls[4] = <https://hudson.apache.org/hudson/job/ActiveMQ-Trunk-Deploy/ws/.repository/org/jfrog/maven/annomojo/maven-plugin-anno/1.3.1/maven-plugin-anno-1.3.1.jar>
urls[5] = <https://hudson.apache.org/hudson/job/ActiveMQ-Trunk-Deploy/ws/.repository/com/sun/xml/bind/jaxb-impl/2.1.12/jaxb-impl-2.1.12.jar>
urls[6] = <https://hudson.apache.org/hudson/job/ActiveMQ-Trunk-Deploy/ws/.repository/javax/xml/bind/jaxb-api/2.1/jaxb-api-2.1.jar>
urls[7] = <https://hudson.apache.org/hudson/job/ActiveMQ-Trunk-Deploy/ws/.repository/javax/xml/stream/stax-api/1.0-2/stax-api-1.0-2.jar>
urls[8] = <https://hudson.apache.org/hudson/job/ActiveMQ-Trunk-Deploy/ws/.repository/javax/activation/activation/1.1/activation-1.1.jar>
urls[9] = <https://hudson.apache.org/hudson/job/ActiveMQ-Trunk-Deploy/ws/.repository/org/jvnet/jaxb2_commons/jaxb2-basics-jaxb-xjc/2.1.12/jaxb2-basics-jaxb-xjc-2.1.12.jar>
urls[10] = <https://hudson.apache.org/hudson/job/ActiveMQ-Trunk-Deploy/ws/.repository/com/sun/codemodel/codemodel/2.2/codemodel-2.2.jar>
urls[11] = <https://hudson.apache.org/hudson/job/ActiveMQ-Trunk-Deploy/ws/.repository/com/sun/xml/dtd-parser/dtd-parser/1.0/dtd-parser-1.0.jar>
urls[12] = <https://hudson.apache.org/hudson/job/ActiveMQ-Trunk-Deploy/ws/.repository/com/sun/istack/istack-commons-tools/1.1/istack-commons-tools-1.1.jar>
urls[13] = <https://hudson.apache.org/hudson/job/ActiveMQ-Trunk-Deploy/ws/.repository/relaxngDatatype/relaxngDatatype/20020414/relaxngDatatype-20020414.jar>
urls[14] = <https://hudson.apache.org/hudson/job/ActiveMQ-Trunk-Deploy/ws/.repository/com/sun/org/apache/xml/internal/resolver/20050927/resolver-20050927.jar>
urls[15] = <https://hudson.apache.org/hudson/job/ActiveMQ-Trunk-Deploy/ws/.repository/org/kohsuke/rngom/rngom/20061207/rngom-20061207.jar>
urls[16] = <https://hudson.apache.org/hudson/job/ActiveMQ-Trunk-Deploy/ws/.repository/com/sun/xsom/xsom/20081112/xsom-20081112.jar>
Number of foreign imports: 1
import: Entry[import  from realm ClassRealm[project>org.apache.activemq:activemq-parent:5.5-SNAPSHOT,
parent: ClassRealm[maven.api, parent: null]]]

-----------------------------------------------------

	at org.apache.maven.lifecycle.internal.MojoExecutor.execute(MojoExecutor.java:225)
	at org.apache.maven.lifecycle.internal.MojoExecutor.execute(MojoExecutor.java:153)
	at org.apache.maven.lifecycle.internal.MojoExecutor.execute(MojoExecutor.java:145)
	at org.apache.maven.lifecycle.internal.LifecycleModuleBuilder.buildProject(LifecycleModuleBuilder.java:84)
	at org.apache.maven.lifecycle.internal.LifecycleModuleBuilder.buildProject(LifecycleModuleBuilder.java:59)
	at org.apache.maven.lifecycle.internal.LifecycleStarter.singleThreadedBuild(LifecycleStarter.java:183)
	at org.apache.maven.lifecycle.internal.LifecycleStarter.execute(LifecycleStarter.java:161)
	at org.apache.maven.DefaultMaven.doExecute(DefaultMaven.java:319)
	at org.apache.maven.DefaultMaven.execute(DefaultMaven.java:156)
	at org.jvnet.hudson.maven3.launcher.Maven3Launcher.main(Maven3Launcher.java:79)
	at sun.reflect.NativeMethodAccessorImpl.invoke0(Native Method)
	at sun.reflect.NativeMethodAccessorImpl.invoke(NativeMethodAccessorImpl.java:39)
	at sun.reflect.DelegatingMethodAccessorImpl.invoke(DelegatingMethodAccessorImpl.java:25)
	at java.lang.reflect.Method.invoke(Method.java:597)
	at org.codehaus.plexus.classworlds.launcher.Launcher.launchStandard(Launcher.java:329)
	at org.codehaus.plexus.classworlds.launcher.Launcher.launch(Launcher.java:239)
	at org.jvnet.hudson.maven3.agent.Maven3Main.launch(Maven3Main.java:145)
	at hudson.maven.Maven3Builder.call(Maven3Builder.java:124)
	at hudson.maven.Maven3Builder.call(Maven3Builder.java:71)
	at hudson.remoting.UserRequest.perform(UserRequest.java:114)
	at hudson.remoting.UserRequest.perform(UserRequest.java:48)
	at hudson.remoting.Request$2.run(Request.java:270)
	at java.util.concurrent.Executors$RunnableAdapter.call(Executors.java:441)
	at java.util.concurrent.FutureTask$Sync.innerRun(FutureTask.java:303)
	at java.util.concurrent.FutureTask.run(FutureTask.java:138)
	at java.util.concurrent.ThreadPoolExecutor$Worker.runTask(ThreadPoolExecutor.java:886)
	at java.util.concurrent.ThreadPoolExecutor$Worker.run(ThreadPoolExecutor.java:908)
	at java.lang.Thread.run(Thread.java:619)
Caused by: org.apache.maven.plugin.PluginExecutionException: Execution default of goal org.jvnet.jaxb2.maven2:maven-jaxb2-plugin:0.7.2:generate
failed: A required class was missing while executing org.jvnet.jaxb2.maven2:maven-jaxb2-plugin:0.7.2:generate:
Could not initialize class com.sun.org.apache.xerces.internal.impl.xs.traversers.XSAttributeChecker
-----------------------------------------------------
realm =    plugin>org.jvnet.jaxb2.maven2:maven-jaxb2-plugin:0.7.2
strategy = org.codehaus.plexus.classworlds.strategy.SelfFirstStrategy
urls[0] = <https://hudson.apache.org/hudson/job/ActiveMQ-Trunk-Deploy/ws/.repository/org/jvnet/jaxb2/maven2/maven-jaxb2-plugin/0.7.2/maven-jaxb2-plugin-0.7.2.jar>
urls[1] = <https://hudson.apache.org/hudson/job/ActiveMQ-Trunk-Deploy/ws/.repository/org/jvnet/jaxb2/maven2/maven-jaxb2-plugin-raw/0.7.2/maven-jaxb2-plugin-raw-0.7.2.jar>
urls[2] = <https://hudson.apache.org/hudson/job/ActiveMQ-Trunk-Deploy/ws/.repository/org/codehaus/plexus/plexus-utils/1.1/plexus-utils-1.1.jar>
urls[3] = <https://hudson.apache.org/hudson/job/ActiveMQ-Trunk-Deploy/ws/.repository/junit/junit/3.8.1/junit-3.8.1.jar>
urls[4] = <https://hudson.apache.org/hudson/job/ActiveMQ-Trunk-Deploy/ws/.repository/org/jfrog/maven/annomojo/maven-plugin-anno/1.3.1/maven-plugin-anno-1.3.1.jar>
urls[5] = <https://hudson.apache.org/hudson/job/ActiveMQ-Trunk-Deploy/ws/.repository/com/sun/xml/bind/jaxb-impl/2.1.12/jaxb-impl-2.1.12.jar>
urls[6] = <https://hudson.apache.org/hudson/job/ActiveMQ-Trunk-Deploy/ws/.repository/javax/xml/bind/jaxb-api/2.1/jaxb-api-2.1.jar>
urls[7] = <https://hudson.apache.org/hudson/job/ActiveMQ-Trunk-Deploy/ws/.repository/javax/xml/stream/stax-api/1.0-2/stax-api-1.0-2.jar>
urls[8] = <https://hudson.apache.org/hudson/job/ActiveMQ-Trunk-Deploy/ws/.repository/javax/activation/activation/1.1/activation-1.1.jar>
urls[9] = <https://hudson.apache.org/hudson/job/ActiveMQ-Trunk-Deploy/ws/.repository/org/jvnet/jaxb2_commons/jaxb2-basics-jaxb-xjc/2.1.12/jaxb2-basics-jaxb-xjc-2.1.12.jar>
urls[10] = <https://hudson.apache.org/hudson/job/ActiveMQ-Trunk-Deploy/ws/.repository/com/sun/codemodel/codemodel/2.2/codemodel-2.2.jar>
urls[11] = <https://hudson.apache.org/hudson/job/ActiveMQ-Trunk-Deploy/ws/.repository/com/sun/xml/dtd-parser/dtd-parser/1.0/dtd-parser-1.0.jar>
urls[12] = <https://hudson.apache.org/hudson/job/ActiveMQ-Trunk-Deploy/ws/.repository/com/sun/istack/istack-commons-tools/1.1/istack-commons-tools-1.1.jar>
urls[13] = <https://hudson.apache.org/hudson/job/ActiveMQ-Trunk-Deploy/ws/.repository/relaxngDatatype/relaxngDatatype/20020414/relaxngDatatype-20020414.jar>
urls[14] = <https://hudson.apache.org/hudson/job/ActiveMQ-Trunk-Deploy/ws/.repository/com/sun/org/apache/xml/internal/resolver/20050927/resolver-20050927.jar>
urls[15] = <https://hudson.apache.org/hudson/job/ActiveMQ-Trunk-Deploy/ws/.repository/org/kohsuke/rngom/rngom/20061207/rngom-20061207.jar>
urls[16] = <https://hudson.apache.org/hudson/job/ActiveMQ-Trunk-Deploy/ws/.repository/com/sun/xsom/xsom/20081112/xsom-20081112.jar>
Number of foreign imports: 1
import: Entry[import  from realm ClassRealm[project>org.apache.activemq:activemq-parent:5.5-SNAPSHOT,
parent: ClassRealm[maven.api, parent: null]]]

-----------------------------------------------------

	at org.apache.maven.plugin.DefaultBuildPluginManager.executeMojo(DefaultBuildPluginManager.java:133)
	at org.apache.maven.lifecycle.internal.MojoExecutor.execute(MojoExecutor.java:209)
	... 27 more
Caused by: org.apache.maven.plugin.PluginContainerException: A required class was missing
while executing org.jvnet.jaxb2.maven2:maven-jaxb2-plugin:0.7.2:generate: Could not initialize
class com.sun.org.apache.xerces.internal.impl.xs.traversers.XSAttributeChecker
-----------------------------------------------------
realm =    plugin>org.jvnet.jaxb2.maven2:maven-jaxb2-plugin:0.7.2
strategy = org.codehaus.plexus.classworlds.strategy.SelfFirstStrategy
urls[0] = <https://hudson.apache.org/hudson/job/ActiveMQ-Trunk-Deploy/ws/.repository/org/jvnet/jaxb2/maven2/maven-jaxb2-plugin/0.7.2/maven-jaxb2-plugin-0.7.2.jar>
urls[1] = <https://hudson.apache.org/hudson/job/ActiveMQ-Trunk-Deploy/ws/.repository/org/jvnet/jaxb2/maven2/maven-jaxb2-plugin-raw/0.7.2/maven-jaxb2-plugin-raw-0.7.2.jar>
urls[2] = <https://hudson.apache.org/hudson/job/ActiveMQ-Trunk-Deploy/ws/.repository/org/codehaus/plexus/plexus-utils/1.1/plexus-utils-1.1.jar>
urls[3] = <https://hudson.apache.org/hudson/job/ActiveMQ-Trunk-Deploy/ws/.repository/junit/junit/3.8.1/junit-3.8.1.jar>
urls[4] = <https://hudson.apache.org/hudson/job/ActiveMQ-Trunk-Deploy/ws/.repository/org/jfrog/maven/annomojo/maven-plugin-anno/1.3.1/maven-plugin-anno-1.3.1.jar>
urls[5] = <https://hudson.apache.org/hudson/job/ActiveMQ-Trunk-Deploy/ws/.repository/com/sun/xml/bind/jaxb-impl/2.1.12/jaxb-impl-2.1.12.jar>
urls[6] = <https://hudson.apache.org/hudson/job/ActiveMQ-Trunk-Deploy/ws/.repository/javax/xml/bind/jaxb-api/2.1/jaxb-api-2.1.jar>
urls[7] = <https://hudson.apache.org/hudson/job/ActiveMQ-Trunk-Deploy/ws/.repository/javax/xml/stream/stax-api/1.0-2/stax-api-1.0-2.jar>
urls[8] = <https://hudson.apache.org/hudson/job/ActiveMQ-Trunk-Deploy/ws/.repository/javax/activation/activation/1.1/activation-1.1.jar>
urls[9] = <https://hudson.apache.org/hudson/job/ActiveMQ-Trunk-Deploy/ws/.repository/org/jvnet/jaxb2_commons/jaxb2-basics-jaxb-xjc/2.1.12/jaxb2-basics-jaxb-xjc-2.1.12.jar>
urls[10] = <https://hudson.apache.org/hudson/job/ActiveMQ-Trunk-Deploy/ws/.repository/com/sun/codemodel/codemodel/2.2/codemodel-2.2.jar>
urls[11] = <https://hudson.apache.org/hudson/job/ActiveMQ-Trunk-Deploy/ws/.repository/com/sun/xml/dtd-parser/dtd-parser/1.0/dtd-parser-1.0.jar>
urls[12] = <https://hudson.apache.org/hudson/job/ActiveMQ-Trunk-Deploy/ws/.repository/com/sun/istack/istack-commons-tools/1.1/istack-commons-tools-1.1.jar>
urls[13] = <https://hudson.apache.org/hudson/job/ActiveMQ-Trunk-Deploy/ws/.repository/relaxngDatatype/relaxngDatatype/20020414/relaxngDatatype-20020414.jar>
urls[14] = <https://hudson.apache.org/hudson/job/ActiveMQ-Trunk-Deploy/ws/.repository/com/sun/org/apache/xml/internal/resolver/20050927/resolver-20050927.jar>
urls[15] = <https://hudson.apache.org/hudson/job/ActiveMQ-Trunk-Deploy/ws/.repository/org/kohsuke/rngom/rngom/20061207/rngom-20061207.jar>
urls[16] = <https://hudson.apache.org/hudson/job/ActiveMQ-Trunk-Deploy/ws/.repository/com/sun/xsom/xsom/20081112/xsom-20081112.jar>
Number of foreign imports: 1
import: Entry[import  from realm ClassRealm[project>org.apache.activemq:activemq-parent:5.5-SNAPSHOT,
parent: ClassRealm[maven.api, parent: null]]]

-----------------------------------------------------

	at org.apache.maven.plugin.DefaultBuildPluginManager.executeMojo(DefaultBuildPluginManager.java:131)
	... 28 more
Caused by: java.lang.NoClassDefFoundError: Could not initialize class com.sun.org.apache.xerces.internal.impl.xs.traversers.XSAttributeChecker
	at com.sun.org.apache.xerces.internal.impl.xs.traversers.XSDHandler.createTraversers(XSDHandler.java:1851)
	at com.sun.org.apache.xerces.internal.impl.xs.traversers.XSDHandler.prepareForTraverse(XSDHandler.java:1921)
	at com.sun.org.apache.xerces.internal.impl.xs.traversers.XSDHandler.parseSchema(XSDHandler.java:567)
	at com.sun.org.apache.xerces.internal.impl.xs.XMLSchemaLoader.loadSchema(XMLSchemaLoader.java:552)
	at com.sun.org.apache.xerces.internal.impl.xs.XMLSchemaLoader.loadGrammar(XMLSchemaLoader.java:519)
	at com.sun.org.apache.xerces.internal.impl.xs.XMLSchemaLoader.loadGrammar(XMLSchemaLoader.java:485)
	at com.sun.org.apache.xerces.internal.jaxp.validation.XMLSchemaFactory.newSchema(XMLSchemaFactory.java:210)
	at javax.xml.validation.SchemaFactory.newSchema(SchemaFactory.java:594)
	at javax.xml.validation.SchemaFactory.newSchema(SchemaFactory.java:626)
	at com.sun.tools.xjc.SchemaCache.newValidator(SchemaCache.java:75)
	at com.sun.tools.xjc.reader.xmlschema.bindinfo.AnnotationParserFactoryImpl$1$1.startElement(AnnotationParserFactoryImpl.java:113)
	at com.sun.xml.xsom.impl.parser.state.NGCCRuntime.startElement(NGCCRuntime.java:214)
	at org.xml.sax.helpers.XMLFilterImpl.startElement(XMLFilterImpl.java:527)
	at com.sun.tools.xjc.util.SubtreeCutter.startElement(SubtreeCutter.java:104)
	at com.sun.tools.xjc.reader.ExtensionBindingChecker.startElement(ExtensionBindingChecker.java:144)
	at org.xml.sax.helpers.XMLFilterImpl.startElement(XMLFilterImpl.java:527)
	at com.sun.tools.xjc.reader.xmlschema.parser.IncorrectNamespaceURIChecker.startElement(IncorrectNamespaceURIChecker.java:113)
	at org.xml.sax.helpers.XMLFilterImpl.startElement(XMLFilterImpl.java:527)
	at com.sun.tools.xjc.reader.xmlschema.parser.CustomizationContextChecker.startElement(CustomizationContextChecker.java:188)
	at org.xml.sax.helpers.XMLFilterImpl.startElement(XMLFilterImpl.java:527)
	at com.sun.tools.xjc.ModelLoader$SpeculationChecker.startElement(ModelLoader.java:455)
	at org.xml.sax.helpers.XMLFilterImpl.startElement(XMLFilterImpl.java:527)
	at com.sun.tools.xjc.reader.internalizer.VersionChecker.startElement(VersionChecker.java:98)
	at org.xml.sax.helpers.XMLFilterImpl.startElement(XMLFilterImpl.java:527)
	at com.sun.org.apache.xerces.internal.parsers.AbstractSAXParser.startElement(AbstractSAXParser.java:501)
	at com.sun.org.apache.xerces.internal.parsers.AbstractXMLDocumentParser.emptyElement(AbstractXMLDocumentParser.java:179)
	at com.sun.org.apache.xerces.internal.impl.XMLNSDocumentScannerImpl.scanStartElement(XMLNSDocumentScannerImpl.java:377)
	at com.sun.org.apache.xerces.internal.impl.XMLDocumentFragmentScannerImpl$FragmentContentDriver.next(XMLDocumentFragmentScannerImpl.java:2755)
	at com.sun.org.apache.xerces.internal.impl.XMLDocumentScannerImpl.next(XMLDocumentScannerImpl.java:648)
	at com.sun.org.apache.xerces.internal.impl.XMLNSDocumentScannerImpl.next(XMLNSDocumentScannerImpl.java:140)
	at com.sun.org.apache.xerces.internal.impl.XMLDocumentFragmentScannerImpl.scanDocument(XMLDocumentFragmentScannerImpl.java:511)
	at com.sun.org.apache.xerces.internal.parsers.XML11Configuration.parse(XML11Configuration.java:808)
	at com.sun.org.apache.xerces.internal.parsers.XML11Configuration.parse(XML11Configuration.java:737)
	at com.sun.org.apache.xerces.internal.parsers.XMLParser.parse(XMLParser.java:119)
	at com.sun.org.apache.xerces.internal.parsers.AbstractSAXParser.parse(AbstractSAXParser.java:1205)
	at com.sun.org.apache.xerces.internal.jaxp.SAXParserImpl$JAXPSAXParser.parse(SAXParserImpl.java:522)
	at org.xml.sax.helpers.XMLFilterImpl.parse(XMLFilterImpl.java:333)
	at com.sun.xml.xsom.parser.JAXPParser.parse(JAXPParser.java:115)
	at com.sun.tools.xjc.ModelLoader$2.parse(ModelLoader.java:479)
	at com.sun.tools.xjc.ModelLoader$XMLSchemaParser.parse(ModelLoader.java:262)
	at com.sun.xml.xsom.impl.parser.NGCCRuntimeEx.parseEntity(NGCCRuntimeEx.java:337)
	at com.sun.xml.xsom.impl.parser.ParserContext.parse(ParserContext.java:124)
	at com.sun.xml.xsom.parser.XSOMParser.parse(XSOMParser.java:183)
	at com.sun.tools.xjc.ModelLoader.createXSOMSpeculative(ModelLoader.java:496)
	at com.sun.tools.xjc.ModelLoader.loadXMLSchema(ModelLoader.java:366)
	at com.sun.tools.xjc.ModelLoader.load(ModelLoader.java:167)
	at com.sun.tools.xjc.ModelLoader.load(ModelLoader.java:113)
	at org.jvnet.jaxb2.maven2.RawXJC2Mojo.loadModel(RawXJC2Mojo.java:630)
	at org.jvnet.jaxb2.maven2.RawXJC2Mojo.doExecute(RawXJC2Mojo.java:258)
	at org.jvnet.jaxb2.maven2.RawXJC2Mojo.execute(RawXJC2Mojo.java:134)
	at org.apache.maven.plugin.DefaultBuildPluginManager.executeMojo(DefaultBuildPluginManager.java:107)
	... 28 more
Sending e-mails to: dev@activemq.apache.org
channel stopped


Mime
View raw message