activemq-dev mailing list archives

Site index · List index
Message view « Date » · « Thread »
Top « Date » · « Thread »
From Apache Hudson Server <hud...@hudson.apache.org>
Subject Build failed in Hudson: ActiveMQ-Trunk-Deploy » ActiveMQ #208
Date Thu, 06 Jan 2011 04:38:00 GMT
See <https://hudson.apache.org/hudson/job/ActiveMQ-Trunk-Deploy/org.apache.activemq$activemq-parent/208/>

------------------------------------------
[...truncated 2091 lines...]
Downloading: http://repository.springsource.com/maven/bundles/external/org/codehaus/groovy/maven/runtime/gmaven-runtime-support/1.0-rc-3/gmaven-runtime-support-1.0-rc-3.jar
[INFO] Unable to find resource 'org.codehaus.groovy.maven.runtime:gmaven-runtime-support:jar:1.0-rc-3'
in repository com.springsource.repository.bundles.external (http://repository.springsource.com/maven/bundles/external)
Downloading: http://repo1.maven.org/maven2/org/codehaus/groovy/maven/runtime/gmaven-runtime-support/1.0-rc-3/gmaven-runtime-support-1.0-rc-3.jar

[INFO] [ianal:verify-legal-files {execution: default}]
Downloading: http://repository.apache.org/snapshots/org/codehaus/plexus/plexus-digest/1.0/plexus-digest-1.0.pom
[INFO] Unable to find resource 'org.codehaus.plexus:plexus-digest:pom:1.0' in repository apache.snapshots
(https://repository.apache.org/content/repositories/snapshots/)
Downloading: http://repo1.maven.org/maven2/org/codehaus/plexus/plexus-digest/1.0/plexus-digest-1.0.pom

Downloading: http://repository.apache.org/snapshots/org/codehaus/plexus/plexus-components/1.1.7/plexus-components-1.1.7.pom
[INFO] Unable to find resource 'org.codehaus.plexus:plexus-components:pom:1.1.7' in repository
apache.snapshots (https://repository.apache.org/content/repositories/snapshots/)
Downloading: http://repo1.maven.org/maven2/org/codehaus/plexus/plexus-components/1.1.7/plexus-components-1.1.7.pom

Downloading: http://repository.apache.org/snapshots/org/codehaus/plexus/plexus-digest/1.0/plexus-digest-1.0.jar
[INFO] Unable to find resource 'org.codehaus.plexus:plexus-digest:jar:1.0' in repository apache.snapshots
(https://repository.apache.org/content/repositories/snapshots/)
Downloading: http://repo1.maven.org/maven2/org/codehaus/plexus/plexus-digest/1.0/plexus-digest-1.0.jar

[INFO] [install:install {execution: default-install}]
[INFO] Installing <https://hudson.apache.org/hudson/job/ActiveMQ-Trunk-Deploy/org.apache.activemq$activemq-parent/ws/pom.xml>
to /home/hudson/hudson-slave/workspace/ActiveMQ-Trunk-Deploy/.repository/org/apache/activemq/activemq-parent/5.5-SNAPSHOT/activemq-parent-5.5-SNAPSHOT.pom
[INFO] [deploy:deploy {execution: default-deploy}]
[INFO] Retrieving previous build number from apache.snapshots.https
Uploading: https://repository.apache.org/content/repositories/snapshots/org/apache/activemq/activemq-parent/5.5-SNAPSHOT/activemq-parent-5.5-SNAPSHOT.pom
[HUDSON] Archiving /home/hudson/hudson-slave/workspace/ActiveMQ-Trunk-Deploy/.repository/org/apache/activemq/activemq-parent/5.5-SNAPSHOT/activemq-parent-5.5-SNAPSHOT.pom
to /home/hudson/hudson/jobs/ActiveMQ-Trunk-Deploy/modules/org.apache.activemq$activemq-parent/builds/2011-01-06_03-59-56/archive/org.apache.activemq/activemq-parent/5.5-SNAPSHOT/activemq-parent-5.5-SNAPSHOT.pom
[INFO] ------------------------------------------------------------------------
[INFO] SKIPPING ActiveMQ :: KahaDB
[INFO]    task-segment: [clean, deploy]
[INFO] This project has been banned from further executions due to previous failures.
[INFO] ------------------------------------------------------------------------
[INFO] ------------------------------------------------------------------------
[INFO] SKIPPING ActiveMQ :: JAAS
[INFO]    task-segment: [clean, deploy]
[INFO] This project has been banned from further executions due to previous failures.
[INFO] ------------------------------------------------------------------------
[INFO] ------------------------------------------------------------------------
[INFO] SKIPPING Openwire Generator
[INFO]    task-segment: [clean, deploy]
[INFO] This project has been banned from further executions due to previous failures.
[INFO] ------------------------------------------------------------------------
[INFO] ------------------------------------------------------------------------
[INFO] SKIPPING ActiveMQ :: jmdns 1.0
[INFO]    task-segment: [clean, deploy]
[INFO] This project has been banned from further executions due to previous failures.
[INFO] ------------------------------------------------------------------------
[INFO] ------------------------------------------------------------------------
[INFO] SKIPPING ActiveMQ :: Core
[INFO]    task-segment: [clean, deploy]
[INFO] This project has been banned from further executions due to previous failures.
[INFO] ------------------------------------------------------------------------
[INFO] ------------------------------------------------------------------------
[INFO] SKIPPING ActiveMQ :: RA
[INFO]    task-segment: [clean, deploy]
[INFO] This project has been banned from further executions due to previous failures.
[INFO] ------------------------------------------------------------------------
[INFO] ------------------------------------------------------------------------
[INFO] SKIPPING ActiveMQ :: Pool
[INFO]    task-segment: [clean, deploy]
[INFO] This project has been banned from further executions due to previous failures.
[INFO] ------------------------------------------------------------------------
[INFO] ------------------------------------------------------------------------
[INFO] SKIPPING ActiveMQ :: Camel
[INFO]    task-segment: [clean, deploy]
[INFO] This project has been banned from further executions due to previous failures.
[INFO] ------------------------------------------------------------------------
[INFO] ------------------------------------------------------------------------
[INFO] SKIPPING ActiveMQ :: Console
[INFO]    task-segment: [clean, deploy]
[INFO] This project has been banned from further executions due to previous failures.
[INFO] ------------------------------------------------------------------------
[INFO] ------------------------------------------------------------------------
[INFO] SKIPPING ActiveMQ :: Optional
[INFO]    task-segment: [clean, deploy]
[INFO] This project has been banned from further executions due to previous failures.
[INFO] ------------------------------------------------------------------------
[INFO] ------------------------------------------------------------------------
[INFO] SKIPPING ActiveMQ :: Jar Bundle
[INFO]    task-segment: [clean, deploy]
[INFO] This project has been banned from further executions due to previous failures.
[INFO] ------------------------------------------------------------------------
[INFO] ------------------------------------------------------------------------
[INFO] SKIPPING ActiveMQ :: File Server
[INFO]    task-segment: [clean, deploy]
[INFO] This project has been banned from further executions due to previous failures.
[INFO] ------------------------------------------------------------------------
[INFO] ------------------------------------------------------------------------
[INFO] SKIPPING ActiveMQ :: Blueprint
[INFO]    task-segment: [clean, deploy]
[INFO] This project has been banned from further executions due to previous failures.
[INFO] ------------------------------------------------------------------------
[INFO] ------------------------------------------------------------------------
[INFO] SKIPPING ActiveMQ :: Apache Karaf
[INFO]    task-segment: [clean, deploy]
[INFO] This project has been banned from further executions due to previous failures.
[INFO] ------------------------------------------------------------------------
[INFO] ------------------------------------------------------------------------
[INFO] SKIPPING ActiveMQ :: RAR
[INFO]    task-segment: [clean, deploy]
[INFO] This project has been banned from further executions due to previous failures.
[INFO] ------------------------------------------------------------------------
[INFO] ------------------------------------------------------------------------
[INFO] SKIPPING ActiveMQ :: Run Jar
[INFO]    task-segment: [clean, deploy]
[INFO] This project has been banned from further executions due to previous failures.
[INFO] ------------------------------------------------------------------------
[INFO] ------------------------------------------------------------------------
[INFO] SKIPPING ActiveMQ :: Spring
[INFO]    task-segment: [clean, deploy]
[INFO] This project has been banned from further executions due to previous failures.
[INFO] ------------------------------------------------------------------------
[INFO] ------------------------------------------------------------------------
[INFO] SKIPPING ActiveMQ Tooling
[INFO]    task-segment: [clean, deploy]
[INFO] This project has been banned from further executions due to previous failures.
[INFO] ------------------------------------------------------------------------
[INFO] ------------------------------------------------------------------------
[INFO] SKIPPING ActiveMQ :: Memory Usage Test Plugin
[INFO]    task-segment: [clean, deploy]
[INFO] This project has been banned from further executions due to previous failures.
[INFO] ------------------------------------------------------------------------
[INFO] ------------------------------------------------------------------------
[INFO] SKIPPING ActiveMQ :: Performance Test Plugin
[INFO]    task-segment: [clean, deploy]
[INFO] This project has been banned from further executions due to previous failures.
[INFO] ------------------------------------------------------------------------
[INFO] ------------------------------------------------------------------------
[INFO] SKIPPING ActiveMQ :: StartUp Plugin
[INFO]    task-segment: [clean, deploy]
[INFO] This project has been banned from further executions due to previous failures.
[INFO] ------------------------------------------------------------------------
[INFO] ------------------------------------------------------------------------
[INFO] SKIPPING ActiveMQ :: Web
[INFO]    task-segment: [clean, deploy]
[INFO] This project has been banned from further executions due to previous failures.
[INFO] ------------------------------------------------------------------------
[INFO] ------------------------------------------------------------------------
[INFO] SKIPPING ActiveMQ :: Web Demo
[INFO]    task-segment: [clean, deploy]
[INFO] This project has been banned from further executions due to previous failures.
[INFO] ------------------------------------------------------------------------
[INFO] ------------------------------------------------------------------------
[INFO] SKIPPING ActiveMQ :: XMPP
[INFO]    task-segment: [clean, deploy]
[INFO] This project has been banned from further executions due to previous failures.
[INFO] ------------------------------------------------------------------------
[INFO] ------------------------------------------------------------------------
[INFO] SKIPPING ActiveMQ :: Web Console
[INFO]    task-segment: [clean, deploy]
[INFO] This project has been banned from further executions due to previous failures.
[INFO] ------------------------------------------------------------------------
[INFO] ------------------------------------------------------------------------
[INFO] SKIPPING ActiveMQ :: Assembly
[INFO]    task-segment: [clean, deploy]
[INFO] This project has been banned from further executions due to previous failures.
[INFO] ------------------------------------------------------------------------
[INFO] 
[INFO] 
[INFO] ------------------------------------------------------------------------
[INFO] Reactor Summary:
[INFO] ------------------------------------------------------------------------
[INFO] ActiveMQ .............................................. FAILED [36:31.819s]
[INFO] ActiveMQ :: KahaDB .................................... SKIPPED (dependency build failed
or was skipped)
[INFO] ActiveMQ :: JAAS ...................................... SKIPPED (dependency build failed
or was skipped)
[INFO] Openwire Generator .................................... SKIPPED (dependency build failed
or was skipped)
[INFO] ActiveMQ :: jmdns 1.0 ................................. SKIPPED (dependency build failed
or was skipped)
[INFO] ActiveMQ :: Core ...................................... SKIPPED (dependency build failed
or was skipped)
[INFO] ActiveMQ :: RA ........................................ SKIPPED (dependency build failed
or was skipped)
[INFO] ActiveMQ :: Pool ...................................... SKIPPED (dependency build failed
or was skipped)
[INFO] ActiveMQ :: Camel ..................................... SKIPPED (dependency build failed
or was skipped)
[INFO] ActiveMQ :: Console ................................... SKIPPED (dependency build failed
or was skipped)
[INFO] ActiveMQ :: Optional .................................. SKIPPED (dependency build failed
or was skipped)
[INFO] ActiveMQ :: Jar Bundle ................................ SKIPPED (dependency build failed
or was skipped)
[INFO] ActiveMQ :: File Server ............................... SKIPPED (dependency build failed
or was skipped)
[INFO] ActiveMQ :: Blueprint ................................. SKIPPED (dependency build failed
or was skipped)
[INFO] ActiveMQ :: Apache Karaf .............................. SKIPPED (dependency build failed
or was skipped)
[INFO] ActiveMQ :: RAR ....................................... SKIPPED (dependency build failed
or was skipped)
[INFO] ActiveMQ :: Run Jar ................................... SKIPPED (dependency build failed
or was skipped)
[INFO] ActiveMQ :: Spring .................................... SKIPPED (dependency build failed
or was skipped)
[INFO] ActiveMQ Tooling ...................................... SKIPPED (dependency build failed
or was skipped)
[INFO] ActiveMQ :: Memory Usage Test Plugin .................. SKIPPED (dependency build failed
or was skipped)
[INFO] ActiveMQ :: Performance Test Plugin ................... SKIPPED (dependency build failed
or was skipped)
[INFO] ActiveMQ :: StartUp Plugin ............................ SKIPPED (dependency build failed
or was skipped)
[INFO] ActiveMQ :: Web ....................................... SKIPPED (dependency build failed
or was skipped)
[INFO] ActiveMQ :: Web Demo .................................. SKIPPED (dependency build failed
or was skipped)
[INFO] ActiveMQ :: XMPP ...................................... SKIPPED (dependency build failed
or was skipped)
[INFO] ActiveMQ :: Web Console ............................... SKIPPED (dependency build failed
or was skipped)
[INFO] ActiveMQ :: Assembly .................................. SKIPPED (dependency build failed
or was skipped)
[INFO] ------------------------------------------------------------------------
[INFO] Error for project: ActiveMQ (during deploy)
[INFO] ------------------------------------------------------------------------
[INFO] Error deploying artifact: Failed to transfer file: https://repository.apache.org/content/repositories/snapshots/org/apache/activemq/activemq-parent/5.5-SNAPSHOT/activemq-parent-5.5-SNAPSHOT.pom.
Return code is: 502

[INFO] ------------------------------------------------------------------------
[INFO] Trace
org.apache.maven.lifecycle.LifecycleExecutionException: Error deploying artifact: Failed to
transfer file: https://repository.apache.org/content/repositories/snapshots/org/apache/activemq/activemq-parent/5.5-SNAPSHOT/activemq-parent-5.5-SNAPSHOT.pom.
Return code is: 502
	at org.apache.maven.lifecycle.DefaultLifecycleExecutor.executeGoals(DefaultLifecycleExecutor.java:719)
	at org.apache.maven.lifecycle.DefaultLifecycleExecutor.executeGoalWithLifecycle(DefaultLifecycleExecutor.java:556)
	at org.apache.maven.lifecycle.DefaultLifecycleExecutor.executeGoal(DefaultLifecycleExecutor.java:535)
	at org.apache.maven.lifecycle.DefaultLifecycleExecutor.executeGoalAndHandleFailures(DefaultLifecycleExecutor.java:387)
	at org.apache.maven.lifecycle.DefaultLifecycleExecutor.executeTaskSegments(DefaultLifecycleExecutor.java:348)
	at org.apache.maven.lifecycle.DefaultLifecycleExecutor.execute(DefaultLifecycleExecutor.java:180)
	at org.apache.maven.lifecycle.LifecycleExecutorInterceptor.execute(LifecycleExecutorInterceptor.java:65)
	at org.apache.maven.DefaultMaven.doExecute(DefaultMaven.java:328)
	at org.apache.maven.DefaultMaven.execute(DefaultMaven.java:138)
	at org.apache.maven.cli.MavenCli.main(MavenCli.java:362)
	at sun.reflect.NativeMethodAccessorImpl.invoke0(Native Method)
	at sun.reflect.NativeMethodAccessorImpl.invoke(NativeMethodAccessorImpl.java:39)
	at sun.reflect.DelegatingMethodAccessorImpl.invoke(DelegatingMethodAccessorImpl.java:25)
	at java.lang.reflect.Method.invoke(Method.java:597)
	at org.codehaus.classworlds.Launcher.launchEnhanced(Launcher.java:315)
	at org.codehaus.classworlds.Launcher.launch(Launcher.java:255)
	at hudson.maven.agent.Main.launch(Main.java:165)
	at hudson.maven.MavenBuilder.call(MavenBuilder.java:165)
	at hudson.maven.MavenModuleSetBuild$Builder.call(MavenModuleSetBuild.java:750)
	at hudson.maven.MavenModuleSetBuild$Builder.call(MavenModuleSetBuild.java:694)
	at hudson.remoting.UserRequest.perform(UserRequest.java:114)
	at hudson.remoting.UserRequest.perform(UserRequest.java:48)
	at hudson.remoting.Request$2.run(Request.java:270)
	at java.util.concurrent.Executors$RunnableAdapter.call(Executors.java:441)
	at java.util.concurrent.FutureTask$Sync.innerRun(FutureTask.java:303)
	at java.util.concurrent.FutureTask.run(FutureTask.java:138)
	at java.util.concurrent.ThreadPoolExecutor$Worker.runTask(ThreadPoolExecutor.java:886)
	at java.util.concurrent.ThreadPoolExecutor$Worker.run(ThreadPoolExecutor.java:908)
	at java.lang.Thread.run(Thread.java:619)
Caused by: org.apache.maven.plugin.MojoExecutionException: Error deploying artifact: Failed
to transfer file: https://repository.apache.org/content/repositories/snapshots/org/apache/activemq/activemq-parent/5.5-SNAPSHOT/activemq-parent-5.5-SNAPSHOT.pom.
Return code is: 502
	at org.apache.maven.plugin.deploy.DeployMojo.execute(DeployMojo.java:189)
	at org.apache.maven.plugin.DefaultPluginManager.executeMojo(DefaultPluginManager.java:490)
	at hudson.maven.agent.PluginManagerInterceptor.executeMojo(PluginManagerInterceptor.java:182)
	at org.apache.maven.lifecycle.DefaultLifecycleExecutor.executeGoals(DefaultLifecycleExecutor.java:694)
	... 28 more
Caused by: org.apache.maven.artifact.deployer.ArtifactDeploymentException: Error deploying
artifact: Failed to transfer file: https://repository.apache.org/content/repositories/snapshots/org/apache/activemq/activemq-parent/5.5-SNAPSHOT/activemq-parent-5.5-SNAPSHOT.pom.
Return code is: 502
	at org.apache.maven.artifact.deployer.DefaultArtifactDeployer.deploy(DefaultArtifactDeployer.java:121)
	at org.apache.maven.plugin.deploy.DeployMojo.execute(DeployMojo.java:148)
	... 31 more
Caused by: org.apache.maven.wagon.TransferFailedException: Failed to transfer file: https://repository.apache.org/content/repositories/snapshots/org/apache/activemq/activemq-parent/5.5-SNAPSHOT/activemq-parent-5.5-SNAPSHOT.pom.
Return code is: 502
	at org.apache.maven.wagon.providers.http.LightweightHttpWagon.finishPutTransfer(LightweightHttpWagon.java:205)
	at org.apache.maven.wagon.AbstractWagon.putTransfer(AbstractWagon.java:413)
	at org.apache.maven.wagon.AbstractWagon.transfer(AbstractWagon.java:392)
	at org.apache.maven.wagon.AbstractWagon.putTransfer(AbstractWagon.java:365)
	at org.apache.maven.wagon.StreamWagon.put(StreamWagon.java:163)
	at org.apache.maven.artifact.manager.DefaultWagonManager.putRemoteFile(DefaultWagonManager.java:317)
	at org.apache.maven.artifact.manager.DefaultWagonManager.putArtifact(DefaultWagonManager.java:227)
	at org.apache.maven.artifact.deployer.DefaultArtifactDeployer.deploy(DefaultArtifactDeployer.java:107)
	... 32 more
[INFO] ------------------------------------------------------------------------
[INFO] BUILD ERRORS
[INFO] ------------------------------------------------------------------------
[INFO] Total time: 37 minutes 55 seconds
[INFO] Finished at: Thu Jan 06 04:37:59 UTC 2011
[INFO] Final Memory: 45M/946M
[INFO] ------------------------------------------------------------------------


Mime
View raw message