activemq-dev mailing list archives

Site index · List index
Message view « Date » · « Thread »
Top « Date » · « Thread »
From Apache Hudson Server <hud...@hudson.apache.org>
Subject Build failed in Hudson: ActiveMQ-Apollo-Deploy » apollo-website #37
Date Tue, 04 Jan 2011 05:30:58 GMT
See <https://hudson.apache.org/hudson/job/ActiveMQ-Apollo-Deploy/org.apache.activemq$apollo-website/37/>

------------------------------------------
[...truncated 372 lines...]
Downloading: http://scala-tools.org/repo-releases/org/scala-lang/scala-library/2.8.0/scala-library-2.8.0.jar
[INFO] Unable to find resource 'org.codehaus.plexus:plexus-utils:jar:2.0.0' in repository
scala (http://scala-tools.org/repo-releases)
Downloading: http://scala-tools.org/repo-snapshots/org/codehaus/plexus/plexus-utils/2.0.0/plexus-utils-2.0.0.jar
[INFO] Unable to find resource 'jline:jline:jar:0.9.94' in repository scala (http://scala-tools.org/repo-releases)
Downloading: http://scala-tools.org/repo-snapshots/jline/jline/0.9.94/jline-0.9.94.jar
[INFO] Unable to find resource 'org.apache.maven:maven-plugin-tools-api:jar:2.1' in repository
scala (http://scala-tools.org/repo-releases)
Downloading: http://scala-tools.org/repo-snapshots/org/apache/maven/maven-plugin-tools-api/2.1/maven-plugin-tools-api-2.1.jar
[INFO] Unable to find resource 'org.codehaus.plexus:plexus-utils:jar:2.0.0' in repository
snapshots.scala-tools.org (http://scala-tools.org/repo-snapshots)
Downloading: http://repo.fusesource.com/nexus/content/repositories/snapshots/org/codehaus/plexus/plexus-utils/2.0.0/plexus-utils-2.0.0.jar
[INFO] Unable to find resource 'jline:jline:jar:0.9.94' in repository snapshots.scala-tools.org
(http://scala-tools.org/repo-snapshots)
Downloading: http://repo.fusesource.com/nexus/content/repositories/snapshots/jline/jline/0.9.94/jline-0.9.94.jar
[INFO] Unable to find resource 'org.apache.maven:maven-plugin-tools-api:jar:2.1' in repository
snapshots.scala-tools.org (http://scala-tools.org/repo-snapshots)
Downloading: http://repo.fusesource.com/nexus/content/repositories/snapshots/org/apache/maven/maven-plugin-tools-api/2.1/maven-plugin-tools-api-2.1.jar
[INFO] Unable to find resource 'org.codehaus.plexus:plexus-utils:jar:2.0.0' in repository
fusesource.snapshots (http://repo.fusesource.com/nexus/content/repositories/snapshots)
Downloading: http://repo1.maven.org/maven2/org/codehaus/plexus/plexus-utils/2.0.0/plexus-utils-2.0.0.jar
[INFO] Unable to find resource 'jline:jline:jar:0.9.94' in repository fusesource.snapshots
(http://repo.fusesource.com/nexus/content/repositories/snapshots)
Downloading: http://repo1.maven.org/maven2/jline/jline/0.9.94/jline-0.9.94.jar
[INFO] Unable to find resource 'org.apache.maven:maven-plugin-tools-api:jar:2.1' in repository
fusesource.snapshots (http://repo.fusesource.com/nexus/content/repositories/snapshots)
Downloading: http://repo1.maven.org/maven2/org/apache/maven/maven-plugin-tools-api/2.1/maven-plugin-tools-api-2.1.jar
189K downloaded  (scala-mojo-support-1.12.jar)

Downloading: http://repo.open.iona.com/maven2/commons-lang/commons-lang/2.5/commons-lang-2.5.jar
[INFO] Unable to find resource 'commons-lang:commons-lang:jar:2.5' in repository open.iona.m2
(http://repo.open.iona.com/maven2)
Downloading: http://download.java.net/maven/2/commons-lang/commons-lang/2.5/commons-lang-2.5.jar
[INFO] Unable to find resource 'commons-lang:commons-lang:jar:2.5' in repository maven2-repository.dev.java.net
(http://download.java.net/maven/2)
Downloading: http://scala-tools.org/repo-releases/commons-lang/commons-lang/2.5/commons-lang-2.5.jar
[INFO] Unable to find resource 'commons-lang:commons-lang:jar:2.5' in repository scala (http://scala-tools.org/repo-releases)
Downloading: http://scala-tools.org/repo-snapshots/commons-lang/commons-lang/2.5/commons-lang-2.5.jar
[INFO] Unable to find resource 'commons-lang:commons-lang:jar:2.5' in repository snapshots.scala-tools.org
(http://scala-tools.org/repo-snapshots)
Downloading: http://repo.fusesource.com/nexus/content/repositories/snapshots/commons-lang/commons-lang/2.5/commons-lang-2.5.jar
[INFO] Unable to find resource 'commons-lang:commons-lang:jar:2.5' in repository fusesource.snapshots
(http://repo.fusesource.com/nexus/content/repositories/snapshots)
Downloading: http://repo1.maven.org/maven2/commons-lang/commons-lang/2.5/commons-lang-2.5.jar



Downloading: http://repo.open.iona.com/maven2/org/fusesource/scalamd/scalamd/1.2/scalamd-1.2.jar
Downloading: http://repo.open.iona.com/maven2/org/slf4j/slf4j-nop/1.6.1/slf4j-nop-1.6.1.jar
[INFO] Unable to find resource 'org.slf4j:slf4j-nop:jar:1.6.1' in repository open.iona.m2
(http://repo.open.iona.com/maven2)
Downloading: http://download.java.net/maven/2/org/slf4j/slf4j-nop/1.6.1/slf4j-nop-1.6.1.jar
[INFO] Unable to find resource 'org.slf4j:slf4j-nop:jar:1.6.1' in repository maven2-repository.dev.java.net
(http://download.java.net/maven/2)
Downloading: http://scala-tools.org/repo-releases/org/slf4j/slf4j-nop/1.6.1/slf4j-nop-1.6.1.jar
[INFO] Unable to find resource 'org.slf4j:slf4j-nop:jar:1.6.1' in repository scala (http://scala-tools.org/repo-releases)
Downloading: http://scala-tools.org/repo-snapshots/org/slf4j/slf4j-nop/1.6.1/slf4j-nop-1.6.1.jar
79K downloaded  (scalamd-1.2.jar)
[INFO] Unable to find resource 'org.slf4j:slf4j-nop:jar:1.6.1' in repository snapshots.scala-tools.org
(http://scala-tools.org/repo-snapshots)
Downloading: http://repo.fusesource.com/nexus/content/repositories/snapshots/org/slf4j/slf4j-nop/1.6.1/slf4j-nop-1.6.1.jar
[INFO] Unable to find resource 'org.slf4j:slf4j-nop:jar:1.6.1' in repository fusesource.snapshots
(http://repo.fusesource.com/nexus/content/repositories/snapshots)
Downloading: http://repo1.maven.org/maven2/org/slf4j/slf4j-nop/1.6.1/slf4j-nop-1.6.1.jar

6016K downloaded  (scala-library-2.8.0.jar)
Downloading: http://repo.open.iona.com/maven2/org/scala-lang/scala-compiler/2.8.0/scala-compiler-2.8.0.jar
[INFO] Unable to find resource 'org.scala-lang:scala-compiler:jar:2.8.0' in repository open.iona.m2
(http://repo.open.iona.com/maven2)
Downloading: http://download.java.net/maven/2/org/scala-lang/scala-compiler/2.8.0/scala-compiler-2.8.0.jar
[INFO] Unable to find resource 'org.scala-lang:scala-compiler:jar:2.8.0' in repository maven2-repository.dev.java.net
(http://download.java.net/maven/2)
Downloading: http://scala-tools.org/repo-releases/org/scala-lang/scala-compiler/2.8.0/scala-compiler-2.8.0.jar
8468K downloaded  (scala-compiler-2.8.0.jar)
Processing Configuration for child elements
Processing child [project]
Processing child [scalateWorkDir]
Processing child [warSourceDirectory]
Processing child [resourcesSourceDirectory]
Processing child [targetDirectory]
Processing child [testClassPathElements]
[INFO] [scalate:sitegen {execution: sitegen}]
[INFO] Generating static website from Scalate Templates and wiki files...
SLF4J: Class path contains multiple SLF4J bindings.
SLF4J: Found binding in [jar:file:/home/hudson/hudson-slave/workspace/ActiveMQ-Apollo-Deploy/.repository/ch/qos/logback/logback-classic/0.9.26/logback-classic-0.9.26.jar!/org/slf4j/impl/StaticLoggerBinder.class]
SLF4J: Found binding in [jar:file:/home/hudson/hudson-slave/workspace/ActiveMQ-Apollo-Deploy/.repository/org/slf4j/slf4j-nop/1.6.1/slf4j-nop-1.6.1.jar!/org/slf4j/impl/StaticLoggerBinder.class]
SLF4J: See http://www.slf4j.org/codes.html#multiple_bindings for an explanation.
[INFO]     processing <https://hudson.apache.org/hudson/job/ActiveMQ-Apollo-Deploy/org.apache.activemq$apollo-website/ws/src/documentation/architecture.md>
with uri: /documentation/architecture.md => 
[INFO]     processing <https://hudson.apache.org/hudson/job/ActiveMQ-Apollo-Deploy/org.apache.activemq$apollo-website/ws/src/documentation/user-manual.md>
with uri: /documentation/user-manual.md => 
[INFO]     processing <https://hudson.apache.org/hudson/job/ActiveMQ-Apollo-Deploy/org.apache.activemq$apollo-website/ws/src/documentation/index.page>
with uri: /documentation/index.page => 
[INFO]     processing <https://hudson.apache.org/hudson/job/ActiveMQ-Apollo-Deploy/org.apache.activemq$apollo-website/ws/src/documentation/module-organization.page>
with uri: /documentation/module-organization.page => 
[INFO]     processing <https://hudson.apache.org/hudson/job/ActiveMQ-Apollo-Deploy/org.apache.activemq$apollo-website/ws/src/documentation/performance-scaling.md>
with uri: /documentation/performance-scaling.md => 
[INFO]     processing <https://hudson.apache.org/hudson/job/ActiveMQ-Apollo-Deploy/org.apache.activemq$apollo-website/ws/src/documentation/getting-started.md>
with uri: /documentation/getting-started.md => 
[INFO]     processing <https://hudson.apache.org/hudson/job/ActiveMQ-Apollo-Deploy/org.apache.activemq$apollo-website/ws/src/index.page>
with uri: /index.page => 
[INFO]     processing <https://hudson.apache.org/hudson/job/ActiveMQ-Apollo-Deploy/org.apache.activemq$apollo-website/ws/src/download.page>
with uri: /download.page => 
[INFO]     processing <https://hudson.apache.org/hudson/job/ActiveMQ-Apollo-Deploy/org.apache.activemq$apollo-website/ws/src/versions/index.page>
with uri: /versions/index.page => 
[INFO]     processing <https://hudson.apache.org/hudson/job/ActiveMQ-Apollo-Deploy/org.apache.activemq$apollo-website/ws/src/privacy-policy.page>
with uri: /privacy-policy.page => 
[INFO]     processing <https://hudson.apache.org/hudson/job/ActiveMQ-Apollo-Deploy/org.apache.activemq$apollo-website/ws/src/community/building.page>
with uri: /community/building.page => 
[INFO]     processing <https://hudson.apache.org/hudson/job/ActiveMQ-Apollo-Deploy/org.apache.activemq$apollo-website/ws/src/community/release-guide.page>
with uri: /community/release-guide.page => 
[INFO]     processing <https://hudson.apache.org/hudson/job/ActiveMQ-Apollo-Deploy/org.apache.activemq$apollo-website/ws/src/community/source.page>
with uri: /community/source.page => 
[INFO]     processing <https://hudson.apache.org/hudson/job/ActiveMQ-Apollo-Deploy/org.apache.activemq$apollo-website/ws/src/community/developers.page>
with uri: /community/developers.page => 
[INFO]     processing <https://hudson.apache.org/hudson/job/ActiveMQ-Apollo-Deploy/org.apache.activemq$apollo-website/ws/src/community/index.page>
with uri: /community/index.page => 
[INFO]     processing <https://hudson.apache.org/hudson/job/ActiveMQ-Apollo-Deploy/org.apache.activemq$apollo-website/ws/src/community/support.page>
with uri: /community/support.page => 
[INFO]     processing <https://hudson.apache.org/hudson/job/ActiveMQ-Apollo-Deploy/org.apache.activemq$apollo-website/ws/src/community/contributing.page>
with uri: /community/contributing.page => 
[INFO]     processing <https://hudson.apache.org/hudson/job/ActiveMQ-Apollo-Deploy/org.apache.activemq$apollo-website/ws/src/community/faq.page>
with uri: /community/faq.page => 
[INFO]     processing <https://hudson.apache.org/hudson/job/ActiveMQ-Apollo-Deploy/org.apache.activemq$apollo-website/ws/src/community/site.page>
with uri: /community/site.page => 
Using dir: <https://hudson.apache.org/hudson/job/ActiveMQ-Apollo-Deploy/org.apache.activemq$apollo-website/ws/src/blog>
at request path: /blog
[INFO]     processing <https://hudson.apache.org/hudson/job/ActiveMQ-Apollo-Deploy/org.apache.activemq$apollo-website/ws/src/blog/index.rss.feed>
with uri: /blog/index.rss.feed => 
Using dir: <https://hudson.apache.org/hudson/job/ActiveMQ-Apollo-Deploy/org.apache.activemq$apollo-website/ws/src/blog>
at request path: /blog
[INFO]     processing <https://hudson.apache.org/hudson/job/ActiveMQ-Apollo-Deploy/org.apache.activemq$apollo-website/ws/src/blog/index.page>
with uri: /blog/index.page => 
[INFO] [install:install {execution: default-install}]
[INFO] Installing <https://hudson.apache.org/hudson/job/ActiveMQ-Apollo-Deploy/org.apache.activemq$apollo-website/ws/pom.xml>
to /home/hudson/hudson-slave/workspace/ActiveMQ-Apollo-Deploy/.repository/org/apache/activemq/apollo-website/1.0-SNAPSHOT/apollo-website-1.0-SNAPSHOT.pom
[INFO] [deploy:deploy {execution: default-deploy}]
[INFO] Retrieving previous build number from apache.snapshots.https
Uploading: https://repository.apache.org/content/repositories/snapshots/org/apache/activemq/apollo-website/1.0-SNAPSHOT/apollo-website-1.0-20110104.041155-70.pom
6K uploaded  (apollo-website-1.0-20110104.041155-70.pom)
[INFO] Retrieving previous metadata from apache.snapshots.https
[INFO] Uploading repository metadata for: 'snapshot org.apache.activemq:apollo-website:1.0-SNAPSHOT'
[INFO] Retrieving previous metadata from apache.snapshots.https
[INFO] Uploading repository metadata for: 'artifact org.apache.activemq:apollo-website'
[INFO] [scalate:deploy {execution: deploy}]
scp://people.apache.org/x1/www/activemq.apache.org/apollo/versions/1.0-SNAPSHOT/website/ -
Session: Connection refused
scp://people.apache.org/x1/www/activemq.apache.org/apollo/versions/1.0-SNAPSHOT/website/ -
Session: Disconnecting  
scp://people.apache.org/x1/www/activemq.apache.org/apollo/versions/1.0-SNAPSHOT/website/ -
Session: Disconnected
[HUDSON] Archiving /home/hudson/hudson-slave/workspace/ActiveMQ-Apollo-Deploy/.repository/org/apache/activemq/apollo-website/1.0-SNAPSHOT/apollo-website-1.0-SNAPSHOT.pom
to /home/hudson/hudson/jobs/ActiveMQ-Apollo-Deploy/modules/org.apache.activemq$apollo-website/builds/2011-01-04_04-03-56/archive/org.apache.activemq/apollo-website/1.0-20110104.041155-70/apollo-website-1.0-SNAPSHOT.pom
[INFO] ------------------------------------------------------------------------
[INFO] SKIPPING apache-apollo
[INFO]    task-segment: [clean, deploy]
[INFO] This project has been banned from further executions due to previous failures.
[INFO] ------------------------------------------------------------------------
[INFO] 
[INFO] 
[INFO] ------------------------------------------------------------------------
[INFO] Reactor Summary:
[INFO] ------------------------------------------------------------------------
[INFO] Apache ActiveMQ Apollo Project ........................ SUCCESS [23:39.502s]
[INFO] apollo-scala .......................................... SUCCESS [4:28.377s]
[INFO] apollo-util ........................................... SUCCESS [6:34.732s]
[INFO] apollo-transport ...................................... SUCCESS [2:20.049s]
[INFO] apollo-dto ............................................ SUCCESS [23:20.114s]
[INFO] apollo-selector ....................................... SUCCESS [17:24.696s]
[INFO] apollo-broker ......................................... SUCCESS [2:41.724s]
[INFO] apollo-cassandra ...................................... SUCCESS [1:16.884s]
[INFO] apollo-tcp ............................................ SUCCESS [15.141s]
[INFO] apollo-web ............................................ FAILED [1:34.382s]
[INFO] apollo-hawtdb ......................................... SKIPPED (dependency build failed
or was skipped)
[INFO] apollo-bdb ............................................ SKIPPED (dependency build failed
or was skipped)
[INFO] apollo-jdbm2 .......................................... SKIPPED (dependency build failed
or was skipped)
[INFO] apollo-stomp .......................................... SKIPPED (dependency build failed
or was skipped)
[INFO] apollo-cli ............................................ SKIPPED (dependency build failed
or was skipped)
[INFO] apollo-website ........................................ FAILED [2:49.133s]
[INFO] apache-apollo ......................................... SKIPPED (dependency build failed
or was skipped)
[INFO] ------------------------------------------------------------------------
[INFO] Error for project: apollo-web (during deploy)
[INFO] ------------------------------------------------------------------------
[INFO] wrap: org.apache.commons.exec.ExecuteException: Process exited with an error: 1(Exit
value: 1)

[INFO] ------------------------------------------------------------------------
[INFO] Trace
org.apache.maven.lifecycle.LifecycleExecutionException: wrap: org.apache.commons.exec.ExecuteException:
Process exited with an error: 1(Exit value: 1)
	at org.apache.maven.lifecycle.DefaultLifecycleExecutor.executeGoals(DefaultLifecycleExecutor.java:719)
	at org.apache.maven.lifecycle.DefaultLifecycleExecutor.executeGoalWithLifecycle(DefaultLifecycleExecutor.java:556)
	at org.apache.maven.lifecycle.DefaultLifecycleExecutor.executeGoal(DefaultLifecycleExecutor.java:535)
	at org.apache.maven.lifecycle.DefaultLifecycleExecutor.executeGoalAndHandleFailures(DefaultLifecycleExecutor.java:387)
	at org.apache.maven.lifecycle.DefaultLifecycleExecutor.executeTaskSegments(DefaultLifecycleExecutor.java:348)
	at org.apache.maven.lifecycle.DefaultLifecycleExecutor.execute(DefaultLifecycleExecutor.java:180)
	at org.apache.maven.lifecycle.LifecycleExecutorInterceptor.execute(LifecycleExecutorInterceptor.java:65)
	at org.apache.maven.DefaultMaven.doExecute(DefaultMaven.java:328)
	at org.apache.maven.DefaultMaven.execute(DefaultMaven.java:138)
	at org.apache.maven.cli.MavenCli.main(MavenCli.java:362)
	at sun.reflect.NativeMethodAccessorImpl.invoke0(Native Method)
	at sun.reflect.NativeMethodAccessorImpl.invoke(NativeMethodAccessorImpl.java:39)
	at sun.reflect.DelegatingMethodAccessorImpl.invoke(DelegatingMethodAccessorImpl.java:25)
	at java.lang.reflect.Method.invoke(Method.java:597)
	at org.codehaus.classworlds.Launcher.launchEnhanced(Launcher.java:315)
	at org.codehaus.classworlds.Launcher.launch(Launcher.java:255)
	at hudson.maven.agent.Main.launch(Main.java:165)
	at hudson.maven.MavenBuilder.call(MavenBuilder.java:165)
	at hudson.maven.MavenModuleSetBuild$Builder.call(MavenModuleSetBuild.java:750)
	at hudson.maven.MavenModuleSetBuild$Builder.call(MavenModuleSetBuild.java:694)
	at hudson.remoting.UserRequest.perform(UserRequest.java:114)
	at hudson.remoting.UserRequest.perform(UserRequest.java:48)
	at hudson.remoting.Request$2.run(Request.java:270)
	at java.util.concurrent.Executors$RunnableAdapter.call(Executors.java:441)
	at java.util.concurrent.FutureTask$Sync.innerRun(FutureTask.java:303)
	at java.util.concurrent.FutureTask.run(FutureTask.java:138)
	at java.util.concurrent.ThreadPoolExecutor$Worker.runTask(ThreadPoolExecutor.java:886)
	at java.util.concurrent.ThreadPoolExecutor$Worker.run(ThreadPoolExecutor.java:908)
	at java.lang.Thread.run(Thread.java:619)
Caused by: org.apache.maven.plugin.MojoExecutionException: wrap: org.apache.commons.exec.ExecuteException:
Process exited with an error: 1(Exit value: 1)
	at org_scala_tools_maven.ScalaMojoSupport.execute(ScalaMojoSupport.java:350)
	at org.apache.maven.plugin.DefaultPluginManager.executeMojo(DefaultPluginManager.java:490)
	at hudson.maven.agent.PluginManagerInterceptor.executeMojo(PluginManagerInterceptor.java:182)
	at org.apache.maven.lifecycle.DefaultLifecycleExecutor.executeGoals(DefaultLifecycleExecutor.java:694)
	... 28 more
Caused by: org.apache.commons.exec.ExecuteException: Process exited with an error: 1(Exit
value: 1)
	at org.apache.commons.exec.DefaultExecutor.executeInternal(DefaultExecutor.java:346)
	at org.apache.commons.exec.DefaultExecutor.execute(DefaultExecutor.java:149)
	at org.apache.commons.exec.DefaultExecutor.execute(DefaultExecutor.java:136)
	at org_scala_tools_maven_executions.JavaMainCallerByFork.run(JavaMainCallerByFork.java:80)
	at org_scala_tools_maven.ScalaCompilerSupport.compile(ScalaCompilerSupport.java:124)
	at org_scala_tools_maven.ScalaCompilerSupport.doExecute(ScalaCompilerSupport.java:80)
	at org_scala_tools_maven.ScalaMojoSupport.execute(ScalaMojoSupport.java:342)
	... 31 more
[INFO] ------------------------------------------------------------------------
[INFO] Error for project: apollo-website (during deploy)
[INFO] ------------------------------------------------------------------------
[INFO] Error uploading site

Embedded error: Cannot connect. Reason: Auth fail
[INFO] ------------------------------------------------------------------------
[INFO] Trace
org.apache.maven.lifecycle.LifecycleExecutionException: Error uploading site
	at org.apache.maven.lifecycle.DefaultLifecycleExecutor.executeGoals(DefaultLifecycleExecutor.java:719)
	at org.apache.maven.lifecycle.DefaultLifecycleExecutor.executeGoalWithLifecycle(DefaultLifecycleExecutor.java:556)
	at org.apache.maven.lifecycle.DefaultLifecycleExecutor.executeGoal(DefaultLifecycleExecutor.java:535)
	at org.apache.maven.lifecycle.DefaultLifecycleExecutor.executeGoalAndHandleFailures(DefaultLifecycleExecutor.java:387)
	at org.apache.maven.lifecycle.DefaultLifecycleExecutor.executeTaskSegments(DefaultLifecycleExecutor.java:348)
	at org.apache.maven.lifecycle.DefaultLifecycleExecutor.execute(DefaultLifecycleExecutor.java:180)
	at org.apache.maven.lifecycle.LifecycleExecutorInterceptor.execute(LifecycleExecutorInterceptor.java:65)
	at org.apache.maven.DefaultMaven.doExecute(DefaultMaven.java:328)
	at org.apache.maven.DefaultMaven.execute(DefaultMaven.java:138)
	at org.apache.maven.cli.MavenCli.main(MavenCli.java:362)
	at sun.reflect.NativeMethodAccessorImpl.invoke0(Native Method)
	at sun.reflect.NativeMethodAccessorImpl.invoke(NativeMethodAccessorImpl.java:39)
	at sun.reflect.DelegatingMethodAccessorImpl.invoke(DelegatingMethodAccessorImpl.java:25)
	at java.lang.reflect.Method.invoke(Method.java:597)
	at org.codehaus.classworlds.Launcher.launchEnhanced(Launcher.java:315)
	at org.codehaus.classworlds.Launcher.launch(Launcher.java:255)
	at hudson.maven.agent.Main.launch(Main.java:165)
	at hudson.maven.MavenBuilder.call(MavenBuilder.java:165)
	at hudson.maven.MavenModuleSetBuild$Builder.call(MavenModuleSetBuild.java:750)
	at hudson.maven.MavenModuleSetBuild$Builder.call(MavenModuleSetBuild.java:694)
	at hudson.remoting.UserRequest.perform(UserRequest.java:114)
	at hudson.remoting.UserRequest.perform(UserRequest.java:48)
	at hudson.remoting.Request$2.run(Request.java:270)
	at java.util.concurrent.Executors$RunnableAdapter.call(Executors.java:441)
	at java.util.concurrent.FutureTask$Sync.innerRun(FutureTask.java:303)
	at java.util.concurrent.FutureTask.run(FutureTask.java:138)
	at java.util.concurrent.ThreadPoolExecutor$Worker.runTask(ThreadPoolExecutor.java:886)
	at java.util.concurrent.ThreadPoolExecutor$Worker.run(ThreadPoolExecutor.java:908)
	at java.lang.Thread.run(Thread.java:619)
Caused by: org.apache.maven.plugin.MojoExecutionException: Error uploading site
	at org.fusesource.scalate.maven.SiteDeployMojo.execute(SiteDeployMojo.java:251)
	at org.apache.maven.plugin.DefaultPluginManager.executeMojo(DefaultPluginManager.java:490)
	at hudson.maven.agent.PluginManagerInterceptor.executeMojo(PluginManagerInterceptor.java:182)
	at org.apache.maven.lifecycle.DefaultLifecycleExecutor.executeGoals(DefaultLifecycleExecutor.java:694)
	... 28 more
Caused by: org.apache.maven.wagon.authentication.AuthenticationException: Cannot connect.
Reason: Auth fail
	at org.apache.maven.wagon.providers.ssh.jsch.AbstractJschWagon.openConnectionInternal(AbstractJschWagon.java:264)
	at org.apache.maven.wagon.AbstractWagon.openConnection(AbstractWagon.java:105)
	at org.apache.maven.wagon.AbstractWagon.connect(AbstractWagon.java:207)
	at org.apache.maven.wagon.AbstractWagon.connect(AbstractWagon.java:142)
	at org.fusesource.scalate.maven.SiteDeployMojo.execute(SiteDeployMojo.java:233)
	... 31 more
Caused by: com.jcraft.jsch.JSchException: Auth fail
	at com.jcraft.jsch.Session.connect(Session.java:451)
	at com.jcraft.jsch.Session.connect(Session.java:149)
	at org.apache.maven.wagon.providers.ssh.jsch.AbstractJschWagon.openConnectionInternal(AbstractJschWagon.java:236)
	... 35 more
[INFO] ------------------------------------------------------------------------
[INFO] BUILD ERRORS
[INFO] ------------------------------------------------------------------------
[INFO] Total time: 86 minutes 50 seconds
[INFO] Finished at: Mon Jan 03 21:30:56 PST 2011
[INFO] Final Memory: 143M/961M
[INFO] ------------------------------------------------------------------------


Mime
View raw message