activemq-dev mailing list archives

Site index · List index
Message view « Date » · « Thread »
Top « Date » · « Thread »
From Apache Hudson Server <hud...@hudson.apache.org>
Subject Build failed in Hudson: ActiveMQ Protocol Buffer #12
Date Thu, 06 Jan 2011 19:27:04 GMT
See <https://hudson.apache.org/hudson/job/ActiveMQ%20Protocol%20Buffer/12/>

------------------------------------------
[...truncated 527 lines...]
Downloading: http://repo1.maven.org/maven2/org/apache/maven/doxia/doxia-module-xhtml/1.0-alpha-10/doxia-module-xhtml-1.0-alpha-10.jar
Downloading: http://repo1.maven.org/maven2/org/apache/maven/plugin-tools/maven-plugin-tools-api/2.5/maven-plugin-tools-api-2.5.jar
Downloading: http://repo1.maven.org/maven2/jtidy/jtidy/4aug2000r7-dev/jtidy-4aug2000r7-dev.jar
Downloading: http://repo1.maven.org/maven2/org/apache/maven/reporting/maven-reporting-impl/2.0.4.1/maven-reporting-impl-2.0.4.1.jar
Downloading: http://repo1.maven.org/maven2/org/apache/maven/plugin-tools/maven-plugin-tools-java/2.5/maven-plugin-tools-java-2.5.jar
Downloading: http://repo1.maven.org/maven2/ant/ant/1.5.1/ant-1.5.1.jar
Downloading: http://repo1.maven.org/maven2/jmock/jmock/1.0.0/jmock-1.0.0.jar
Downloading: http://repo1.maven.org/maven2/org/apache/maven/plugin-tools/maven-plugin-tools-beanshell/2.5/maven-plugin-tools-beanshell-2.5.jar
Downloading: http://repo1.maven.org/maven2/bsh/bsh/1.3.0/bsh-1.3.0.jar
[INFO] [plugin:descriptor]
[INFO] Using 'UTF-8' encoding to read mojo metadata.
[INFO] Applying mojo extractor for language: java
[INFO] Mojo extractor for language: java found 1 mojo descriptors.
[INFO] Applying mojo extractor for language: bsh
[INFO] Mojo extractor for language: bsh found 0 mojo descriptors.
[INFO] [remote-resources:process {execution: default}]
[INFO] inceptionYear not specified, defaulting to 2011
Downloading: http://repo1.maven.org/maven2/org/apache/maven/shared/maven-filtering/1.0-beta-2/maven-filtering-1.0-beta-2.pom
Downloading: http://repo1.maven.org/maven2/org/apache/maven/maven-core/2.0.6/maven-core-2.0.6.pom
Downloading: http://repo1.maven.org/maven2/org/apache/maven/maven-plugin-parameter-documenter/2.0.6/maven-plugin-parameter-documenter-2.0.6.pom
Downloading: http://repo1.maven.org/maven2/org/apache/maven/maven-error-diagnostics/2.0.6/maven-error-diagnostics-2.0.6.pom
Downloading: http://repo1.maven.org/maven2/org/apache/maven/maven-monitor/2.0.6/maven-monitor-2.0.6.pom
Downloading: http://repo1.maven.org/maven2/org/codehaus/plexus/plexus-interpolation/1.6/plexus-interpolation-1.6.pom
Downloading: http://repo1.maven.org/maven2/org/apache/maven/shared/maven-filtering/1.0-beta-2/maven-filtering-1.0-beta-2.jar
Downloading: http://repo1.maven.org/maven2/org/codehaus/plexus/plexus-interpolation/1.6/plexus-interpolation-1.6.jar
[INFO] [resources:resources]
[INFO] Using 'UTF-8' encoding to copy filtered resources.
[INFO] Copying 0 resource
[INFO] Copying 3 resources
Downloading: http://repo1.maven.org/maven2/org/codehaus/plexus/plexus-compiler-api/1.5.3/plexus-compiler-api-1.5.3.pom
Downloading: http://repo1.maven.org/maven2/org/codehaus/plexus/plexus-compiler/1.5.3/plexus-compiler-1.5.3.pom
Downloading: http://repo1.maven.org/maven2/org/codehaus/plexus/plexus-compiler-manager/1.5.3/plexus-compiler-manager-1.5.3.pom
Downloading: http://repo1.maven.org/maven2/org/codehaus/plexus/plexus-compiler-javac/1.5.3/plexus-compiler-javac-1.5.3.pom
Downloading: http://repo1.maven.org/maven2/org/codehaus/plexus/plexus-compilers/1.5.3/plexus-compilers-1.5.3.pom
Downloading: http://repo1.maven.org/maven2/org/codehaus/plexus/plexus-utils/1.0.5/plexus-utils-1.0.5.pom
Downloading: http://repo1.maven.org/maven2/org/codehaus/plexus/plexus-compiler-api/1.5.3/plexus-compiler-api-1.5.3.jar
Downloading: http://repo1.maven.org/maven2/org/codehaus/plexus/plexus-compiler-manager/1.5.3/plexus-compiler-manager-1.5.3.jar
Downloading: http://repo1.maven.org/maven2/org/codehaus/plexus/plexus-compiler-javac/1.5.3/plexus-compiler-javac-1.5.3.jar
[INFO] [compiler:compile]
[INFO] Compiling 41 source files to <https://hudson.apache.org/hudson/job/ActiveMQ%20Protocol%20Buffer/ws/trunk/activemq-protobuf/target/classes>
[INFO] [resources:testResources]
[INFO] Using 'UTF-8' encoding to copy filtered resources.
[INFO] skip non existing resourceDirectory <https://hudson.apache.org/hudson/job/ActiveMQ%20Protocol%20Buffer/ws/trunk/activemq-protobuf/src/test/resources>
[INFO] Copying 3 resources
[INFO] [compiler:testCompile]
[INFO] Nothing to compile - all classes are up to date
Downloading: http://repo1.maven.org/maven2/org/apache/maven/surefire/surefire-booter/2.4.3/surefire-booter-2.4.3.pom
Downloading: http://repo1.maven.org/maven2/org/apache/maven/surefire/surefire-api/2.4.3/surefire-api-2.4.3.pom
Downloading: http://repo1.maven.org/maven2/org/apache/maven/maven-toolchain/1.0/maven-toolchain-1.0.pom
Downloading: http://repo1.maven.org/maven2/org/apache/maven/surefire/surefire-booter/2.4.3/surefire-booter-2.4.3.jar
Downloading: http://repo1.maven.org/maven2/org/apache/maven/surefire/surefire-api/2.4.3/surefire-api-2.4.3.jar
[INFO] [surefire:test]
Downloading: http://repo1.maven.org/maven2/org/apache/maven/surefire/surefire-junit4/2.4.3/surefire-junit4-2.4.3.pom
Downloading: http://repo1.maven.org/maven2/org/apache/maven/surefire/surefire-providers/2.4.3/surefire-providers-2.4.3.pom
Downloading: http://repo1.maven.org/maven2/junit/junit/4.0/junit-4.0.pom
Downloading: http://repo1.maven.org/maven2/org/apache/maven/surefire/surefire-junit4/2.4.3/surefire-junit4-2.4.3.jar
Downloading: http://repo1.maven.org/maven2/junit/junit/4.0/junit-4.0.jar
[INFO] Surefire report directory: <https://hudson.apache.org/hudson/job/ActiveMQ%20Protocol%20Buffer/ws/trunk/activemq-protobuf/target/surefire-reports>

-------------------------------------------------------
 T E S T S
-------------------------------------------------------
There are no tests to run.

Results :

Tests run: 0, Failures: 0, Errors: 0, Skipped: 0

[HUDSON] Recording test resultsDownloading: http://repo1.maven.org/maven2/org/apache/maven/maven-project/2.0.7/maven-project-2.0.7.pom

Downloading: http://repo1.maven.org/maven2/org/apache/maven/maven/2.0.7/maven-2.0.7.pom
Downloading: http://repo1.maven.org/maven2/org/apache/maven/maven-settings/2.0.7/maven-settings-2.0.7.pom
Downloading: http://repo1.maven.org/maven2/org/apache/maven/maven-model/2.0.7/maven-model-2.0.7.pom
Downloading: http://repo1.maven.org/maven2/org/apache/maven/maven-profile/2.0.7/maven-profile-2.0.7.pom
Downloading: http://repo1.maven.org/maven2/org/apache/maven/maven-artifact-manager/2.0.7/maven-artifact-manager-2.0.7.pom
Downloading: http://repo1.maven.org/maven2/org/apache/maven/maven-repository-metadata/2.0.7/maven-repository-metadata-2.0.7.pom
Downloading: http://repo1.maven.org/maven2/org/apache/maven/maven-artifact/2.0.7/maven-artifact-2.0.7.pom
Downloading: http://repo1.maven.org/maven2/org/apache/maven/maven-plugin-registry/2.0.7/maven-plugin-registry-2.0.7.pom
Downloading: http://repo1.maven.org/maven2/org/apache/maven/maven-archiver/2.3/maven-archiver-2.3.pom
Downloading: http://repo1.maven.org/maven2/org/codehaus/plexus/plexus-archiver/1.0-alpha-9/plexus-archiver-1.0-alpha-9.pom
Downloading: http://repo1.maven.org/maven2/org/codehaus/plexus/plexus-components/1.1.9/plexus-components-1.1.9.pom
Downloading: http://repo1.maven.org/maven2/org/codehaus/plexus/plexus-container-default/1.0-alpha-15/plexus-container-default-1.0-alpha-15.pom
Downloading: http://repo1.maven.org/maven2/org/codehaus/plexus/plexus-containers/1.0-alpha-15/plexus-containers-1.0-alpha-15.pom
Downloading: http://repo1.maven.org/maven2/org/codehaus/plexus/plexus/1.0.9/plexus-1.0.9.pom
Downloading: http://repo1.maven.org/maven2/org/codehaus/plexus/plexus-component-api/1.0-alpha-15/plexus-component-api-1.0-alpha-15.pom
Downloading: http://repo1.maven.org/maven2/org/codehaus/plexus/plexus-classworlds/1.2-alpha-6/plexus-classworlds-1.2-alpha-6.pom
Downloading: http://repo1.maven.org/maven2/org/codehaus/plexus/plexus-io/1.0-alpha-1/plexus-io-1.0-alpha-1.pom
Downloading: http://repo1.maven.org/maven2/org/codehaus/plexus/plexus-component-api/1.0-alpha-16/plexus-component-api-1.0-alpha-16.pom
Downloading: http://repo1.maven.org/maven2/org/codehaus/plexus/plexus-containers/1.0-alpha-16/plexus-containers-1.0-alpha-16.pom
Downloading: http://repo1.maven.org/maven2/org/codehaus/plexus/plexus-utils/1.4.9/plexus-utils-1.4.9.pom
Downloading: http://repo1.maven.org/maven2/org/codehaus/plexus/plexus-utils/1.4.9/plexus-utils-1.4.9.jar
Downloading: http://repo1.maven.org/maven2/org/apache/maven/maven-archiver/2.3/maven-archiver-2.3.jar
Downloading: http://repo1.maven.org/maven2/org/codehaus/plexus/plexus-archiver/1.0-alpha-9/plexus-archiver-1.0-alpha-9.jar
Downloading: http://repo1.maven.org/maven2/org/codehaus/plexus/plexus-io/1.0-alpha-1/plexus-io-1.0-alpha-1.jar
[INFO] [jar:jar]
[INFO] Building jar: <https://hudson.apache.org/hudson/job/ActiveMQ%20Protocol%20Buffer/ws/trunk/activemq-protobuf/target/activemq-protobuf-1.2-SNAPSHOT.jar>
[INFO] [plugin:addPluginArtifactMetadata]
[INFO] [ianal:verify-legal-files {execution: default}]
[INFO] Checking legal files in: activemq-protobuf-1.2-SNAPSHOT.jar
[INFO] [install:install]
[INFO] Installing <https://hudson.apache.org/hudson/job/ActiveMQ%20Protocol%20Buffer/ws/trunk/activemq-protobuf/target/activemq-protobuf-1.2-SNAPSHOT.jar>
to <https://hudson.apache.org/hudson/job/ActiveMQ%20Protocol%20Buffer/ws/.repository/org/apache/activemq/protobuf/activemq-protobuf/1.2-SNAPSHOT/activemq-protobuf-1.2-SNAPSHOT.jar>
[INFO] [plugin:updateRegistry]
[HUDSON] Archiving <https://hudson.apache.org/hudson/job/ActiveMQ%20Protocol%20Buffer/ws/trunk/activemq-protobuf/pom.xml>
to /home/hudson/hudson/jobs/ActiveMQ Protocol Buffer/modules/org.apache.activemq.protobuf$activemq-protobuf/builds/2011-01-06_19-11-04/archive/org.apache.activemq.protobuf/activemq-protobuf/1.2-SNAPSHOT/pom.xml
[HUDSON] Archiving <https://hudson.apache.org/hudson/job/ActiveMQ%20Protocol%20Buffer/ws/trunk/activemq-protobuf/target/activemq-protobuf-1.2-SNAPSHOT.jar>
to /home/hudson/hudson/jobs/ActiveMQ Protocol Buffer/modules/org.apache.activemq.protobuf$activemq-protobuf/builds/2011-01-06_19-11-04/archive/org.apache.activemq.protobuf/activemq-protobuf/1.2-SNAPSHOT/activemq-protobuf-1.2-SNAPSHOT.jar
[INFO] ------------------------------------------------------------------------
[INFO] Building ActiveMQ Protocol Buffers Tests
[INFO]    task-segment: [clean, install]
[INFO] ------------------------------------------------------------------------
[INFO] [clean:clean]
[INFO] snapshot org.apache.activemq.protobuf:activemq-protobuf:1.2-SNAPSHOT: checking for
updates from apache.snapshots
[WARNING] repository metadata for: 'snapshot org.apache.activemq.protobuf:activemq-protobuf:1.2-SNAPSHOT'
could not be retrieved from repository: apache.snapshots due to an error: Error transferring
file
[INFO] Repository 'apache.snapshots' will be blacklisted
[INFO] [enforcer:enforce {execution: default}]
[INFO] [activemq-protobuf:compile {execution: default}]
[INFO] Compiling: <https://hudson.apache.org/hudson/job/ActiveMQ%20Protocol%20Buffer/ws/trunk/activemq-protobuf-test/src/main/proto/unittest_mset.proto>
[INFO] Compiling: <https://hudson.apache.org/hudson/job/ActiveMQ%20Protocol%20Buffer/ws/trunk/activemq-protobuf-test/src/main/proto/unittest.proto>
[INFO] Compiling: <https://hudson.apache.org/hudson/job/ActiveMQ%20Protocol%20Buffer/ws/trunk/activemq-protobuf-test/src/main/proto/unittest_optimize_for.proto>
[INFO] Compiling: <https://hudson.apache.org/hudson/job/ActiveMQ%20Protocol%20Buffer/ws/trunk/activemq-protobuf-test/src/main/proto/multiple_files_test.proto>
[INFO] Compiling: <https://hudson.apache.org/hudson/job/ActiveMQ%20Protocol%20Buffer/ws/trunk/activemq-protobuf-test/src/main/proto/unittest_import.proto>
[INFO] Compiling: <https://hudson.apache.org/hudson/job/ActiveMQ%20Protocol%20Buffer/ws/trunk/activemq-protobuf-test/src/main/proto/unittest_embed_optimize_for.proto>
[INFO] Compiling: <https://hudson.apache.org/hudson/job/ActiveMQ%20Protocol%20Buffer/ws/trunk/activemq-protobuf-test/src/main/proto/deferred_decode.proto>
[INFO] [remote-resources:process {execution: default}]
[INFO] inceptionYear not specified, defaulting to 2011
[INFO] [resources:resources]
[INFO] Using 'UTF-8' encoding to copy filtered resources.
[INFO] skip non existing resourceDirectory <https://hudson.apache.org/hudson/job/ActiveMQ%20Protocol%20Buffer/ws/trunk/activemq-protobuf-test/src/main/resources>
[INFO] Copying 3 resources
[INFO] [compiler:compile]
[INFO] Compiling 8 source files to <https://hudson.apache.org/hudson/job/ActiveMQ%20Protocol%20Buffer/ws/trunk/activemq-protobuf-test/target/classes>
[WARNING] <https://hudson.apache.org/hudson/job/ActiveMQ%20Protocol%20Buffer/ws/trunk/activemq-protobuf-test/target/generated-sources/proto/protobuf_unittest/UnittestProto.java>:[5120,67]
[deprecation] Buffer(java.lang.String) in org.apache.activemq.protobuf.Buffer has been deprecated

[WARNING] <https://hudson.apache.org/hudson/job/ActiveMQ%20Protocol%20Buffer/ws/trunk/activemq-protobuf-test/target/generated-sources/proto/protobuf_unittest/UnittestProto.java>:[5141,31]
[deprecation] Buffer(java.lang.String) in org.apache.activemq.protobuf.Buffer has been deprecated

[WARNING] <https://hudson.apache.org/hudson/job/ActiveMQ%20Protocol%20Buffer/ws/trunk/activemq-protobuf-test/target/generated-sources/proto/protobuf_unittest/UnittestProto.java>:[11493,67]
[deprecation] Buffer(java.lang.String) in org.apache.activemq.protobuf.Buffer has been deprecated

[WARNING] <https://hudson.apache.org/hudson/job/ActiveMQ%20Protocol%20Buffer/ws/trunk/activemq-protobuf-test/target/generated-sources/proto/protobuf_unittest/UnittestProto.java>:[11514,31]
[deprecation] Buffer(java.lang.String) in org.apache.activemq.protobuf.Buffer has been deprecated

[INFO] [resources:testResources]
[INFO] Using 'UTF-8' encoding to copy filtered resources.
[INFO] skip non existing resourceDirectory <https://hudson.apache.org/hudson/job/ActiveMQ%20Protocol%20Buffer/ws/trunk/activemq-protobuf-test/src/test/resources>
[INFO] Copying 3 resources
[INFO] [compiler:testCompile]
[INFO] Compiling 6 source files to <https://hudson.apache.org/hudson/job/ActiveMQ%20Protocol%20Buffer/ws/trunk/activemq-protobuf-test/target/test-classes>
[WARNING] <https://hudson.apache.org/hudson/job/ActiveMQ%20Protocol%20Buffer/ws/trunk/activemq-protobuf-test/src/test/java/com/google/protobuf/TestUtil.java>:[732,28]
[deprecation] toStringUtf8() in org.apache.activemq.protobuf.Buffer has been deprecated

[INFO] [surefire:test]
[INFO] Surefire report directory: <https://hudson.apache.org/hudson/job/ActiveMQ%20Protocol%20Buffer/ws/trunk/activemq-protobuf-test/target/surefire-reports>

-------------------------------------------------------
 T E S T S
-------------------------------------------------------
Running org.apache.activemq.protobuf.DeferredUnmarshalTest
Tests run: 1, Failures: 0, Errors: 0, Skipped: 0, Time elapsed: 0.031 sec
Running com.google.protobuf.GeneratedMessageTest
Tests run: 7, Failures: 0, Errors: 0, Skipped: 0, Time elapsed: 0.028 sec
Running org.apache.activemq.protobuf.EqualsTest
Tests run: 1, Failures: 0, Errors: 0, Skipped: 0, Time elapsed: 0.005 sec
Running com.google.protobuf.WireFormatTest
Tests run: 1, Failures: 0, Errors: 0, Skipped: 0, Time elapsed: 0.006 sec
Running com.google.protobuf.MessageTest
Tests run: 4, Failures: 0, Errors: 0, Skipped: 0, Time elapsed: 0.011 sec

Results :

Tests run: 14, Failures: 0, Errors: 0, Skipped: 0

[HUDSON] Recording test results
[INFO] [jar:jar]
[INFO] Building jar: <https://hudson.apache.org/hudson/job/ActiveMQ%20Protocol%20Buffer/ws/trunk/activemq-protobuf-test/target/activemq-protobuf-test-1.2-SNAPSHOT.jar>
[INFO] [ianal:verify-legal-files {execution: default}]
[INFO] Checking legal files in: activemq-protobuf-test-1.2-SNAPSHOT.jar
[INFO] [install:install]
[INFO] Installing <https://hudson.apache.org/hudson/job/ActiveMQ%20Protocol%20Buffer/ws/trunk/activemq-protobuf-test/target/activemq-protobuf-test-1.2-SNAPSHOT.jar>
to <https://hudson.apache.org/hudson/job/ActiveMQ%20Protocol%20Buffer/ws/.repository/org/apache/activemq/protobuf/activemq-protobuf-test/1.2-SNAPSHOT/activemq-protobuf-test-1.2-SNAPSHOT.jar>
[HUDSON] Archiving <https://hudson.apache.org/hudson/job/ActiveMQ%20Protocol%20Buffer/ws/trunk/activemq-protobuf-test/pom.xml>
to /home/hudson/hudson/jobs/ActiveMQ Protocol Buffer/modules/org.apache.activemq.protobuf$activemq-protobuf-test/builds/2011-01-06_19-11-04/archive/org.apache.activemq.protobuf/activemq-protobuf-test/1.2-SNAPSHOT/pom.xml
[HUDSON] Archiving <https://hudson.apache.org/hudson/job/ActiveMQ%20Protocol%20Buffer/ws/trunk/activemq-protobuf-test/target/activemq-protobuf-test-1.2-SNAPSHOT.jar>
to /home/hudson/hudson/jobs/ActiveMQ Protocol Buffer/modules/org.apache.activemq.protobuf$activemq-protobuf-test/builds/2011-01-06_19-11-04/archive/org.apache.activemq.protobuf/activemq-protobuf-test/1.2-SNAPSHOT/activemq-protobuf-test-1.2-SNAPSHOT.jar
[INFO] 
[INFO] 
[INFO] ------------------------------------------------------------------------
[INFO] Reactor Summary:
[INFO] ------------------------------------------------------------------------
[INFO] ActiveMQ Protocol Buffers POM ......................... SUCCESS [5:54.133s]
[INFO] ActiveMQ Protocol Buffers Implementation and Compiler . SUCCESS [2:55.837s]
[INFO] ActiveMQ Protocol Buffers Tests ....................... SUCCESS [56.423s]
[INFO] ------------------------------------------------------------------------
[INFO] ------------------------------------------------------------------------
[INFO] BUILD SUCCESSFUL
[INFO] ------------------------------------------------------------------------
[INFO] Total time: 10 minutes 42 seconds
[INFO] Finished at: Thu Jan 06 19:24:21 GMT+00:00 2011
[INFO] Final Memory: 40M/1040M
[INFO] ------------------------------------------------------------------------
channel stopped
Deploying artifacts to https://repository.apache.org/content/repositories/snapshots
Deploying the main artifact activemq-protobuf-1.2-SNAPSHOT.jar
[INFO ] Retrieving previous build number from apache.snapshots.https
[INFO ] Retrieving previous metadata from apache.snapshots.https
[INFO ] Uploading repository metadata for: 'artifact org.apache.activemq.protobuf:activemq-protobuf'
[INFO ] Retrieving previous metadata from apache.snapshots.https
[INFO ] Uploading repository metadata for: 'snapshot org.apache.activemq.protobuf:activemq-protobuf:1.2-SNAPSHOT'
[INFO ] Uploading project information for activemq-protobuf 1.2-SNAPSHOT
Deploying the main artifact pom.xml
[INFO ] Retrieving previous build number from apache.snapshots.https
[INFO ] Retrieving previous metadata from apache.snapshots.https
[INFO ] Uploading repository metadata for: 'snapshot org.apache.activemq.protobuf:activemq-protobuf-pom:1.2-SNAPSHOT'
[INFO ] Uploading project information for activemq-protobuf-pom 1.2-SNAPSHOT
[INFO ] Retrieving previous metadata from apache.snapshots.https
[INFO ] Uploading repository metadata for: 'artifact org.apache.activemq.protobuf:activemq-protobuf-pom'
Deploying the main artifact activemq-protobuf-test-1.2-SNAPSHOT.jar
[INFO ] Retrieving previous build number from apache.snapshots.https
ERROR: Error deploying artifact: Error transferring file
org.apache.maven.artifact.deployer.ArtifactDeploymentException: Error deploying artifact:
Error transferring file
	at org.apache.maven.artifact.deployer.DefaultArtifactDeployer.deploy(DefaultArtifactDeployer.java:94)
	at hudson.maven.reporters.MavenArtifactRecord.deploy(MavenArtifactRecord.java:119)
	at hudson.maven.reporters.MavenAggregatedArtifactRecord.deploy(MavenAggregatedArtifactRecord.java:79)
	at hudson.maven.RedeployPublisher.perform(RedeployPublisher.java:118)
	at hudson.tasks.BuildStepMonitor$1.perform(BuildStepMonitor.java:19)
	at hudson.model.AbstractBuild$AbstractRunner.perform(AbstractBuild.java:601)
	at hudson.model.AbstractBuild$AbstractRunner.performAllBuildSteps(AbstractBuild.java:580)
	at hudson.maven.MavenModuleSetBuild$RunnerImpl.post2(MavenModuleSetBuild.java:651)
	at hudson.model.AbstractBuild$AbstractRunner.post(AbstractBuild.java:528)
	at hudson.model.Run.run(Run.java:1348)
	at hudson.maven.MavenModuleSetBuild.run(MavenModuleSetBuild.java:349)
	at hudson.model.ResourceController.execute(ResourceController.java:88)
	at hudson.model.Executor.run(Executor.java:139)
Caused by: org.apache.maven.wagon.TransferFailedException: Error transferring file
	at org.apache.maven.wagon.providers.http.LightweightHttpWagon.put(LightweightHttpWagon.java:178)
	at org.apache.maven.artifact.manager.DefaultWagonManager.putRemoteFile(DefaultWagonManager.java:244)
	at org.apache.maven.artifact.manager.DefaultWagonManager.putArtifact(DefaultWagonManager.java:160)
	at org.apache.maven.artifact.deployer.DefaultArtifactDeployer.deploy(DefaultArtifactDeployer.java:80)
	... 12 more
Caused by: java.net.ConnectException: Connection refused
	at java.net.PlainSocketImpl.socketConnect(Native Method)
	at java.net.PlainSocketImpl.doConnect(PlainSocketImpl.java:333)
	at java.net.PlainSocketImpl.connectToAddress(PlainSocketImpl.java:195)
	at java.net.PlainSocketImpl.connect(PlainSocketImpl.java:182)
	at java.net.SocksSocketImpl.connect(SocksSocketImpl.java:366)
	at java.net.Socket.connect(Socket.java:529)
	at com.sun.net.ssl.internal.ssl.SSLSocketImpl.connect(SSLSocketImpl.java:559)
	at com.sun.net.ssl.internal.ssl.BaseSSLSocketImpl.connect(BaseSSLSocketImpl.java:141)
	at sun.net.NetworkClient.doConnect(NetworkClient.java:163)
	at sun.net.www.http.HttpClient.openServer(HttpClient.java:394)
	at sun.net.www.http.HttpClient.openServer(HttpClient.java:529)
	at sun.net.www.http.HttpClient.parseHTTPHeader(HttpClient.java:760)
	at sun.net.www.http.HttpClient.parseHTTP(HttpClient.java:632)
	at sun.net.www.protocol.http.HttpURLConnection.getInputStream(HttpURLConnection.java:1200)
	at java.net.HttpURLConnection.getResponseCode(HttpURLConnection.java:379)
	at sun.net.www.protocol.https.HttpsURLConnectionImpl.getResponseCode(HttpsURLConnectionImpl.java:318)
	at org.apache.maven.wagon.providers.http.LightweightHttpWagon.put(LightweightHttpWagon.java:153)
	... 15 more


Mime
View raw message