activemq-dev mailing list archives

Site index · List index
Message view « Date » · « Thread »
Top « Date » · « Thread »
From Apache Hudson Server <hud...@hudson.apache.org>
Subject Build failed in Hudson: ActiveMQ-Apollo-Deploy » apollo-web #37
Date Tue, 04 Jan 2011 05:31:01 GMT
See <https://hudson.apache.org/hudson/job/ActiveMQ-Apollo-Deploy/org.apache.activemq$apollo-web/37/changes>

Changes:

[chirino] updated queue to use "swap in/swap out" terminology instead of "load/flush" extended
that into the DTO class too.

extracted the queue metrics into it's own DTO object and also added an aggregate version to
collect stats from multiple queues at the virtual host and broker levels.

[chirino] Fix back link on connections.

[chirino] add rest action to support shutting down connections. changed broker shutdown url
to be consistent /w it.

[chirino] Used friendlier uptime formatting.

------------------------------------------
[...truncated 94 lines...]
[INFO] Unable to find resource 'org.apache.maven.plugins:maven-war-plugin:pom:2.1-alpha-2'
in repository scala (http://scala-tools.org/repo-releases)
Downloading: http://scala-tools.org/repo-snapshots/org/apache/maven/plugins/maven-war-plugin/2.1-alpha-2/maven-war-plugin-2.1-alpha-2.pom
[INFO] Unable to find resource 'org.apache.maven.plugins:maven-war-plugin:pom:2.1-alpha-2'
in repository snapshots.scala-tools.org (http://scala-tools.org/repo-snapshots)
Downloading: http://repo.fusesource.com/nexus/content/repositories/snapshots/org/apache/maven/plugins/maven-war-plugin/2.1-alpha-2/maven-war-plugin-2.1-alpha-2.pom
[INFO] Unable to find resource 'org.apache.maven.plugins:maven-war-plugin:pom:2.1-alpha-2'
in repository fusesource.snapshots (http://repo.fusesource.com/nexus/content/repositories/snapshots)
Downloading: http://repo1.maven.org/maven2/org/apache/maven/plugins/maven-war-plugin/2.1-alpha-2/maven-war-plugin-2.1-alpha-2.pom

Downloading: http://repo.open.iona.com/maven2/org/apache/maven/plugins/maven-war-plugin/2.1-alpha-2/maven-war-plugin-2.1-alpha-2.jar
[INFO] Unable to find resource 'org.apache.maven.plugins:maven-war-plugin:maven-plugin:2.1-alpha-2'
in repository open.iona.m2 (http://repo.open.iona.com/maven2)
Downloading: http://download.java.net/maven/2/org/apache/maven/plugins/maven-war-plugin/2.1-alpha-2/maven-war-plugin-2.1-alpha-2.jar
[INFO] Unable to find resource 'org.apache.maven.plugins:maven-war-plugin:maven-plugin:2.1-alpha-2'
in repository maven2-repository.dev.java.net (http://download.java.net/maven/2)
Downloading: http://scala-tools.org/repo-releases/org/apache/maven/plugins/maven-war-plugin/2.1-alpha-2/maven-war-plugin-2.1-alpha-2.jar
[INFO] Unable to find resource 'org.apache.maven.plugins:maven-war-plugin:maven-plugin:2.1-alpha-2'
in repository scala (http://scala-tools.org/repo-releases)
Downloading: http://scala-tools.org/repo-snapshots/org/apache/maven/plugins/maven-war-plugin/2.1-alpha-2/maven-war-plugin-2.1-alpha-2.jar
[INFO] Unable to find resource 'org.apache.maven.plugins:maven-war-plugin:maven-plugin:2.1-alpha-2'
in repository snapshots.scala-tools.org (http://scala-tools.org/repo-snapshots)
Downloading: http://repo.fusesource.com/nexus/content/repositories/snapshots/org/apache/maven/plugins/maven-war-plugin/2.1-alpha-2/maven-war-plugin-2.1-alpha-2.jar
[INFO] Unable to find resource 'org.apache.maven.plugins:maven-war-plugin:maven-plugin:2.1-alpha-2'
in repository fusesource.snapshots (http://repo.fusesource.com/nexus/content/repositories/snapshots)
Downloading: http://repo1.maven.org/maven2/org/apache/maven/plugins/maven-war-plugin/2.1-alpha-2/maven-war-plugin-2.1-alpha-2.jar

Downloading: http://repo1.maven.org/maven2/org/fusesource/scalate/scalate-core/1.3.2/scalate-core-1.3.2.pom

Downloading: http://repo1.maven.org/maven2/org/fusesource/scalate/scalate-util/1.3.2/scalate-util-1.3.2.pom

Downloading: http://repo1.maven.org/maven2/org/slf4j/slf4j-api/1.6.1/slf4j-api-1.6.1.pom

Downloading: http://repo1.maven.org/maven2/org/slf4j/slf4j-parent/1.6.1/slf4j-parent-1.6.1.pom

Downloading: http://repo1.maven.org/maven2/org/scala-lang/scala-compiler/2.8.0/scala-compiler-2.8.0.pom

Downloading: http://repo1.maven.org/maven2/com/sun/jersey/jersey-server/1.5-ea03/jersey-server-1.5-ea03.pom
[INFO] Unable to find resource 'com.sun.jersey:jersey-server:pom:1.5-ea03' in repository repo1.maven
(http://repo1.maven.org/maven2)
Downloading: http://repo.fusesource.com/maven2/com/sun/jersey/jersey-server/1.5-ea03/jersey-server-1.5-ea03.pom
[INFO] Unable to find resource 'com.sun.jersey:jersey-server:pom:1.5-ea03' in repository fusesource.m2
(http://repo.fusesource.com/maven2)
Downloading: http://download.java.net/maven/2/com/sun/jersey/jersey-server/1.5-ea03/jersey-server-1.5-ea03.pom
10K downloaded  (jersey-server-1.5-ea03.pom)
Downloading: http://maven.glassfish.org/content/groups/glassfish/com/sun/jersey/jersey-project/1.5-ea03/jersey-project-1.5-ea03.pom
11K downloaded  (jersey-project-1.5-ea03.pom)
Downloading: http://repo1.maven.org/maven2/com/sun/jersey/jersey-core/1.5-ea03/jersey-core-1.5-ea03.pom
[INFO] Unable to find resource 'com.sun.jersey:jersey-core:pom:1.5-ea03' in repository repo1.maven
(http://repo1.maven.org/maven2)
Downloading: http://repo.fusesource.com/maven2/com/sun/jersey/jersey-core/1.5-ea03/jersey-core-1.5-ea03.pom
[INFO] Unable to find resource 'com.sun.jersey:jersey-core:pom:1.5-ea03' in repository fusesource.m2
(http://repo.fusesource.com/maven2)
Downloading: http://download.java.net/maven/2/com/sun/jersey/jersey-core/1.5-ea03/jersey-core-1.5-ea03.pom
9K downloaded  (jersey-core-1.5-ea03.pom)
Downloading: http://repo1.maven.org/maven2/asm/asm/3.1/asm-3.1.pom

Downloading: http://repo1.maven.org/maven2/asm/asm-parent/3.1/asm-parent-3.1.pom

Downloading: http://repo1.maven.org/maven2/javax/servlet/servlet-api/2.5/servlet-api-2.5.pom

Downloading: http://repo1.maven.org/maven2/org/codehaus/jackson/jackson-jaxrs/1.6.1/jackson-jaxrs-1.6.1.pom

Downloading: http://repo1.maven.org/maven2/org/codehaus/jackson/jackson-xc/1.6.1/jackson-xc-1.6.1.pom

Downloading: http://repo1.maven.org/maven2/org/eclipse/jetty/aggregate/jetty-all-server/7.1.6.v20100715/jetty-all-server-7.1.6.v20100715.pom

Downloading: http://repo1.maven.org/maven2/org/eclipse/jetty/aggregate/jetty-aggregate-project/7.1.6.v20100715/jetty-aggregate-project-7.1.6.v20100715.pom

Downloading: http://repo1.maven.org/maven2/org/eclipse/jetty/jetty-project/7.1.6.v20100715/jetty-project-7.1.6.v20100715.pom

Downloading: http://repo1.maven.org/maven2/org/eclipse/jetty/jetty-parent/15/jetty-parent-15.pom

Downloading: http://repo1.maven.org/maven2/org/apache/geronimo/specs/geronimo-jta_1.1_spec/1.1.1/geronimo-jta_1.1_spec-1.1.1.pom

Downloading: http://repo1.maven.org/maven2/javax/mail/mail/1.4.1/mail-1.4.1.pom

Downloading: http://repo1.maven.org/maven2/org/apache/geronimo/specs/geronimo-jaspic_1.0_spec/1.0/geronimo-jaspic_1.0_spec-1.0.pom

Downloading: http://repo1.maven.org/maven2/org/apache/geronimo/genesis/genesis-java1.4-flava/2.0/genesis-java1.4-flava-2.0.pom

Downloading: http://repo1.maven.org/maven2/org/apache/geronimo/genesis/genesis-default-flava/2.0/genesis-default-flava-2.0.pom

Downloading: http://repo1.maven.org/maven2/org/apache/geronimo/genesis/genesis/2.0/genesis-2.0.pom

Downloading: http://repo1.maven.org/maven2/org/apache/geronimo/specs/geronimo-annotation_1.0_spec/1.1.1/geronimo-annotation_1.0_spec-1.1.1.pom

Downloading: http://repo1.maven.org/maven2/asm/asm-commons/3.1/asm-commons-3.1.pom

Downloading: http://repo1.maven.org/maven2/asm/asm-tree/3.1/asm-tree-3.1.pom

Downloading: http://repo1.maven.org/maven2/org/fusesource/scalate/scalate-test/1.3.2/scalate-test-1.3.2.pom

Downloading: http://repo1.maven.org/maven2/junit/junit/4.8/junit-4.8.pom

Downloading: http://repo1.maven.org/maven2/org/seleniumhq/selenium/selenium-htmlunit-driver/2.0a2/selenium-htmlunit-driver-2.0a2.pom

Downloading: http://repo1.maven.org/maven2/org/seleniumhq/selenium/selenium-parent/2.0a2/selenium-parent-2.0a2.pom

Downloading: http://repo1.maven.org/maven2/org/seleniumhq/selenium/selenium-common/2.0a2/selenium-common-2.0a2.pom

Downloading: http://repo1.maven.org/maven2/net/sourceforge/htmlunit/htmlunit/2.6/htmlunit-2.6.pom

Downloading: http://repo1.maven.org/maven2/xalan/xalan/2.7.1/xalan-2.7.1.pom

Downloading: http://repo1.maven.org/maven2/xalan/serializer/2.7.1/serializer-2.7.1.pom

Downloading: http://repo1.maven.org/maven2/commons-codec/commons-codec/1.4/commons-codec-1.4.pom

Downloading: http://repo1.maven.org/maven2/net/sourceforge/htmlunit/htmlunit-core-js/2.6/htmlunit-core-js-2.6.pom

Downloading: http://repo1.maven.org/maven2/net/sourceforge/nekohtml/nekohtml/1.9.13/nekohtml-1.9.13.pom

Downloading: http://repo1.maven.org/maven2/net/sourceforge/cssparser/cssparser/0.9.5/cssparser-0.9.5.pom

Downloading: http://repo1.maven.org/maven2/org/w3c/css/sac/1.3/sac-1.3.pom

Downloading: http://repo1.maven.org/maven2/org/eclipse/jetty/jetty-server/7.2.1.v20101111/jetty-server-7.2.1.v20101111.pom

Downloading: http://repo1.maven.org/maven2/org/eclipse/jetty/jetty-project/7.2.1.v20101111/jetty-project-7.2.1.v20101111.pom

Downloading: http://repo1.maven.org/maven2/org/eclipse/jetty/jetty-parent/16/jetty-parent-16.pom

Downloading: http://repo1.maven.org/maven2/org/eclipse/jetty/jetty-continuation/7.2.1.v20101111/jetty-continuation-7.2.1.v20101111.pom

Downloading: http://repo1.maven.org/maven2/org/eclipse/jetty/jetty-http/7.2.1.v20101111/jetty-http-7.2.1.v20101111.pom

Downloading: http://repo1.maven.org/maven2/org/eclipse/jetty/jetty-io/7.2.1.v20101111/jetty-io-7.2.1.v20101111.pom

Downloading: http://repo1.maven.org/maven2/org/eclipse/jetty/jetty-util/7.2.1.v20101111/jetty-util-7.2.1.v20101111.pom

Downloading: http://repo1.maven.org/maven2/org/eclipse/jetty/jetty-webapp/7.2.1.v20101111/jetty-webapp-7.2.1.v20101111.pom

Downloading: http://repo1.maven.org/maven2/org/eclipse/jetty/jetty-xml/7.2.1.v20101111/jetty-xml-7.2.1.v20101111.pom

Downloading: http://repo1.maven.org/maven2/org/eclipse/jetty/jetty-servlet/7.2.1.v20101111/jetty-servlet-7.2.1.v20101111.pom

Downloading: http://repo1.maven.org/maven2/org/eclipse/jetty/jetty-security/7.2.1.v20101111/jetty-security-7.2.1.v20101111.pom

Downloading: http://repo1.maven.org/maven2/net/sourceforge/cssparser/cssparser/0.9.5/cssparser-0.9.5.jar
Downloading: http://repo1.maven.org/maven2/javax/servlet/servlet-api/2.5/servlet-api-2.5.jar
Downloading: http://repo1.maven.org/maven2/org/w3c/css/sac/1.3/sac-1.3.jar
Downloading: http://repo1.maven.org/maven2/org/apache/geronimo/specs/geronimo-jta_1.1_spec/1.1.1/geronimo-jta_1.1_spec-1.1.1.jar
Downloading: http://repo1.maven.org/maven2/net/sourceforge/htmlunit/htmlunit/2.6/htmlunit-2.6.jar



Downloading: http://repo1.maven.org/maven2/org/eclipse/jetty/jetty-server/7.2.1.v20101111/jetty-server-7.2.1.v20101111.jar


Downloading: http://repo1.maven.org/maven2/org/fusesource/scalate/scalate-core/1.3.2/scalate-core-1.3.2.jar
Downloading: http://repo1.maven.org/maven2/org/slf4j/slf4j-api/1.6.1/slf4j-api-1.6.1.jar

Downloading: http://repo1.maven.org/maven2/org/eclipse/jetty/aggregate/jetty-all-server/7.1.6.v20100715/jetty-all-server-7.1.6.v20100715.jar
Downloading: http://repo1.maven.org/maven2/com/sun/jersey/jersey-server/1.5-ea03/jersey-server-1.5-ea03.jar

Downloading: http://repo1.maven.org/maven2/net/sourceforge/nekohtml/nekohtml/1.9.13/nekohtml-1.9.13.jar
[INFO] Unable to find resource 'com.sun.jersey:jersey-server:jar:1.5-ea03' in repository repo1.maven
(http://repo1.maven.org/maven2)
Downloading: http://repo.fusesource.com/maven2/com/sun/jersey/jersey-server/1.5-ea03/jersey-server-1.5-ea03.jar
[INFO] Unable to find resource 'com.sun.jersey:jersey-server:jar:1.5-ea03' in repository fusesource.m2
(http://repo.fusesource.com/maven2)
Downloading: http://download.java.net/maven/2/com/sun/jersey/jersey-server/1.5-ea03/jersey-server-1.5-ea03.jar

Downloading: http://repo1.maven.org/maven2/commons-codec/commons-codec/1.4/commons-codec-1.4.jar
Downloading: http://repo1.maven.org/maven2/org/seleniumhq/selenium/selenium-htmlunit-driver/2.0a2/selenium-htmlunit-driver-2.0a2.jar

663K downloaded  (jersey-server-1.5-ea03.jar)
Downloading: http://repo1.maven.org/maven2/javax/mail/mail/1.4.1/mail-1.4.1.jar

Downloading: http://repo1.maven.org/maven2/xalan/xalan/2.7.1/xalan-2.7.1.jar
Downloading: http://repo1.maven.org/maven2/asm/asm/3.1/asm-3.1.jar




Downloading: http://repo1.maven.org/maven2/net/sourceforge/htmlunit/htmlunit-core-js/2.6/htmlunit-core-js-2.6.jar
Downloading: http://repo1.maven.org/maven2/org/eclipse/jetty/jetty-continuation/7.2.1.v20101111/jetty-continuation-7.2.1.v20101111.jar
Downloading: http://repo1.maven.org/maven2/org/apache/geronimo/specs/geronimo-jaspic_1.0_spec/1.0/geronimo-jaspic_1.0_spec-1.0.jar

Downloading: http://repo1.maven.org/maven2/org/fusesource/scalate/scalate-util/1.3.2/scalate-util-1.3.2.jar




Downloading: http://repo1.maven.org/maven2/com/sun/jersey/jersey-core/1.5-ea03/jersey-core-1.5-ea03.jar
Downloading: http://repo1.maven.org/maven2/org/seleniumhq/selenium/selenium-common/2.0a2/selenium-common-2.0a2.jar
Downloading: http://repo1.maven.org/maven2/asm/asm-commons/3.1/asm-commons-3.1.jar
Downloading: http://repo1.maven.org/maven2/org/eclipse/jetty/jetty-http/7.2.1.v20101111/jetty-http-7.2.1.v20101111.jar

Downloading: http://repo1.maven.org/maven2/org/codehaus/jackson/jackson-jaxrs/1.6.1/jackson-jaxrs-1.6.1.jar
[INFO] Unable to find resource 'com.sun.jersey:jersey-core:jar:1.5-ea03' in repository repo1.maven
(http://repo1.maven.org/maven2)
Downloading: http://repo.fusesource.com/maven2/com/sun/jersey/jersey-core/1.5-ea03/jersey-core-1.5-ea03.jar

[INFO] Unable to find resource 'com.sun.jersey:jersey-core:jar:1.5-ea03' in repository fusesource.m2
(http://repo.fusesource.com/maven2)
Downloading: http://download.java.net/maven/2/com/sun/jersey/jersey-core/1.5-ea03/jersey-core-1.5-ea03.jar

Downloading: http://repo1.maven.org/maven2/org/apache/geronimo/specs/geronimo-annotation_1.0_spec/1.1.1/geronimo-annotation_1.0_spec-1.1.1.jar
Downloading: http://repo1.maven.org/maven2/org/fusesource/scalate/scalate-test/1.3.2/scalate-test-1.3.2.jar
445K downloaded  (jersey-core-1.5-ea03.jar)
Downloading: http://repo1.maven.org/maven2/xalan/serializer/2.7.1/serializer-2.7.1.jar
Downloading: http://repo1.maven.org/maven2/asm/asm-tree/3.1/asm-tree-3.1.jar



Downloading: http://repo1.maven.org/maven2/org/eclipse/jetty/jetty-io/7.2.1.v20101111/jetty-io-7.2.1.v20101111.jar



Downloading: http://repo1.maven.org/maven2/org/eclipse/jetty/jetty-util/7.2.1.v20101111/jetty-util-7.2.1.v20101111.jar
Downloading: http://repo1.maven.org/maven2/org/codehaus/jackson/jackson-xc/1.6.1/jackson-xc-1.6.1.jar

Downloading: http://repo1.maven.org/maven2/org/eclipse/jetty/jetty-webapp/7.2.1.v20101111/jetty-webapp-7.2.1.v20101111.jar


Downloading: http://repo1.maven.org/maven2/org/eclipse/jetty/jetty-xml/7.2.1.v20101111/jetty-xml-7.2.1.v20101111.jar

Downloading: http://repo1.maven.org/maven2/org/eclipse/jetty/jetty-servlet/7.2.1.v20101111/jetty-servlet-7.2.1.v20101111.jar

Downloading: http://repo1.maven.org/maven2/org/eclipse/jetty/jetty-security/7.2.1.v20101111/jetty-security-7.2.1.v20101111.jar

[INFO] [enforcer:enforce {execution: default}]
[INFO] [remote-resources:process {execution: default}]
[INFO] [resources:resources {execution: default-resources}]
[INFO] Using 'UTF-8' encoding to copy filtered resources.
[INFO] skip non existing resourceDirectory <https://hudson.apache.org/hudson/job/ActiveMQ-Apollo-Deploy/org.apache.activemq$apollo-web/ws/target/schema>
[INFO] Copying 1 resource
[INFO] Copying 3 resources
[INFO] [compiler:compile {execution: default-compile}]
[INFO] Compiling 1 source file to <https://hudson.apache.org/hudson/job/ActiveMQ-Apollo-Deploy/org.apache.activemq$apollo-web/ws/target/classes>
[INFO] [scala:compile {execution: default}]
[INFO] Checking for multiple versions of scala
[WARNING]  Expected all dependencies to require Scala version: 2.8.1
[WARNING]  org.apache.activemq:apollo-util:1.0-SNAPSHOT requires scala version: 2.8.1
[WARNING]  org.apache.activemq:apollo-broker:1.0-SNAPSHOT requires scala version: 2.8.1
[WARNING]  org.fusesource.scalate:scalate-util:1.3.2 requires scala version: 2.8.0
[WARNING] Multiple versions of scala libraries detected!
[INFO] includes = [**/*.scala,**/*.java,]
[INFO] excludes = []
[INFO] <https://hudson.apache.org/hudson/job/ActiveMQ-Apollo-Deploy/org.apache.activemq$apollo-web/ws/src/main/scala>:-1:
info: compiling
[INFO] Compiling 5 source files to <https://hudson.apache.org/hudson/job/ActiveMQ-Apollo-Deploy/org.apache.activemq$apollo-web/ws/target/classes>
at 1294118874080
[INFO] compiler plugin: BasicArtifact(org.scala-lang.plugins,continuations,2.8.1)
[ERROR] <https://hudson.apache.org/hudson/job/ActiveMQ-Apollo-Deploy/org.apache.activemq$apollo-web/ws/src/main/scala/org/apache/activemq/apollo/web/resources/RuntimeResource.scala>:58:
error: value all is not a member of object org.fusesource.hawtdispatch.Future
[INFO]     Future.all( values.map { t=>
[INFO]            ^
[ERROR] <https://hudson.apache.org/hudson/job/ActiveMQ-Apollo-Deploy/org.apache.activemq$apollo-web/ws/src/main/scala/org/apache/activemq/apollo/web/resources/RuntimeResource.scala>:67:
error: not enough arguments for method apply: (func: ((Option[T]) => Unit) => Unit)Option[T]
in object Future.
[INFO] Unspecified value parameter func.
[INFO]         val f = Future[Option[T]]()
[INFO]                                  ^
[ERROR] <https://hudson.apache.org/hudson/job/ActiveMQ-Apollo-Deploy/org.apache.activemq$apollo-web/ws/src/main/scala/org/apache/activemq/apollo/web/resources/RuntimeResource.scala>:115:
error: value onComplete is not a member of org.fusesource.hawtdispatch.Future[org.apache.activemq.apollo.dto.AggregateQueueMetricsDTO]
[INFO]       get_queue_metrics(broker).onComplete{ metrics=>
[INFO]                                 ^
[ERROR] <https://hudson.apache.org/hudson/job/ActiveMQ-Apollo-Deploy/org.apache.activemq$apollo-web/ws/src/main/scala/org/apache/activemq/apollo/web/resources/RuntimeResource.scala>:170:
error: value all is not a member of object org.fusesource.hawtdispatch.Future
[INFO]     val metrics = Future.all {
[INFO]                          ^
[ERROR] <https://hudson.apache.org/hudson/job/ActiveMQ-Apollo-Deploy/org.apache.activemq$apollo-web/ws/src/main/scala/org/apache/activemq/apollo/web/resources/RuntimeResource.scala>:179:
error: value all is not a member of object org.fusesource.hawtdispatch.Future
[INFO]     val metrics = Future.all{
[INFO]                          ^
[ERROR] <https://hudson.apache.org/hudson/job/ActiveMQ-Apollo-Deploy/org.apache.activemq$apollo-web/ws/src/main/scala/org/apache/activemq/apollo/web/resources/RuntimeResource.scala>:201:
error: value onComplete is not a member of org.fusesource.hawtdispatch.Future[org.apache.activemq.apollo.dto.AggregateQueueMetricsDTO]
[INFO]       get_queue_metrics(virtualHost).onComplete { metrics=>
[INFO]                                      ^
[ERROR] 6 errors found
[HUDSON] Archiving <https://hudson.apache.org/hudson/job/ActiveMQ-Apollo-Deploy/org.apache.activemq$apollo-web/ws/pom.xml>
to /home/hudson/hudson/jobs/ActiveMQ-Apollo-Deploy/modules/org.apache.activemq$apollo-web/builds/2011-01-04_04-03-56/archive/org.apache.activemq/apollo-web/1.0-SNAPSHOT/pom.xml


Mime
View raw message