activemq-dev mailing list archives

Site index · List index
Message view « Date » · « Thread »
Top « Date » · « Thread »
From Apache Hudson Server <hud...@hudson.apache.org>
Subject Build failed in Hudson: ActiveMQ-Apollo-Deploy #45
Date Fri, 14 Jan 2011 04:39:40 GMT
See <https://hudson.apache.org/hudson/job/ActiveMQ-Apollo-Deploy/45/changes>

Changes:

[chirino] fix compile error

[chirino] Have the broker self register in the broker registry.

[chirino] Be smarter about auto detecting where the webapp module is located if the apollo.home
system properties are not set.

[chirino] Better config validation and web server now stops properly (was hanging)

[chirino] Better broker config validation.

[chirino] If class finder cannot load class log a debug message.

------------------------------------------
[...truncated 4222 lines...]
[INFO]     processing <https://hudson.apache.org/hudson/job/ActiveMQ-Apollo-Deploy/ws/trunk/apollo-website/src/documentation/architecture.md>
with uri: /documentation/architecture.md => 
[INFO]     processing <https://hudson.apache.org/hudson/job/ActiveMQ-Apollo-Deploy/ws/trunk/apollo-website/src/documentation/module-organization.page>
with uri: /documentation/module-organization.page => 
[INFO]     processing <https://hudson.apache.org/hudson/job/ActiveMQ-Apollo-Deploy/ws/trunk/apollo-website/src/privacy-policy.page>
with uri: /privacy-policy.page => 
[INFO]     processing <https://hudson.apache.org/hudson/job/ActiveMQ-Apollo-Deploy/ws/trunk/apollo-website/src/download.page>
with uri: /download.page => 
Using dir: <https://hudson.apache.org/hudson/job/ActiveMQ-Apollo-Deploy/ws/trunk/apollo-website/src/blog>
at request path: /blog
[INFO]     processing <https://hudson.apache.org/hudson/job/ActiveMQ-Apollo-Deploy/ws/trunk/apollo-website/src/blog/index.page>
with uri: /blog/index.page => 
Using dir: <https://hudson.apache.org/hudson/job/ActiveMQ-Apollo-Deploy/ws/trunk/apollo-website/src/blog>
at request path: /blog
[INFO]     processing <https://hudson.apache.org/hudson/job/ActiveMQ-Apollo-Deploy/ws/trunk/apollo-website/src/blog/index.rss.feed>
with uri: /blog/index.rss.feed => 
[INFO]     processing <https://hudson.apache.org/hudson/job/ActiveMQ-Apollo-Deploy/ws/trunk/apollo-website/src/versions/index.page>
with uri: /versions/index.page => 
[INFO]     processing <https://hudson.apache.org/hudson/job/ActiveMQ-Apollo-Deploy/ws/trunk/apollo-website/src/community/faq.page>
with uri: /community/faq.page => 
[INFO]     processing <https://hudson.apache.org/hudson/job/ActiveMQ-Apollo-Deploy/ws/trunk/apollo-website/src/community/site.page>
with uri: /community/site.page => 
[INFO]     processing <https://hudson.apache.org/hudson/job/ActiveMQ-Apollo-Deploy/ws/trunk/apollo-website/src/community/index.page>
with uri: /community/index.page => 
[INFO]     processing <https://hudson.apache.org/hudson/job/ActiveMQ-Apollo-Deploy/ws/trunk/apollo-website/src/community/contributing.page>
with uri: /community/contributing.page => 
[INFO]     processing <https://hudson.apache.org/hudson/job/ActiveMQ-Apollo-Deploy/ws/trunk/apollo-website/src/community/source.page>
with uri: /community/source.page => 
[INFO]     processing <https://hudson.apache.org/hudson/job/ActiveMQ-Apollo-Deploy/ws/trunk/apollo-website/src/community/support.page>
with uri: /community/support.page => 
[INFO]     processing <https://hudson.apache.org/hudson/job/ActiveMQ-Apollo-Deploy/ws/trunk/apollo-website/src/community/developers.page>
with uri: /community/developers.page => 
[INFO]     processing <https://hudson.apache.org/hudson/job/ActiveMQ-Apollo-Deploy/ws/trunk/apollo-website/src/community/building.page>
with uri: /community/building.page => 
[INFO]     processing <https://hudson.apache.org/hudson/job/ActiveMQ-Apollo-Deploy/ws/trunk/apollo-website/src/community/release-guide.page>
with uri: /community/release-guide.page => 
[INFO] [install:install {execution: default-install}]
[INFO] Installing <https://hudson.apache.org/hudson/job/ActiveMQ-Apollo-Deploy/ws/trunk/apollo-website/pom.xml>
to <https://hudson.apache.org/hudson/job/ActiveMQ-Apollo-Deploy/ws/.repository/org/apache/activemq/apollo-website/1.0-SNAPSHOT/apollo-website-1.0-SNAPSHOT.pom>
[INFO] [deploy:deploy {execution: default-deploy}]
[INFO] Retrieving previous build number from apache.snapshots.https
Uploading: https://repository.apache.org/content/repositories/snapshots/org/apache/activemq/apollo-website/1.0-SNAPSHOT/apollo-website-1.0-20110114.042024-83.pom
6K uploaded  (apollo-website-1.0-20110114.042024-83.pom)
[INFO] Retrieving previous metadata from apache.snapshots.https
[INFO] Uploading repository metadata for: 'snapshot org.apache.activemq:apollo-website:1.0-SNAPSHOT'
[INFO] Retrieving previous metadata from apache.snapshots.https
[INFO] Uploading repository metadata for: 'artifact org.apache.activemq:apollo-website'
[INFO] [scalate:deploy {execution: deploy}]
scp://people.apache.org/x1/www/activemq.apache.org/apollo/versions/1.0-SNAPSHOT/website/ -
Session: Connection refused
scp://people.apache.org/x1/www/activemq.apache.org/apollo/versions/1.0-SNAPSHOT/website/ -
Session: Disconnecting  
scp://people.apache.org/x1/www/activemq.apache.org/apollo/versions/1.0-SNAPSHOT/website/ -
Session: Disconnected
[HUDSON] Archiving <https://hudson.apache.org/hudson/job/ActiveMQ-Apollo-Deploy/ws/.repository/org/apache/activemq/apollo-website/1.0-SNAPSHOT/apollo-website-1.0-SNAPSHOT.pom>
to /home/hudson/hudson/jobs/ActiveMQ-Apollo-Deploy/modules/org.apache.activemq$apollo-website/builds/2011-01-14_04-16-23/archive/org.apache.activemq/apollo-website/1.0-20110114.042024-83/apollo-website-1.0-SNAPSHOT.pom
[INFO] ------------------------------------------------------------------------
[INFO] Building apache-apollo
[INFO]    task-segment: [clean, deploy]
[INFO] ------------------------------------------------------------------------
Downloading: http://repo1.maven.org/maven2/org/apache/maven/plugins/maven-assembly-plugin/2.2-beta-4/maven-assembly-plugin-2.2-beta-4.pom

Downloading: http://repo1.maven.org/maven2/org/apache/maven/plugins/maven-plugins/13/maven-plugins-13.pom

Downloading: http://repo1.maven.org/maven2/org/apache/maven/plugins/maven-assembly-plugin/2.2-beta-4/maven-assembly-plugin-2.2-beta-4.jar

[INFO] [clean:clean {execution: default-clean}]
[INFO] snapshot org.apache.activemq:apollo-web:1.0-SNAPSHOT: checking for updates from fusesource.m2-snapshot
[INFO] snapshot org.apache.activemq:apollo-web:1.0-SNAPSHOT: checking for updates from java.net.m2
[INFO] snapshot org.apache.activemq:apollo-web:1.0-SNAPSHOT: checking for updates from glassfish-repo-archive
[INFO] snapshot org.apache.activemq:apollo-web:1.0-SNAPSHOT: checking for updates from fusesource.snapshots
[INFO] snapshot org.apache.activemq:apollo-web:1.0-SNAPSHOT: checking for updates from java.net
[INFO] snapshot org.apache.activemq:apollo-web:1.0-SNAPSHOT: checking for updates from shorrockin
[INFO] snapshot org.apache.activemq:apollo-web:1.0-SNAPSHOT: checking for updates from snapshots.scala-tools.org
[INFO] snapshot org.apache.activemq:apollo-web:1.0-SNAPSHOT: checking for updates from apache.snapshots
[INFO] snapshot org.apache.activemq:apollo-web:1.0-SNAPSHOT: checking for updates from oracleReleases
[INFO] [enforcer:enforce {execution: default}]
[INFO] [remote-resources:process {execution: default}]
[INFO] [site:attach-descriptor {execution: default-attach-descriptor}]
Downloading: http://repo1.maven.org/maven2/org/apache/maven/shared/maven-common-artifact-filters/1.1/maven-common-artifact-filters-1.1.pom

Downloading: http://repo1.maven.org/maven2/org/apache/maven/maven-settings/2.0/maven-settings-2.0.pom

Downloading: http://repo1.maven.org/maven2/org/apache/maven/wagon/wagon-file/1.0-alpha-5/wagon-file-1.0-alpha-5.pom

Downloading: http://repo1.maven.org/maven2/org/apache/maven/maven-plugin-parameter-documenter/2.0/maven-plugin-parameter-documenter-2.0.pom

Downloading: http://repo1.maven.org/maven2/org/apache/maven/wagon/wagon-http-lightweight/1.0-alpha-5/wagon-http-lightweight-1.0-alpha-5.pom

Downloading: http://repo1.maven.org/maven2/org/apache/maven/reporting/maven-reporting-api/2.0/maven-reporting-api-2.0.pom

Downloading: http://repo1.maven.org/maven2/org/apache/maven/reporting/maven-reporting/2.0/maven-reporting-2.0.pom

Downloading: http://repo1.maven.org/maven2/doxia/doxia-sink-api/1.0-alpha-4/doxia-sink-api-1.0-alpha-4.pom

Downloading: http://repo1.maven.org/maven2/org/apache/maven/maven-error-diagnostics/2.0/maven-error-diagnostics-2.0.pom

Downloading: http://repo1.maven.org/maven2/org/apache/maven/maven-plugin-registry/2.0/maven-plugin-registry-2.0.pom

Downloading: http://repo1.maven.org/maven2/org/apache/maven/maven-plugin-descriptor/2.0/maven-plugin-descriptor-2.0.pom

Downloading: http://repo1.maven.org/maven2/org/apache/maven/maven-monitor/2.0/maven-monitor-2.0.pom

Downloading: http://repo1.maven.org/maven2/org/apache/maven/wagon/wagon-ssh/1.0-alpha-5/wagon-ssh-1.0-alpha-5.pom

Downloading: http://repo1.maven.org/maven2/com/jcraft/jsch/0.1.23/jsch-0.1.23.pom

Downloading: http://repo1.maven.org/maven2/org/codehaus/plexus/plexus-interpolation/1.7/plexus-interpolation-1.7.pom

Downloading: http://repo1.maven.org/maven2/org/codehaus/plexus/plexus-archiver/1.0-alpha-12/plexus-archiver-1.0-alpha-12.pom

Downloading: http://repo1.maven.org/maven2/org/codehaus/plexus/plexus-io/1.0-alpha-4/plexus-io-1.0-alpha-4.pom

Downloading: http://repo1.maven.org/maven2/org/apache/maven/shared/file-management/1.1/file-management-1.1.pom

Downloading: http://repo1.maven.org/maven2/org/apache/maven/shared/maven-shared-io/1.0/maven-shared-io-1.0.pom

Downloading: http://repo1.maven.org/maven2/org/apache/maven/maven-repository-metadata/2.0.2/maven-repository-metadata-2.0.2.pom

Downloading: http://repo1.maven.org/maven2/org/codehaus/plexus/plexus-active-collections/1.0-beta-2/plexus-active-collections-1.0-beta-2.pom

Downloading: http://repo1.maven.org/maven2/org/codehaus/plexus/plexus-container-default/1.0-alpha-22/plexus-container-default-1.0-alpha-22.pom

Downloading: http://repo1.maven.org/maven2/org/codehaus/plexus/plexus-containers/1.0-alpha-22/plexus-containers-1.0-alpha-22.pom

Downloading: http://repo1.maven.org/maven2/org/apache/maven/maven-archiver/2.4/maven-archiver-2.4.pom

Downloading: http://repo1.maven.org/maven2/org/codehaus/plexus/plexus-archiver/1.0-alpha-11/plexus-archiver-1.0-alpha-11.pom

Downloading: http://repo1.maven.org/maven2/org/apache/maven/shared/maven-repository-builder/1.0-alpha-2/maven-repository-builder-1.0-alpha-2.pom

Downloading: http://repo1.maven.org/maven2/org/apache/maven/shared/maven-common-artifact-filters/1.0-alpha-1/maven-common-artifact-filters-1.0-alpha-1.pom

Downloading: http://repo1.maven.org/maven2/org/apache/maven/shared/maven-shared-components/6/maven-shared-components-6.pom

Downloading: http://repo1.maven.org/maven2/org/codehaus/plexus/plexus-utils/1.5.12/plexus-utils-1.5.12.jar
Downloading: http://repo1.maven.org/maven2/org/apache/maven/maven-archiver/2.4/maven-archiver-2.4.jar
Downloading: http://repo1.maven.org/maven2/org/apache/maven/shared/maven-common-artifact-filters/1.1/maven-common-artifact-filters-1.1.jar


Downloading: http://repo1.maven.org/maven2/org/codehaus/plexus/plexus-archiver/1.0-alpha-12/plexus-archiver-1.0-alpha-12.jar

Downloading: http://repo1.maven.org/maven2/org/apache/maven/shared/file-management/1.1/file-management-1.1.jar


Downloading: http://repo1.maven.org/maven2/org/apache/maven/shared/maven-repository-builder/1.0-alpha-2/maven-repository-builder-1.0-alpha-2.jar
Downloading: http://repo1.maven.org/maven2/org/codehaus/plexus/plexus-interpolation/1.7/plexus-interpolation-1.7.jar


Downloading: http://repo1.maven.org/maven2/org/codehaus/plexus/plexus-io/1.0-alpha-4/plexus-io-1.0-alpha-4.jar

Downloading: http://repo1.maven.org/maven2/org/codehaus/plexus/plexus-active-collections/1.0-beta-2/plexus-active-collections-1.0-beta-2.jar

[INFO] [assembly:single {execution: unix-bin}]
[INFO] Reading assembly descriptor: <https://hudson.apache.org/hudson/job/ActiveMQ-Apollo-Deploy/ws/trunk/apollo-distro/src/main/descriptors/unix-bin.xml>
[INFO] No files selected for line-ending conversion or filtering. Skipping: <https://hudson.apache.org/hudson/job/ActiveMQ-Apollo-Deploy/ws/trunk/apollo-distro/..>
[WARNING] Cannot include project artifact: org.apache.activemq:apache-apollo:pom:1.0-SNAPSHOT;
it doesn't have an associated file or directory.
[INFO] Building tar : <https://hudson.apache.org/hudson/job/ActiveMQ-Apollo-Deploy/ws/trunk/apollo-distro/target/apache-apollo-1.0-SNAPSHOT-unix-distro.tar.gz>
[INFO] [assembly:single {execution: windows-bin}]
[INFO] Reading assembly descriptor: <https://hudson.apache.org/hudson/job/ActiveMQ-Apollo-Deploy/ws/trunk/apollo-distro/src/main/descriptors/windows-bin.xml>
[INFO] No files selected for line-ending conversion or filtering. Skipping: <https://hudson.apache.org/hudson/job/ActiveMQ-Apollo-Deploy/ws/trunk/apollo-distro/..>
[WARNING] Cannot include project artifact: org.apache.activemq:apache-apollo:pom:1.0-SNAPSHOT;
it doesn't have an associated file or directory.
[INFO] Building zip: <https://hudson.apache.org/hudson/job/ActiveMQ-Apollo-Deploy/ws/trunk/apollo-distro/target/apache-apollo-1.0-SNAPSHOT-windows-distro.zip>
[INFO] [install:install {execution: default-install}]
[INFO] Installing <https://hudson.apache.org/hudson/job/ActiveMQ-Apollo-Deploy/ws/trunk/apollo-distro/pom.xml>
to <https://hudson.apache.org/hudson/job/ActiveMQ-Apollo-Deploy/ws/.repository/org/apache/activemq/apache-apollo/1.0-SNAPSHOT/apache-apollo-1.0-SNAPSHOT.pom>
[INFO] Installing <https://hudson.apache.org/hudson/job/ActiveMQ-Apollo-Deploy/ws/trunk/apollo-distro/target/apache-apollo-1.0-SNAPSHOT-unix-distro.tar.gz>
to <https://hudson.apache.org/hudson/job/ActiveMQ-Apollo-Deploy/ws/.repository/org/apache/activemq/apache-apollo/1.0-SNAPSHOT/apache-apollo-1.0-SNAPSHOT-unix-distro.tar.gz>
[INFO] Installing <https://hudson.apache.org/hudson/job/ActiveMQ-Apollo-Deploy/ws/trunk/apollo-distro/target/apache-apollo-1.0-SNAPSHOT-windows-distro.zip>
to <https://hudson.apache.org/hudson/job/ActiveMQ-Apollo-Deploy/ws/.repository/org/apache/activemq/apache-apollo/1.0-SNAPSHOT/apache-apollo-1.0-SNAPSHOT-windows-distro.zip>
[INFO] [deploy:deploy {execution: default-deploy}]
[INFO] Retrieving previous build number from apache.snapshots.https
Uploading: https://repository.apache.org/content/repositories/snapshots/org/apache/activemq/apache-apollo/1.0-SNAPSHOT/apache-apollo-1.0-20110114.042024-72.pom
5K uploaded  (apache-apollo-1.0-20110114.042024-72.pom)
[INFO] Retrieving previous metadata from apache.snapshots.https
[INFO] Uploading repository metadata for: 'artifact org.apache.activemq:apache-apollo'
[INFO] Retrieving previous metadata from apache.snapshots.https
[INFO] Uploading repository metadata for: 'snapshot org.apache.activemq:apache-apollo:1.0-SNAPSHOT'
[INFO] Retrieving previous build number from apache.snapshots.https
Uploading: https://repository.apache.org/content/repositories/snapshots/org/apache/activemq/apache-apollo/1.0-SNAPSHOT/apache-apollo-1.0-20110114.042024-72-unix-distro.tar.gz
14400K uploaded  (apache-apollo-1.0-20110114.042024-72-unix-distro.tar.gz)
[INFO] Retrieving previous build number from apache.snapshots.https
Uploading: https://repository.apache.org/content/repositories/snapshots/org/apache/activemq/apache-apollo/1.0-SNAPSHOT/apache-apollo-1.0-20110114.042024-72-windows-distro.zip
14445K uploaded  (apache-apollo-1.0-20110114.042024-72-windows-distro.zip)
[HUDSON] Archiving <https://hudson.apache.org/hudson/job/ActiveMQ-Apollo-Deploy/ws/trunk/apollo-distro/pom.xml>
to /home/hudson/hudson/jobs/ActiveMQ-Apollo-Deploy/modules/org.apache.activemq$apache-apollo/builds/2011-01-14_04-16-23/archive/org.apache.activemq/apache-apollo/1.0-SNAPSHOT/pom.xml
[HUDSON] Archiving <https://hudson.apache.org/hudson/job/ActiveMQ-Apollo-Deploy/ws/.repository/org/apache/activemq/apache-apollo/1.0-SNAPSHOT/apache-apollo-1.0-SNAPSHOT.pom>
to /home/hudson/hudson/jobs/ActiveMQ-Apollo-Deploy/modules/org.apache.activemq$apache-apollo/builds/2011-01-14_04-16-23/archive/org.apache.activemq/apache-apollo/1.0-20110114.042024-72/apache-apollo-1.0-SNAPSHOT.pom
[HUDSON] Archiving <https://hudson.apache.org/hudson/job/ActiveMQ-Apollo-Deploy/ws/trunk/apollo-distro/target/apache-apollo-1.0-SNAPSHOT-unix-distro.tar.gz>
to /home/hudson/hudson/jobs/ActiveMQ-Apollo-Deploy/modules/org.apache.activemq$apache-apollo/builds/2011-01-14_04-16-23/archive/org.apache.activemq/apache-apollo/1.0-20110114.042024-72/apache-apollo-1.0-SNAPSHOT-unix-distro.tar.gz
[HUDSON] Archiving <https://hudson.apache.org/hudson/job/ActiveMQ-Apollo-Deploy/ws/trunk/apollo-distro/target/apache-apollo-1.0-SNAPSHOT-windows-distro.zip>
to /home/hudson/hudson/jobs/ActiveMQ-Apollo-Deploy/modules/org.apache.activemq$apache-apollo/builds/2011-01-14_04-16-23/archive/org.apache.activemq/apache-apollo/1.0-20110114.042024-72/apache-apollo-1.0-SNAPSHOT-windows-distro.zip
[INFO] 
[INFO] 
[INFO] ------------------------------------------------------------------------
[INFO] Reactor Summary:
[INFO] ------------------------------------------------------------------------
[INFO] Apache ActiveMQ Apollo Project ........................ SUCCESS [3:50.844s]
[INFO] apollo-scala .......................................... SUCCESS [1:34.195s]
[INFO] apollo-util ........................................... SUCCESS [1:39.839s]
[INFO] apollo-transport ...................................... SUCCESS [3.617s]
[INFO] apollo-dto ............................................ SUCCESS [30.950s]
[INFO] apollo-selector ....................................... SUCCESS [49.543s]
[INFO] apollo-broker ......................................... SUCCESS [1:24.178s]
[INFO] apollo-cassandra ...................................... SUCCESS [33.797s]
[INFO] apollo-tcp ............................................ SUCCESS [3.049s]
[INFO] apollo-web ............................................ SUCCESS [2:47.563s]
[INFO] apollo-hawtdb ......................................... SUCCESS [33.014s]
[INFO] apollo-bdb ............................................ SUCCESS [28.916s]
[INFO] apollo-jdbm2 .......................................... SUCCESS [27.187s]
[INFO] apollo-stomp .......................................... SUCCESS [32.714s]
[INFO] apollo-cli ............................................ SUCCESS [40.930s]
[INFO] apollo-website ........................................ FAILED [31.729s]
[INFO] apache-apollo ......................................... SUCCESS [1:50.115s]
[INFO] ------------------------------------------------------------------------
[INFO] Error for project: apollo-website (during deploy)
[INFO] ------------------------------------------------------------------------
[INFO] Error uploading site

Embedded error: Cannot connect. Reason: Auth fail
[INFO] ------------------------------------------------------------------------
[INFO] Trace
org.apache.maven.lifecycle.LifecycleExecutionException: Error uploading site
	at org.apache.maven.lifecycle.DefaultLifecycleExecutor.executeGoals(DefaultLifecycleExecutor.java:719)
	at org.apache.maven.lifecycle.DefaultLifecycleExecutor.executeGoalWithLifecycle(DefaultLifecycleExecutor.java:556)
	at org.apache.maven.lifecycle.DefaultLifecycleExecutor.executeGoal(DefaultLifecycleExecutor.java:535)
	at org.apache.maven.lifecycle.DefaultLifecycleExecutor.executeGoalAndHandleFailures(DefaultLifecycleExecutor.java:387)
	at org.apache.maven.lifecycle.DefaultLifecycleExecutor.executeTaskSegments(DefaultLifecycleExecutor.java:348)
	at org.apache.maven.lifecycle.DefaultLifecycleExecutor.execute(DefaultLifecycleExecutor.java:180)
	at org.apache.maven.lifecycle.LifecycleExecutorInterceptor.execute(LifecycleExecutorInterceptor.java:65)
	at org.apache.maven.DefaultMaven.doExecute(DefaultMaven.java:328)
	at org.apache.maven.DefaultMaven.execute(DefaultMaven.java:138)
	at org.apache.maven.cli.MavenCli.main(MavenCli.java:362)
	at sun.reflect.NativeMethodAccessorImpl.invoke0(Native Method)
	at sun.reflect.NativeMethodAccessorImpl.invoke(NativeMethodAccessorImpl.java:39)
	at sun.reflect.DelegatingMethodAccessorImpl.invoke(DelegatingMethodAccessorImpl.java:25)
	at java.lang.reflect.Method.invoke(Method.java:597)
	at org.codehaus.classworlds.Launcher.launchEnhanced(Launcher.java:315)
	at org.codehaus.classworlds.Launcher.launch(Launcher.java:255)
	at hudson.maven.agent.Main.launch(Main.java:165)
	at hudson.maven.MavenBuilder.call(MavenBuilder.java:165)
	at hudson.maven.MavenModuleSetBuild$Builder.call(MavenModuleSetBuild.java:750)
	at hudson.maven.MavenModuleSetBuild$Builder.call(MavenModuleSetBuild.java:694)
	at hudson.remoting.UserRequest.perform(UserRequest.java:114)
	at hudson.remoting.UserRequest.perform(UserRequest.java:48)
	at hudson.remoting.Request$2.run(Request.java:270)
	at java.util.concurrent.Executors$RunnableAdapter.call(Executors.java:441)
	at java.util.concurrent.FutureTask$Sync.innerRun(FutureTask.java:303)
	at java.util.concurrent.FutureTask.run(FutureTask.java:138)
	at java.util.concurrent.ThreadPoolExecutor$Worker.runTask(ThreadPoolExecutor.java:886)
	at java.util.concurrent.ThreadPoolExecutor$Worker.run(ThreadPoolExecutor.java:908)
	at java.lang.Thread.run(Thread.java:619)
Caused by: org.apache.maven.plugin.MojoExecutionException: Error uploading site
	at org.fusesource.scalate.maven.SiteDeployMojo.execute(SiteDeployMojo.java:251)
	at org.apache.maven.plugin.DefaultPluginManager.executeMojo(DefaultPluginManager.java:490)
	at hudson.maven.agent.PluginManagerInterceptor.executeMojo(PluginManagerInterceptor.java:182)
	at org.apache.maven.lifecycle.DefaultLifecycleExecutor.executeGoals(DefaultLifecycleExecutor.java:694)
	... 28 more
Caused by: org.apache.maven.wagon.authentication.AuthenticationException: Cannot connect.
Reason: Auth fail
	at org.apache.maven.wagon.providers.ssh.jsch.AbstractJschWagon.openConnectionInternal(AbstractJschWagon.java:264)
	at org.apache.maven.wagon.AbstractWagon.openConnection(AbstractWagon.java:105)
	at org.apache.maven.wagon.AbstractWagon.connect(AbstractWagon.java:207)
	at org.apache.maven.wagon.AbstractWagon.connect(AbstractWagon.java:142)
	at org.fusesource.scalate.maven.SiteDeployMojo.execute(SiteDeployMojo.java:233)
	... 31 more
Caused by: com.jcraft.jsch.JSchException: Auth fail
	at com.jcraft.jsch.Session.connect(Session.java:451)
	at com.jcraft.jsch.Session.connect(Session.java:149)
	at org.apache.maven.wagon.providers.ssh.jsch.AbstractJschWagon.openConnectionInternal(AbstractJschWagon.java:236)
	... 35 more
[INFO] ------------------------------------------------------------------------
[INFO] BUILD ERRORS
[INFO] ------------------------------------------------------------------------
[INFO] Total time: 23 minutes 7 seconds
[INFO] Finished at: Fri Jan 14 04:39:41 UTC 2011
[INFO] Final Memory: 116M/1665M
[INFO] ------------------------------------------------------------------------
Sending e-mails to: dev@activemq.apache.org
channel stopped


Mime
View raw message