activemq-dev mailing list archives

Site index · List index
Message view « Date » · « Thread »
Top « Date » · « Thread »
From Apache Hudson Server <hud...@hudson.apache.org>
Subject Build failed in Hudson: ActiveMQ-Apollo-Deploy #24
Date Sat, 11 Dec 2010 04:46:12 GMT
See <https://hudson.apache.org/hudson/job/ActiveMQ-Apollo-Deploy/24/changes>

Changes:

[chirino] Simplifying the out of the box stomp ruby examples and defaulting the user id/password.

[chirino] Broker security model is now working /w stomp fine.

[chirino] Moving the StompProtocolHandler to it's own source file.

[chirino] fully modeled out the security configuration in apollo.xml
finished integration with jass
implemented authorizer based on the security config in the xml files
upgraded the jetty version
jetty now secures the admin interface so that only admin users can access it
updated create tool so it generates all the login config stuff.

------------------------------------------
[...truncated 10169 lines...]
Downloading: http://download.java.net/maven/2/org/apache/maven/shared/maven-common-artifact-filters/1.0-alpha-1/maven-common-artifact-filters-1.0-alpha-1.pom
[INFO] Unable to find resource 'org.apache.maven.shared:maven-common-artifact-filters:pom:1.0-alpha-1'
in repository maven2-repository.dev.java.net (http://download.java.net/maven/2)
Downloading: http://scala-tools.org/repo-releases/org/apache/maven/shared/maven-common-artifact-filters/1.0-alpha-1/maven-common-artifact-filters-1.0-alpha-1.pom
[INFO] Unable to find resource 'org.apache.maven.shared:maven-common-artifact-filters:pom:1.0-alpha-1'
in repository scala (http://scala-tools.org/repo-releases)
Downloading: http://scala-tools.org/repo-snapshots/org/apache/maven/shared/maven-common-artifact-filters/1.0-alpha-1/maven-common-artifact-filters-1.0-alpha-1.pom
[INFO] Unable to find resource 'org.apache.maven.shared:maven-common-artifact-filters:pom:1.0-alpha-1'
in repository snapshots.scala-tools.org (http://scala-tools.org/repo-snapshots)
Downloading: http://repo.fusesource.com/nexus/content/repositories/snapshots/org/apache/maven/shared/maven-common-artifact-filters/1.0-alpha-1/maven-common-artifact-filters-1.0-alpha-1.pom
[INFO] Unable to find resource 'org.apache.maven.shared:maven-common-artifact-filters:pom:1.0-alpha-1'
in repository fusesource.snapshots (http://repo.fusesource.com/nexus/content/repositories/snapshots)
Downloading: http://repo1.maven.org/maven2/org/apache/maven/shared/maven-common-artifact-filters/1.0-alpha-1/maven-common-artifact-filters-1.0-alpha-1.pom

Downloading: http://repo.open.iona.com/maven2/org/apache/maven/shared/maven-shared-components/6/maven-shared-components-6.pom
[INFO] Unable to find resource 'org.apache.maven.shared:maven-shared-components:pom:6' in
repository open.iona.m2 (http://repo.open.iona.com/maven2)
Downloading: http://download.java.net/maven/2/org/apache/maven/shared/maven-shared-components/6/maven-shared-components-6.pom
[INFO] Unable to find resource 'org.apache.maven.shared:maven-shared-components:pom:6' in
repository maven2-repository.dev.java.net (http://download.java.net/maven/2)
Downloading: http://scala-tools.org/repo-releases/org/apache/maven/shared/maven-shared-components/6/maven-shared-components-6.pom
[INFO] Unable to find resource 'org.apache.maven.shared:maven-shared-components:pom:6' in
repository scala (http://scala-tools.org/repo-releases)
Downloading: http://scala-tools.org/repo-snapshots/org/apache/maven/shared/maven-shared-components/6/maven-shared-components-6.pom
[INFO] Unable to find resource 'org.apache.maven.shared:maven-shared-components:pom:6' in
repository snapshots.scala-tools.org (http://scala-tools.org/repo-snapshots)
Downloading: http://repo.fusesource.com/nexus/content/repositories/snapshots/org/apache/maven/shared/maven-shared-components/6/maven-shared-components-6.pom
[INFO] Unable to find resource 'org.apache.maven.shared:maven-shared-components:pom:6' in
repository fusesource.snapshots (http://repo.fusesource.com/nexus/content/repositories/snapshots)
Downloading: http://repo1.maven.org/maven2/org/apache/maven/shared/maven-shared-components/6/maven-shared-components-6.pom

Downloading: http://repo.open.iona.com/maven2/org/codehaus/plexus/plexus-utils/1.5.12/plexus-utils-1.5.12.jar
Downloading: http://repo.open.iona.com/maven2/org/apache/maven/shared/maven-common-artifact-filters/1.1/maven-common-artifact-filters-1.1.jar
Downloading: http://repo.open.iona.com/maven2/org/apache/maven/maven-archiver/2.4/maven-archiver-2.4.jar
[INFO] Unable to find resource 'org.codehaus.plexus:plexus-utils:jar:1.5.12' in repository
open.iona.m2 (http://repo.open.iona.com/maven2)
Downloading: http://download.java.net/maven/2/org/codehaus/plexus/plexus-utils/1.5.12/plexus-utils-1.5.12.jar
[INFO] Unable to find resource 'org.apache.maven:maven-archiver:jar:2.4' in repository open.iona.m2
(http://repo.open.iona.com/maven2)
Downloading: http://download.java.net/maven/2/org/apache/maven/maven-archiver/2.4/maven-archiver-2.4.jar
[INFO] Unable to find resource 'org.apache.maven.shared:maven-common-artifact-filters:jar:1.1'
in repository open.iona.m2 (http://repo.open.iona.com/maven2)
Downloading: http://download.java.net/maven/2/org/apache/maven/shared/maven-common-artifact-filters/1.1/maven-common-artifact-filters-1.1.jar
[INFO] Unable to find resource 'org.codehaus.plexus:plexus-utils:jar:1.5.12' in repository
maven2-repository.dev.java.net (http://download.java.net/maven/2)
Downloading: http://scala-tools.org/repo-releases/org/codehaus/plexus/plexus-utils/1.5.12/plexus-utils-1.5.12.jar
[INFO] Unable to find resource 'org.apache.maven:maven-archiver:jar:2.4' in repository maven2-repository.dev.java.net
(http://download.java.net/maven/2)
Downloading: http://scala-tools.org/repo-releases/org/apache/maven/maven-archiver/2.4/maven-archiver-2.4.jar
[INFO] Unable to find resource 'org.apache.maven.shared:maven-common-artifact-filters:jar:1.1'
in repository maven2-repository.dev.java.net (http://download.java.net/maven/2)
Downloading: http://scala-tools.org/repo-releases/org/apache/maven/shared/maven-common-artifact-filters/1.1/maven-common-artifact-filters-1.1.jar
[INFO] Unable to find resource 'org.codehaus.plexus:plexus-utils:jar:1.5.12' in repository
scala (http://scala-tools.org/repo-releases)
Downloading: http://scala-tools.org/repo-snapshots/org/codehaus/plexus/plexus-utils/1.5.12/plexus-utils-1.5.12.jar
[INFO] Unable to find resource 'org.apache.maven:maven-archiver:jar:2.4' in repository scala
(http://scala-tools.org/repo-releases)
Downloading: http://scala-tools.org/repo-snapshots/org/apache/maven/maven-archiver/2.4/maven-archiver-2.4.jar
[INFO] Unable to find resource 'org.apache.maven.shared:maven-common-artifact-filters:jar:1.1'
in repository scala (http://scala-tools.org/repo-releases)
Downloading: http://scala-tools.org/repo-snapshots/org/apache/maven/shared/maven-common-artifact-filters/1.1/maven-common-artifact-filters-1.1.jar
[INFO] Unable to find resource 'org.codehaus.plexus:plexus-utils:jar:1.5.12' in repository
snapshots.scala-tools.org (http://scala-tools.org/repo-snapshots)
Downloading: http://repo.fusesource.com/nexus/content/repositories/snapshots/org/codehaus/plexus/plexus-utils/1.5.12/plexus-utils-1.5.12.jar
[INFO] Unable to find resource 'org.apache.maven:maven-archiver:jar:2.4' in repository snapshots.scala-tools.org
(http://scala-tools.org/repo-snapshots)
Downloading: http://repo.fusesource.com/nexus/content/repositories/snapshots/org/apache/maven/maven-archiver/2.4/maven-archiver-2.4.jar
[INFO] Unable to find resource 'org.apache.maven.shared:maven-common-artifact-filters:jar:1.1'
in repository snapshots.scala-tools.org (http://scala-tools.org/repo-snapshots)
Downloading: http://repo.fusesource.com/nexus/content/repositories/snapshots/org/apache/maven/shared/maven-common-artifact-filters/1.1/maven-common-artifact-filters-1.1.jar
[INFO] Unable to find resource 'org.codehaus.plexus:plexus-utils:jar:1.5.12' in repository
fusesource.snapshots (http://repo.fusesource.com/nexus/content/repositories/snapshots)
Downloading: http://repo1.maven.org/maven2/org/codehaus/plexus/plexus-utils/1.5.12/plexus-utils-1.5.12.jar
[INFO] Unable to find resource 'org.apache.maven:maven-archiver:jar:2.4' in repository fusesource.snapshots
(http://repo.fusesource.com/nexus/content/repositories/snapshots)
Downloading: http://repo1.maven.org/maven2/org/apache/maven/maven-archiver/2.4/maven-archiver-2.4.jar
[INFO] Unable to find resource 'org.apache.maven.shared:maven-common-artifact-filters:jar:1.1'
in repository fusesource.snapshots (http://repo.fusesource.com/nexus/content/repositories/snapshots)
Downloading: http://repo1.maven.org/maven2/org/apache/maven/shared/maven-common-artifact-filters/1.1/maven-common-artifact-filters-1.1.jar



Downloading: http://repo.open.iona.com/maven2/org/apache/maven/shared/file-management/1.1/file-management-1.1.jar
Downloading: http://repo.open.iona.com/maven2/org/codehaus/plexus/plexus-archiver/1.0-alpha-12/plexus-archiver-1.0-alpha-12.jar
[INFO] Unable to find resource 'org.apache.maven.shared:file-management:jar:1.1' in repository
open.iona.m2 (http://repo.open.iona.com/maven2)
Downloading: http://download.java.net/maven/2/org/apache/maven/shared/file-management/1.1/file-management-1.1.jar
[INFO] Unable to find resource 'org.apache.maven.shared:file-management:jar:1.1' in repository
maven2-repository.dev.java.net (http://download.java.net/maven/2)
Downloading: http://scala-tools.org/repo-releases/org/apache/maven/shared/file-management/1.1/file-management-1.1.jar
[INFO] Unable to find resource 'org.codehaus.plexus:plexus-archiver:jar:1.0-alpha-12' in repository
open.iona.m2 (http://repo.open.iona.com/maven2)
Downloading: http://download.java.net/maven/2/org/codehaus/plexus/plexus-archiver/1.0-alpha-12/plexus-archiver-1.0-alpha-12.jar
[INFO] Unable to find resource 'org.apache.maven.shared:file-management:jar:1.1' in repository
scala (http://scala-tools.org/repo-releases)
Downloading: http://scala-tools.org/repo-snapshots/org/apache/maven/shared/file-management/1.1/file-management-1.1.jar
[INFO] Unable to find resource 'org.codehaus.plexus:plexus-archiver:jar:1.0-alpha-12' in repository
maven2-repository.dev.java.net (http://download.java.net/maven/2)
Downloading: http://scala-tools.org/repo-releases/org/codehaus/plexus/plexus-archiver/1.0-alpha-12/plexus-archiver-1.0-alpha-12.jar
[INFO] Unable to find resource 'org.apache.maven.shared:file-management:jar:1.1' in repository
snapshots.scala-tools.org (http://scala-tools.org/repo-snapshots)
Downloading: http://repo.fusesource.com/nexus/content/repositories/snapshots/org/apache/maven/shared/file-management/1.1/file-management-1.1.jar
[INFO] Unable to find resource 'org.codehaus.plexus:plexus-archiver:jar:1.0-alpha-12' in repository
scala (http://scala-tools.org/repo-releases)
Downloading: http://scala-tools.org/repo-snapshots/org/codehaus/plexus/plexus-archiver/1.0-alpha-12/plexus-archiver-1.0-alpha-12.jar
[INFO] Unable to find resource 'org.codehaus.plexus:plexus-archiver:jar:1.0-alpha-12' in repository
snapshots.scala-tools.org (http://scala-tools.org/repo-snapshots)
Downloading: http://repo.fusesource.com/nexus/content/repositories/snapshots/org/codehaus/plexus/plexus-archiver/1.0-alpha-12/plexus-archiver-1.0-alpha-12.jar
[INFO] Unable to find resource 'org.apache.maven.shared:file-management:jar:1.1' in repository
fusesource.snapshots (http://repo.fusesource.com/nexus/content/repositories/snapshots)
Downloading: http://repo1.maven.org/maven2/org/apache/maven/shared/file-management/1.1/file-management-1.1.jar

[INFO] Unable to find resource 'org.codehaus.plexus:plexus-archiver:jar:1.0-alpha-12' in repository
fusesource.snapshots (http://repo.fusesource.com/nexus/content/repositories/snapshots)
Downloading: http://repo1.maven.org/maven2/org/codehaus/plexus/plexus-archiver/1.0-alpha-12/plexus-archiver-1.0-alpha-12.jar
Downloading: http://repo.open.iona.com/maven2/org/apache/maven/shared/maven-repository-builder/1.0-alpha-2/maven-repository-builder-1.0-alpha-2.jar
[INFO] Unable to find resource 'org.apache.maven.shared:maven-repository-builder:jar:1.0-alpha-2'
in repository open.iona.m2 (http://repo.open.iona.com/maven2)
Downloading: http://download.java.net/maven/2/org/apache/maven/shared/maven-repository-builder/1.0-alpha-2/maven-repository-builder-1.0-alpha-2.jar
[INFO] Unable to find resource 'org.apache.maven.shared:maven-repository-builder:jar:1.0-alpha-2'
in repository maven2-repository.dev.java.net (http://download.java.net/maven/2)
Downloading: http://scala-tools.org/repo-releases/org/apache/maven/shared/maven-repository-builder/1.0-alpha-2/maven-repository-builder-1.0-alpha-2.jar
[INFO] Unable to find resource 'org.apache.maven.shared:maven-repository-builder:jar:1.0-alpha-2'
in repository scala (http://scala-tools.org/repo-releases)
Downloading: http://scala-tools.org/repo-snapshots/org/apache/maven/shared/maven-repository-builder/1.0-alpha-2/maven-repository-builder-1.0-alpha-2.jar
[INFO] Unable to find resource 'org.apache.maven.shared:maven-repository-builder:jar:1.0-alpha-2'
in repository snapshots.scala-tools.org (http://scala-tools.org/repo-snapshots)
Downloading: http://repo.fusesource.com/nexus/content/repositories/snapshots/org/apache/maven/shared/maven-repository-builder/1.0-alpha-2/maven-repository-builder-1.0-alpha-2.jar
[INFO] Unable to find resource 'org.apache.maven.shared:maven-repository-builder:jar:1.0-alpha-2'
in repository fusesource.snapshots (http://repo.fusesource.com/nexus/content/repositories/snapshots)
Downloading: http://repo1.maven.org/maven2/org/apache/maven/shared/maven-repository-builder/1.0-alpha-2/maven-repository-builder-1.0-alpha-2.jar


Downloading: http://repo.open.iona.com/maven2/org/codehaus/plexus/plexus-interpolation/1.7/plexus-interpolation-1.7.jar
[INFO] Unable to find resource 'org.codehaus.plexus:plexus-interpolation:jar:1.7' in repository
open.iona.m2 (http://repo.open.iona.com/maven2)
Downloading: http://download.java.net/maven/2/org/codehaus/plexus/plexus-interpolation/1.7/plexus-interpolation-1.7.jar
[INFO] Unable to find resource 'org.codehaus.plexus:plexus-interpolation:jar:1.7' in repository
maven2-repository.dev.java.net (http://download.java.net/maven/2)
Downloading: http://scala-tools.org/repo-releases/org/codehaus/plexus/plexus-interpolation/1.7/plexus-interpolation-1.7.jar
[INFO] Unable to find resource 'org.codehaus.plexus:plexus-interpolation:jar:1.7' in repository
scala (http://scala-tools.org/repo-releases)
Downloading: http://scala-tools.org/repo-snapshots/org/codehaus/plexus/plexus-interpolation/1.7/plexus-interpolation-1.7.jar
[INFO] Unable to find resource 'org.codehaus.plexus:plexus-interpolation:jar:1.7' in repository
snapshots.scala-tools.org (http://scala-tools.org/repo-snapshots)
Downloading: http://repo.fusesource.com/nexus/content/repositories/snapshots/org/codehaus/plexus/plexus-interpolation/1.7/plexus-interpolation-1.7.jar
[INFO] Unable to find resource 'org.codehaus.plexus:plexus-interpolation:jar:1.7' in repository
fusesource.snapshots (http://repo.fusesource.com/nexus/content/repositories/snapshots)
Downloading: http://repo1.maven.org/maven2/org/codehaus/plexus/plexus-interpolation/1.7/plexus-interpolation-1.7.jar

Downloading: http://repo.open.iona.com/maven2/org/codehaus/plexus/plexus-io/1.0-alpha-4/plexus-io-1.0-alpha-4.jar
[INFO] Unable to find resource 'org.codehaus.plexus:plexus-io:jar:1.0-alpha-4' in repository
open.iona.m2 (http://repo.open.iona.com/maven2)
Downloading: http://download.java.net/maven/2/org/codehaus/plexus/plexus-io/1.0-alpha-4/plexus-io-1.0-alpha-4.jar
[INFO] Unable to find resource 'org.codehaus.plexus:plexus-io:jar:1.0-alpha-4' in repository
maven2-repository.dev.java.net (http://download.java.net/maven/2)
Downloading: http://scala-tools.org/repo-releases/org/codehaus/plexus/plexus-io/1.0-alpha-4/plexus-io-1.0-alpha-4.jar
[INFO] Unable to find resource 'org.codehaus.plexus:plexus-io:jar:1.0-alpha-4' in repository
scala (http://scala-tools.org/repo-releases)
Downloading: http://scala-tools.org/repo-snapshots/org/codehaus/plexus/plexus-io/1.0-alpha-4/plexus-io-1.0-alpha-4.jar
[INFO] Unable to find resource 'org.codehaus.plexus:plexus-io:jar:1.0-alpha-4' in repository
snapshots.scala-tools.org (http://scala-tools.org/repo-snapshots)
Downloading: http://repo.fusesource.com/nexus/content/repositories/snapshots/org/codehaus/plexus/plexus-io/1.0-alpha-4/plexus-io-1.0-alpha-4.jar
[INFO] Unable to find resource 'org.codehaus.plexus:plexus-io:jar:1.0-alpha-4' in repository
fusesource.snapshots (http://repo.fusesource.com/nexus/content/repositories/snapshots)
Downloading: http://repo1.maven.org/maven2/org/codehaus/plexus/plexus-io/1.0-alpha-4/plexus-io-1.0-alpha-4.jar

Downloading: http://repo.open.iona.com/maven2/org/codehaus/plexus/plexus-active-collections/1.0-beta-2/plexus-active-collections-1.0-beta-2.jar
[INFO] Unable to find resource 'org.codehaus.plexus:plexus-active-collections:jar:1.0-beta-2'
in repository open.iona.m2 (http://repo.open.iona.com/maven2)
Downloading: http://download.java.net/maven/2/org/codehaus/plexus/plexus-active-collections/1.0-beta-2/plexus-active-collections-1.0-beta-2.jar
[INFO] Unable to find resource 'org.codehaus.plexus:plexus-active-collections:jar:1.0-beta-2'
in repository maven2-repository.dev.java.net (http://download.java.net/maven/2)
Downloading: http://scala-tools.org/repo-releases/org/codehaus/plexus/plexus-active-collections/1.0-beta-2/plexus-active-collections-1.0-beta-2.jar
[INFO] Unable to find resource 'org.codehaus.plexus:plexus-active-collections:jar:1.0-beta-2'
in repository scala (http://scala-tools.org/repo-releases)
Downloading: http://scala-tools.org/repo-snapshots/org/codehaus/plexus/plexus-active-collections/1.0-beta-2/plexus-active-collections-1.0-beta-2.jar
[INFO] Unable to find resource 'org.codehaus.plexus:plexus-active-collections:jar:1.0-beta-2'
in repository snapshots.scala-tools.org (http://scala-tools.org/repo-snapshots)
Downloading: http://repo.fusesource.com/nexus/content/repositories/snapshots/org/codehaus/plexus/plexus-active-collections/1.0-beta-2/plexus-active-collections-1.0-beta-2.jar
[INFO] Unable to find resource 'org.codehaus.plexus:plexus-active-collections:jar:1.0-beta-2'
in repository fusesource.snapshots (http://repo.fusesource.com/nexus/content/repositories/snapshots)
Downloading: http://repo1.maven.org/maven2/org/codehaus/plexus/plexus-active-collections/1.0-beta-2/plexus-active-collections-1.0-beta-2.jar

[INFO] [assembly:single {execution: unix-bin}]
[INFO] Reading assembly descriptor: <https://hudson.apache.org/hudson/job/ActiveMQ-Apollo-Deploy/ws/trunk/apollo-distro/src/main/descriptors/unix-bin.xml>
[INFO] No files selected for line-ending conversion or filtering. Skipping: <https://hudson.apache.org/hudson/job/ActiveMQ-Apollo-Deploy/ws/trunk/apollo-distro/..>
[WARNING] Cannot include project artifact: org.apache.activemq:apache-apollo:pom:1.0-SNAPSHOT;
it doesn't have an associated file or directory.
[INFO] Building tar : <https://hudson.apache.org/hudson/job/ActiveMQ-Apollo-Deploy/ws/trunk/apollo-distro/target/apache-apollo-1.0-SNAPSHOT-unix-distro.tar.gz>
[INFO] [assembly:single {execution: windows-bin}]
[INFO] Reading assembly descriptor: <https://hudson.apache.org/hudson/job/ActiveMQ-Apollo-Deploy/ws/trunk/apollo-distro/src/main/descriptors/windows-bin.xml>
[INFO] No files selected for line-ending conversion or filtering. Skipping: <https://hudson.apache.org/hudson/job/ActiveMQ-Apollo-Deploy/ws/trunk/apollo-distro/..>
[WARNING] Cannot include project artifact: org.apache.activemq:apache-apollo:pom:1.0-SNAPSHOT;
it doesn't have an associated file or directory.
[INFO] Building zip: <https://hudson.apache.org/hudson/job/ActiveMQ-Apollo-Deploy/ws/trunk/apollo-distro/target/apache-apollo-1.0-SNAPSHOT-windows-distro.zip>
[INFO] [install:install {execution: default-install}]
[INFO] Installing <https://hudson.apache.org/hudson/job/ActiveMQ-Apollo-Deploy/ws/trunk/apollo-distro/pom.xml>
to <https://hudson.apache.org/hudson/job/ActiveMQ-Apollo-Deploy/ws/.repository/org/apache/activemq/apache-apollo/1.0-SNAPSHOT/apache-apollo-1.0-SNAPSHOT.pom>
[INFO] Installing <https://hudson.apache.org/hudson/job/ActiveMQ-Apollo-Deploy/ws/trunk/apollo-distro/target/apache-apollo-1.0-SNAPSHOT-unix-distro.tar.gz>
to <https://hudson.apache.org/hudson/job/ActiveMQ-Apollo-Deploy/ws/.repository/org/apache/activemq/apache-apollo/1.0-SNAPSHOT/apache-apollo-1.0-SNAPSHOT-unix-distro.tar.gz>
[INFO] Installing <https://hudson.apache.org/hudson/job/ActiveMQ-Apollo-Deploy/ws/trunk/apollo-distro/target/apache-apollo-1.0-SNAPSHOT-windows-distro.zip>
to <https://hudson.apache.org/hudson/job/ActiveMQ-Apollo-Deploy/ws/.repository/org/apache/activemq/apache-apollo/1.0-SNAPSHOT/apache-apollo-1.0-SNAPSHOT-windows-distro.zip>
[INFO] [deploy:deploy {execution: default-deploy}]
[INFO] Retrieving previous build number from apache.snapshots.https
Uploading: https://repository.apache.org/content/repositories/snapshots/org/apache/activemq/apache-apollo/1.0-SNAPSHOT/apache-apollo-1.0-20101211.035721-38.pom
5K uploaded  (apache-apollo-1.0-20101211.035721-38.pom)
[INFO] Retrieving previous metadata from apache.snapshots.https
[INFO] Uploading repository metadata for: 'artifact org.apache.activemq:apache-apollo'
[INFO] Retrieving previous metadata from apache.snapshots.https
[INFO] Uploading repository metadata for: 'snapshot org.apache.activemq:apache-apollo:1.0-SNAPSHOT'
[INFO] Retrieving previous build number from apache.snapshots.https
Uploading: https://repository.apache.org/content/repositories/snapshots/org/apache/activemq/apache-apollo/1.0-SNAPSHOT/apache-apollo-1.0-20101211.035721-38-unix-distro.tar.gz
13450K uploaded  (apache-apollo-1.0-20101211.035721-38-unix-distro.tar.gz)
[INFO] Retrieving previous build number from apache.snapshots.https
Uploading: https://repository.apache.org/content/repositories/snapshots/org/apache/activemq/apache-apollo/1.0-SNAPSHOT/apache-apollo-1.0-20101211.035721-38-windows-distro.zip
13489K uploaded  (apache-apollo-1.0-20101211.035721-38-windows-distro.zip)
[HUDSON] Archiving <https://hudson.apache.org/hudson/job/ActiveMQ-Apollo-Deploy/ws/trunk/apollo-distro/pom.xml>
to /home/hudson/hudson/jobs/ActiveMQ-Apollo-Deploy/modules/org.apache.activemq$apache-apollo/builds/2010-12-11_03-50-37/archive/org.apache.activemq/apache-apollo/1.0-SNAPSHOT/pom.xml
[HUDSON] Archiving <https://hudson.apache.org/hudson/job/ActiveMQ-Apollo-Deploy/ws/.repository/org/apache/activemq/apache-apollo/1.0-SNAPSHOT/apache-apollo-1.0-SNAPSHOT.pom>
to /home/hudson/hudson/jobs/ActiveMQ-Apollo-Deploy/modules/org.apache.activemq$apache-apollo/builds/2010-12-11_03-50-37/archive/org.apache.activemq/apache-apollo/1.0-20101211.035721-38/apache-apollo-1.0-SNAPSHOT.pom
[HUDSON] Archiving <https://hudson.apache.org/hudson/job/ActiveMQ-Apollo-Deploy/ws/trunk/apollo-distro/target/apache-apollo-1.0-SNAPSHOT-unix-distro.tar.gz>
to /home/hudson/hudson/jobs/ActiveMQ-Apollo-Deploy/modules/org.apache.activemq$apache-apollo/builds/2010-12-11_03-50-37/archive/org.apache.activemq/apache-apollo/1.0-20101211.035721-38/apache-apollo-1.0-SNAPSHOT-unix-distro.tar.gz
[HUDSON] Archiving <https://hudson.apache.org/hudson/job/ActiveMQ-Apollo-Deploy/ws/trunk/apollo-distro/target/apache-apollo-1.0-SNAPSHOT-windows-distro.zip>
to /home/hudson/hudson/jobs/ActiveMQ-Apollo-Deploy/modules/org.apache.activemq$apache-apollo/builds/2010-12-11_03-50-37/archive/org.apache.activemq/apache-apollo/1.0-20101211.035721-38/apache-apollo-1.0-SNAPSHOT-windows-distro.zip
[INFO] 
[INFO] 
[INFO] ------------------------------------------------------------------------
[INFO] Reactor Summary:
[INFO] ------------------------------------------------------------------------
[INFO] Apache ActiveMQ Apollo Project ........................ SUCCESS [6:37.342s]
[INFO] apollo-scala .......................................... SUCCESS [2:23.584s]
[INFO] apollo-util ........................................... SUCCESS [4:02.606s]
[INFO] apollo-transport ...................................... SUCCESS [39.265s]
[INFO] apollo-dto ............................................ SUCCESS [3:58.543s]
[INFO] apollo-store .......................................... SUCCESS [1:58.276s]
[INFO] apollo-cassandra ...................................... SUCCESS [3:24.956s]
[INFO] apollo-selector ....................................... SUCCESS [2:42.298s]
[INFO] apollo-broker ......................................... SUCCESS [4:35.115s]
[INFO] apollo-tcp ............................................ SUCCESS [2:14.666s]
[INFO] apollo-web ............................................ SUCCESS [6:36.482s]
[INFO] apollo-hawtdb ......................................... SUCCESS [2:10.061s]
[INFO] apollo-bdb ............................................ SUCCESS [59.333s]
[INFO] apollo-stomp .......................................... SUCCESS [1:05.548s]
[INFO] apollo-cli ............................................ SUCCESS [2:16.918s]
[INFO] apollo-website ........................................ FAILED [2:53.754s]
[INFO] apache-apollo ......................................... SUCCESS [2:42.042s]
[INFO] ------------------------------------------------------------------------
[INFO] Error for project: apollo-website (during deploy)
[INFO] ------------------------------------------------------------------------
[INFO] Error uploading site

Embedded error: Cannot connect. Reason: Auth fail
[INFO] ------------------------------------------------------------------------
[INFO] Trace
org.apache.maven.lifecycle.LifecycleExecutionException: Error uploading site
	at org.apache.maven.lifecycle.DefaultLifecycleExecutor.executeGoals(DefaultLifecycleExecutor.java:719)
	at org.apache.maven.lifecycle.DefaultLifecycleExecutor.executeGoalWithLifecycle(DefaultLifecycleExecutor.java:556)
	at org.apache.maven.lifecycle.DefaultLifecycleExecutor.executeGoal(DefaultLifecycleExecutor.java:535)
	at org.apache.maven.lifecycle.DefaultLifecycleExecutor.executeGoalAndHandleFailures(DefaultLifecycleExecutor.java:387)
	at org.apache.maven.lifecycle.DefaultLifecycleExecutor.executeTaskSegments(DefaultLifecycleExecutor.java:348)
	at org.apache.maven.lifecycle.DefaultLifecycleExecutor.execute(DefaultLifecycleExecutor.java:180)
	at org.apache.maven.lifecycle.LifecycleExecutorInterceptor.execute(LifecycleExecutorInterceptor.java:65)
	at org.apache.maven.DefaultMaven.doExecute(DefaultMaven.java:328)
	at org.apache.maven.DefaultMaven.execute(DefaultMaven.java:138)
	at org.apache.maven.cli.MavenCli.main(MavenCli.java:362)
	at sun.reflect.NativeMethodAccessorImpl.invoke0(Native Method)
	at sun.reflect.NativeMethodAccessorImpl.invoke(NativeMethodAccessorImpl.java:39)
	at sun.reflect.DelegatingMethodAccessorImpl.invoke(DelegatingMethodAccessorImpl.java:25)
	at java.lang.reflect.Method.invoke(Method.java:597)
	at org.codehaus.classworlds.Launcher.launchEnhanced(Launcher.java:315)
	at org.codehaus.classworlds.Launcher.launch(Launcher.java:255)
	at hudson.maven.agent.Main.launch(Main.java:165)
	at hudson.maven.MavenBuilder.call(MavenBuilder.java:165)
	at hudson.maven.MavenModuleSetBuild$Builder.call(MavenModuleSetBuild.java:750)
	at hudson.maven.MavenModuleSetBuild$Builder.call(MavenModuleSetBuild.java:694)
	at hudson.remoting.UserRequest.perform(UserRequest.java:114)
	at hudson.remoting.UserRequest.perform(UserRequest.java:48)
	at hudson.remoting.Request$2.run(Request.java:270)
	at java.util.concurrent.Executors$RunnableAdapter.call(Executors.java:441)
	at java.util.concurrent.FutureTask$Sync.innerRun(FutureTask.java:303)
	at java.util.concurrent.FutureTask.run(FutureTask.java:138)
	at java.util.concurrent.ThreadPoolExecutor$Worker.runTask(ThreadPoolExecutor.java:886)
	at java.util.concurrent.ThreadPoolExecutor$Worker.run(ThreadPoolExecutor.java:908)
	at java.lang.Thread.run(Thread.java:619)
Caused by: org.apache.maven.plugin.MojoExecutionException: Error uploading site
	at org.fusesource.scalate.maven.SiteDeployMojo.execute(SiteDeployMojo.java:251)
	at org.apache.maven.plugin.DefaultPluginManager.executeMojo(DefaultPluginManager.java:490)
	at hudson.maven.agent.PluginManagerInterceptor.executeMojo(PluginManagerInterceptor.java:182)
	at org.apache.maven.lifecycle.DefaultLifecycleExecutor.executeGoals(DefaultLifecycleExecutor.java:694)
	... 28 more
Caused by: org.apache.maven.wagon.authentication.AuthenticationException: Cannot connect.
Reason: Auth fail
	at org.apache.maven.wagon.providers.ssh.jsch.AbstractJschWagon.openConnectionInternal(AbstractJschWagon.java:264)
	at org.apache.maven.wagon.AbstractWagon.openConnection(AbstractWagon.java:105)
	at org.apache.maven.wagon.AbstractWagon.connect(AbstractWagon.java:207)
	at org.apache.maven.wagon.AbstractWagon.connect(AbstractWagon.java:142)
	at org.fusesource.scalate.maven.SiteDeployMojo.execute(SiteDeployMojo.java:233)
	... 31 more
Caused by: com.jcraft.jsch.JSchException: Auth fail
	at com.jcraft.jsch.Session.connect(Session.java:451)
	at com.jcraft.jsch.Session.connect(Session.java:149)
	at org.apache.maven.wagon.providers.ssh.jsch.AbstractJschWagon.openConnectionInternal(AbstractJschWagon.java:236)
	... 35 more
[INFO] ------------------------------------------------------------------------
[INFO] BUILD ERRORS
[INFO] ------------------------------------------------------------------------
[INFO] Total time: 55 minutes 25 seconds
[INFO] Finished at: Fri Dec 10 20:46:11 PST 2010
[INFO] Final Memory: 158M/1651M
[INFO] ------------------------------------------------------------------------
Sending e-mails to: dev@activemq.apache.org
channel stopped


Mime
View raw message