activemq-dev mailing list archives

Site index · List index
Message view « Date » · « Thread »
Top « Date » · « Thread »
From riskrocks007 <rushikesh.ba...@gmail.com>
Subject Build Failure Error at activemq::xmpp
Date Tue, 14 Dec 2010 12:24:18 GMT

Hi,

I am installing activemq 5.4.1 on windows platform using maven 3.0.1. I am
getting the below error for Build Failure. Before this i had got the error
at core at that time I had already increased the memory size of maven by
command

set MAVEN_OPTS=-Xmx512m -XX:MaxPermSize=512m

Kindly suggest me how to pass this error stated below for activemq::xmpp

[INFO]
[INFO]
------------------------------------------------------------------------
[INFO] Building ActiveMQ :: XMPP 5.4.1
[INFO]
------------------------------------------------------------------------
Downloading:
http://download.java.net/maven/2/org/jvnet/jaxb2/maven2/maven-jaxb2
-plugin/0.7.2/maven-jaxb2-plugin-0.7.2.jar
Downloaded:
http://download.java.net/maven/2/org/jvnet/jaxb2/maven2/maven-jaxb2-
plugin/0.7.2/maven-jaxb2-plugin-0.7.2.jar (5 KB at 0.4 KB/sec)
Downloading:
http://download.java.net/maven/2/org/codehaus/woodstox/woodstox-cor
e-asl/4.0.7/woodstox-core-asl-4.0.7.pom
Downloading:
http://repository.springsource.com/maven/bundles/external/org/codeh
aus/woodstox/woodstox-core-asl/4.0.7/woodstox-core-asl-4.0.7.pom
Downloading:
http://repo1.maven.org/maven2/org/codehaus/woodstox/woodstox-core-a
sl/4.0.7/woodstox-core-asl-4.0.7.pom
Downloaded:
http://repo1.maven.org/maven2/org/codehaus/woodstox/woodstox-core-as
l/4.0.7/woodstox-core-asl-4.0.7.pom (2 KB at 0.4 KB/sec)
Downloading:
http://download.java.net/maven/2/org/codehaus/woodstox/stax2-api/3.
0.1/stax2-api-3.0.1.pom
Downloading:
http://repository.springsource.com/maven/bundles/external/org/codeh
aus/woodstox/stax2-api/3.0.1/stax2-api-3.0.1.pom
Downloading:
http://repo1.maven.org/maven2/org/codehaus/woodstox/stax2-api/3.0.1
/stax2-api-3.0.1.pom
Downloaded:
http://repo1.maven.org/maven2/org/codehaus/woodstox/stax2-api/3.0.1/
stax2-api-3.0.1.pom (2 KB at 0.3 KB/sec)
Downloading:
http://download.java.net/maven/2/com/sun/xml/bind/jaxb-impl/2.1.12/
jaxb-impl-2.1.12.pom
Downloading:
http://repository.springsource.com/maven/bundles/external/com/sun/x
ml/bind/jaxb-impl/2.1.12/jaxb-impl-2.1.12.pom
Downloading:
http://repo1.maven.org/maven2/com/sun/xml/bind/jaxb-impl/2.1.12/jax
b-impl-2.1.12.pom
Downloaded:
http://repo1.maven.org/maven2/com/sun/xml/bind/jaxb-impl/2.1.12/jaxb
-impl-2.1.12.pom (340 B at 0.1 KB/sec)
Downloading:
http://download.java.net/maven/2/javax/xml/bind/jaxb-api/2.1/jaxb-a
pi-2.1.pom
Downloading:
http://repository.springsource.com/maven/bundles/external/javax/xml
/bind/jaxb-api/2.1/jaxb-api-2.1.pom
Downloading:
http://repo1.maven.org/maven2/javax/xml/bind/jaxb-api/2.1/jaxb-api-
2.1.pom
Downloaded:
http://repo1.maven.org/maven2/javax/xml/bind/jaxb-api/2.1/jaxb-api-2
.1.pom (486 B at 0.2 KB/sec)
Downloading:
http://download.java.net/maven/2/javax/xml/stream/stax-api/1.0-2/st
ax-api-1.0-2.pom
Downloading:
http://repository.springsource.com/maven/bundles/external/javax/xml
/stream/stax-api/1.0-2/stax-api-1.0-2.pom
Downloading:
http://repo1.maven.org/maven2/javax/xml/stream/stax-api/1.0-2/stax-
api-1.0-2.pom
Downloaded:
http://repo1.maven.org/maven2/javax/xml/stream/stax-api/1.0-2/stax-a
pi-1.0-2.pom (962 B at 0.9 KB/sec)
Downloading:
http://download.java.net/maven/2/org/apache/geronimo/specs/geronimo
-activation_1.1_spec/1.0.2/geronimo-activation_1.1_spec-1.0.2.pom
Downloading:
http://repository.springsource.com/maven/bundles/external/org/apach
e/geronimo/specs/geronimo-activation_1.1_spec/1.0.2/geronimo-activation_1.1_spec
-1.0.2.pom
Downloading:
http://repo1.maven.org/maven2/org/apache/geronimo/specs/geronimo-ac
tivation_1.1_spec/1.0.2/geronimo-activation_1.1_spec-1.0.2.pom
Downloaded:
http://repo1.maven.org/maven2/org/apache/geronimo/specs/geronimo-act
ivation_1.1_spec/1.0.2/geronimo-activation_1.1_spec-1.0.2.pom (3 KB at 2.0
KB/se
c)
Downloading:
http://download.java.net/maven/2/jivesoftware/smack/3.1.0/smack-3.1
.0.pom
Downloading:
http://repository.springsource.com/maven/bundles/external/jivesoftw
are/smack/3.1.0/smack-3.1.0.pom
Downloading:
http://repo1.maven.org/maven2/jivesoftware/smack/3.1.0/smack-3.1.0.
pom
Downloaded:
http://repo1.maven.org/maven2/jivesoftware/smack/3.1.0/smack-3.1.0.p
om (941 B at 0.7 KB/sec)
Downloading:
http://download.java.net/maven/2/jivesoftware/smackx/3.1.0/smackx-3
.1.0.pom
Downloading:
http://repository.springsource.com/maven/bundles/external/jivesoftw
are/smackx/3.1.0/smackx-3.1.0.pom
Downloading:
http://repo1.maven.org/maven2/jivesoftware/smackx/3.1.0/smackx-3.1.
0.pom
Downloaded:
http://repo1.maven.org/maven2/jivesoftware/smackx/3.1.0/smackx-3.1.0
.pom (2 KB at 1.1 KB/sec)
Downloading:
http://download.java.net/maven/2/org/codehaus/woodstox/woodstox-cor
e-asl/4.0.7/woodstox-core-asl-4.0.7.jar
Downloading:
http://download.java.net/maven/2/org/codehaus/woodstox/stax2-api/3.
0.1/stax2-api-3.0.1.jar
Downloading:
http://download.java.net/maven/2/com/sun/xml/bind/jaxb-impl/2.1.12/
jaxb-impl-2.1.12.jar
Downloading:
http://download.java.net/maven/2/javax/xml/bind/jaxb-api/2.1/jaxb-a
pi-2.1.jar
Downloading:
http://download.java.net/maven/2/javax/xml/stream/stax-api/1.0-2/st
ax-api-1.0-2.jar
Downloading:
http://download.java.net/maven/2/org/apache/geronimo/specs/geronimo
-activation_1.1_spec/1.0.2/geronimo-activation_1.1_spec-1.0.2.jar
Downloading:
http://download.java.net/maven/2/jivesoftware/smack/3.1.0/smack-3.1
.0.jar
Downloading:
http://download.java.net/maven/2/jivesoftware/smackx/3.1.0/smackx-3
.1.0.jar
Downloading:
http://repository.springsource.com/maven/bundles/external/org/codeh
aus/woodstox/woodstox-core-asl/4.0.7/woodstox-core-asl-4.0.7.jar
Downloading:
http://repository.springsource.com/maven/bundles/external/org/codeh
aus/woodstox/stax2-api/3.0.1/stax2-api-3.0.1.jar
Downloading:
http://repository.springsource.com/maven/bundles/external/com/sun/x
ml/bind/jaxb-impl/2.1.12/jaxb-impl-2.1.12.jar
Downloading:
http://repository.springsource.com/maven/bundles/external/javax/xml
/bind/jaxb-api/2.1/jaxb-api-2.1.jar
Downloading:
http://repository.springsource.com/maven/bundles/external/javax/xml
/stream/stax-api/1.0-2/stax-api-1.0-2.jar
Downloading:
http://repository.springsource.com/maven/bundles/external/org/apach
e/geronimo/specs/geronimo-activation_1.1_spec/1.0.2/geronimo-activation_1.1_spec
-1.0.2.jar
Downloading:
http://repository.springsource.com/maven/bundles/external/jivesoftw
are/smack/3.1.0/smack-3.1.0.jar
Downloading:
http://repository.springsource.com/maven/bundles/external/jivesoftw
are/smackx/3.1.0/smackx-3.1.0.jar
Downloading:
http://repo1.maven.org/maven2/org/codehaus/woodstox/woodstox-core-a
sl/4.0.7/woodstox-core-asl-4.0.7.jar
Downloading:
http://repo1.maven.org/maven2/org/codehaus/woodstox/stax2-api/3.0.1
/stax2-api-3.0.1.jar
Downloading:
http://repo1.maven.org/maven2/com/sun/xml/bind/jaxb-impl/2.1.12/jax
b-impl-2.1.12.jar
Downloading:
http://repo1.maven.org/maven2/javax/xml/bind/jaxb-api/2.1/jaxb-api-
2.1.jar
Downloading:
http://repo1.maven.org/maven2/javax/xml/stream/stax-api/1.0-2/stax-
api-1.0-2.jar
Downloaded:
http://repo1.maven.org/maven2/javax/xml/stream/stax-api/1.0-2/stax-a
pi-1.0-2.jar (23 KB at 4.5 KB/sec)
Downloading:
http://repo1.maven.org/maven2/org/apache/geronimo/specs/geronimo-ac
tivation_1.1_spec/1.0.2/geronimo-activation_1.1_spec-1.0.2.jar
Downloaded:
http://repo1.maven.org/maven2/org/apache/geronimo/specs/geronimo-act
ivation_1.1_spec/1.0.2/geronimo-activation_1.1_spec-1.0.2.jar (34 KB at 1.9
KB/s
ec)
Downloading:
http://repo1.maven.org/maven2/jivesoftware/smack/3.1.0/smack-3.1.0.
jar
Downloaded:
http://repo1.maven.org/maven2/org/codehaus/woodstox/stax2-api/3.0.1/
stax2-api-3.0.1.jar (176 KB at 7.0 KB/sec)
Downloading:
http://repo1.maven.org/maven2/jivesoftware/smackx/3.1.0/smackx-3.1.
0.jar
Downloaded:
http://repo1.maven.org/maven2/org/codehaus/woodstox/woodstox-core-as
l/4.0.7/woodstox-core-asl-4.0.7.jar (472 KB at 18.0 KB/sec)
Downloaded:
http://repo1.maven.org/maven2/javax/xml/bind/jaxb-api/2.1/jaxb-api-2
.1.jar (88 KB at 3.2 KB/sec)
Downloaded:
http://repo1.maven.org/maven2/jivesoftware/smack/3.1.0/smack-3.1.0.j
ar (279 KB at 11.3 KB/sec)
Downloaded:
http://repo1.maven.org/maven2/com/sun/xml/bind/jaxb-impl/2.1.12/jaxb
-impl-2.1.12.jar (848 KB at 15.6 KB/sec)
Downloaded:
http://repo1.maven.org/maven2/jivesoftware/smackx/3.1.0/smackx-3.1.0
.jar (503 KB at 16.7 KB/sec)
[INFO]
[INFO] --- maven-clean-plugin:2.3:clean (default-clean) @ activemq-xmpp ---
[INFO]
[INFO] --- maven-enforcer-plugin:1.0-beta-1:enforce (default) @
activemq-xmpp --
-
[INFO]
[INFO] --- maven-bundle-plugin:2.1.0:cleanVersions (cleanVersions) @
activemq-xm
pp ---
[INFO]
[INFO] --- maven-jaxb2-plugin:0.7.2:generate (default) @ activemq-xmpp ---
Downloading:
http://download.java.net/maven/2/org/jvnet/jaxb2/maven2/maven-jaxb2
-plugin/0.7.2/maven-jaxb2-plugin-0.7.2.pom
Downloaded:
http://download.java.net/maven/2/org/jvnet/jaxb2/maven2/maven-jaxb2-
plugin/0.7.2/maven-jaxb2-plugin-0.7.2.pom (2 KB at 0.7 KB/sec)
Downloading:
http://download.java.net/maven/2/org/jvnet/jaxb2/maven2/maven-jaxb2
-plugin-project/0.7.2/maven-jaxb2-plugin-project-0.7.2.pom
Downloaded:
http://download.java.net/maven/2/org/jvnet/jaxb2/maven2/maven-jaxb2-
plugin-project/0.7.2/maven-jaxb2-plugin-project-0.7.2.pom (8 KB at 3.4
KB/sec)
Downloading:
http://download.java.net/maven/2/org/jvnet/jaxb2/maven2/maven-jaxb2
-plugin-raw/0.7.2/maven-jaxb2-plugin-raw-0.7.2.pom
Downloaded:
http://download.java.net/maven/2/org/jvnet/jaxb2/maven2/maven-jaxb2-
plugin-raw/0.7.2/maven-jaxb2-plugin-raw-0.7.2.pom (3 KB at 0.5 KB/sec)
Downloading:
http://download.java.net/maven/2/org/jfrog/maven/annomojo/maven-plu
gin-anno/1.3.1/maven-plugin-anno-1.3.1.pom
Downloaded:
http://download.java.net/maven/2/org/jfrog/maven/annomojo/maven-plug
in-anno/1.3.1/maven-plugin-anno-1.3.1.pom (820 B at 0.7 KB/sec)
Downloading:
http://download.java.net/maven/2/org/jfrog/maven/annomojo/maven-plu
gin-anno-parent/1.3.1/maven-plugin-anno-parent-1.3.1.pom
Downloaded:
http://download.java.net/maven/2/org/jfrog/maven/annomojo/maven-plug
in-anno-parent/1.3.1/maven-plugin-anno-parent-1.3.1.pom (6 KB at 3.1 KB/sec)
Downloading:
http://download.java.net/maven/2/org/jvnet/jaxb2_commons/jaxb2-basi
cs-jaxb-xjc/2.1.12/jaxb2-basics-jaxb-xjc-2.1.12.pom
Downloaded:
http://download.java.net/maven/2/org/jvnet/jaxb2_commons/jaxb2-basic
s-jaxb-xjc/2.1.12/jaxb2-basics-jaxb-xjc-2.1.12.pom (4 KB at 0.3 KB/sec)
Downloading:
http://download.java.net/maven/2/org/jvnet/jaxb2_commons/jaxb2-basi
cs-jaxb/2.1.12/jaxb2-basics-jaxb-2.1.12.pom
Downloaded:
http://download.java.net/maven/2/org/jvnet/jaxb2_commons/jaxb2-basic
s-jaxb/2.1.12/jaxb2-basics-jaxb-2.1.12.pom (2 KB at 0.7 KB/sec)
Downloading:
http://download.java.net/maven/2/com/sun/codemodel/codemodel/2.2/co
demodel-2.2.pom
Downloaded:
http://download.java.net/maven/2/com/sun/codemodel/codemodel/2.2/cod
emodel-2.2.pom (2 KB at 1.0 KB/sec)
Downloading:
http://download.java.net/maven/2/com/sun/codemodel/codemodel-projec
t/2.2/codemodel-project-2.2.pom
Downloaded:
http://download.java.net/maven/2/com/sun/codemodel/codemodel-project
/2.2/codemodel-project-2.2.pom (5 KB at 2.5 KB/sec)
Downloading:
http://download.java.net/maven/2/com/sun/xml/dtd-parser/dtd-parser/
1.0/dtd-parser-1.0.pom
[WARNING] Checksum validation failed, no checksums available from the
repository
 for
http://download.java.net/maven/2/com/sun/xml/dtd-parser/dtd-parser/1.0/dtd-
parser-1.0.pom
Downloaded:
http://download.java.net/maven/2/com/sun/xml/dtd-parser/dtd-parser/1
.0/dtd-parser-1.0.pom (407 B at 0.2 KB/sec)
Downloading:
http://download.java.net/maven/2/com/sun/istack/istack-commons-tool
s/1.1/istack-commons-tools-1.1.pom
[WARNING] Checksum validation failed, no checksums available from the
repository
 for
http://download.java.net/maven/2/com/sun/istack/istack-commons-tools/1.1/is
tack-commons-tools-1.1.pom
Downloaded:
http://download.java.net/maven/2/com/sun/istack/istack-commons-tools
/1.1/istack-commons-tools-1.1.pom (367 B at 0.1 KB/sec)
Downloading:
http://download.java.net/maven/2/relaxngDatatype/relaxngDatatype/20
020414/relaxngDatatype-20020414.pom
Downloading:
https://repository.apache.org/content/repositories/snapshots/relaxn
gDatatype/relaxngDatatype/20020414/relaxngDatatype-20020414.pom
Downloading:
http://repo1.maven.org/maven2/relaxngDatatype/relaxngDatatype/20020
414/relaxngDatatype-20020414.pom
Downloaded:
http://repo1.maven.org/maven2/relaxngDatatype/relaxngDatatype/200204
14/relaxngDatatype-20020414.pom (167 B at 0.1 KB/sec)
Downloading:
http://download.java.net/maven/2/com/sun/org/apache/xml/internal/re
solver/20050927/resolver-20050927.pom
Downloaded:
http://download.java.net/maven/2/com/sun/org/apache/xml/internal/res
olver/20050927/resolver-20050927.pom (177 B at 0.1 KB/sec)
Downloading:
http://download.java.net/maven/2/org/kohsuke/rngom/rngom/20061207/r
ngom-20061207.pom
[WARNING] Checksum validation failed, no checksums available from the
repository
 for
http://download.java.net/maven/2/org/kohsuke/rngom/rngom/20061207/rngom-200
61207.pom
Downloaded:
http://download.java.net/maven/2/org/kohsuke/rngom/rngom/20061207/rn
gom-20061207.pom (402 B at 0.2 KB/sec)
Downloading:
http://download.java.net/maven/2/com/sun/xsom/xsom/20081112/xsom-20
081112.pom
[WARNING] Checksum validation failed, no checksums available from the
repository
 for
http://download.java.net/maven/2/com/sun/xsom/xsom/20081112/xsom-20081112.p
om
Downloaded:
http://download.java.net/maven/2/com/sun/xsom/xsom/20081112/xsom-200
81112.pom (592 B at 0.1 KB/sec)
Downloading:
http://download.java.net/maven/2/org/jvnet/jaxb2/maven2/maven-jaxb2
-plugin-raw/0.7.2/maven-jaxb2-plugin-raw-0.7.2.jar
Downloading:
http://download.java.net/maven/2/org/jfrog/maven/annomojo/maven-plu
gin-anno/1.3.1/maven-plugin-anno-1.3.1.jar
Downloading:
http://download.java.net/maven/2/org/jvnet/jaxb2_commons/jaxb2-basi
cs-jaxb-xjc/2.1.12/jaxb2-basics-jaxb-xjc-2.1.12.jar
Downloading:
http://download.java.net/maven/2/com/sun/codemodel/codemodel/2.2/co
demodel-2.2.jar
Downloading:
http://download.java.net/maven/2/com/sun/xml/dtd-parser/dtd-parser/
1.0/dtd-parser-1.0.jar
Downloaded:
http://download.java.net/maven/2/org/jfrog/maven/annomojo/maven-plug
in-anno/1.3.1/maven-plugin-anno-1.3.1.jar (10 KB at 1.7 KB/sec)
Downloading:
http://download.java.net/maven/2/com/sun/istack/istack-commons-tool
s/1.1/istack-commons-tools-1.1.jar
[WARNING] Checksum validation failed, no checksums available from the
repository
 for
http://download.java.net/maven/2/com/sun/istack/istack-commons-tools/1.1/is
tack-commons-tools-1.1.jar
Downloaded:
http://download.java.net/maven/2/com/sun/istack/istack-commons-tools
/1.1/istack-commons-tools-1.1.jar (8 KB at 2.4 KB/sec)
Downloading:
http://download.java.net/maven/2/relaxngDatatype/relaxngDatatype/20
020414/relaxngDatatype-20020414.jar
Downloaded:
http://download.java.net/maven/2/org/jvnet/jaxb2/maven2/maven-jaxb2-
plugin-raw/0.7.2/maven-jaxb2-plugin-raw-0.7.2.jar (34 KB at 3.4 KB/sec)
Downloading:
http://download.java.net/maven/2/com/sun/org/apache/xml/internal/re
solver/20050927/resolver-20050927.jar
Downloading:
http://download.java.net/maven/2/org/kohsuke/rngom/rngom/20061207/r
ngom-20061207.jar
[WARNING] Checksum validation failed, no checksums available from the
repository
 for
http://download.java.net/maven/2/com/sun/xml/dtd-parser/dtd-parser/1.0/dtd-
parser-1.0.jar
Downloaded:
http://download.java.net/maven/2/com/sun/xml/dtd-parser/dtd-parser/1
.0/dtd-parser-1.0.jar (100 KB at 6.2 KB/sec)
Downloading:
http://download.java.net/maven/2/com/sun/xsom/xsom/20081112/xsom-20
081112.jar
Downloaded:
http://download.java.net/maven/2/com/sun/org/apache/xml/internal/res
olver/20050927/resolver-20050927.jar (67 KB at 7.0 KB/sec)
Downloaded:
http://download.java.net/maven/2/com/sun/codemodel/codemodel/2.2/cod
emodel-2.2.jar (141 KB at 7.1 KB/sec)
[WARNING] Checksum validation failed, no checksums available from the
repository
 for
http://download.java.net/maven/2/org/kohsuke/rngom/rngom/20061207/rngom-200
61207.jar
Downloaded:
http://download.java.net/maven/2/org/kohsuke/rngom/rngom/20061207/rn
gom-20061207.jar (290 KB at 15.0 KB/sec)
[WARNING] Checksum validation failed, no checksums available from the
repository
 for
http://download.java.net/maven/2/com/sun/xsom/xsom/20081112/xsom-20081112.j
ar
Downloaded:
http://download.java.net/maven/2/com/sun/xsom/xsom/20081112/xsom-200
81112.jar (369 KB at 15.9 KB/sec)
Downloaded:
http://download.java.net/maven/2/org/jvnet/jaxb2_commons/jaxb2-basic
s-jaxb-xjc/2.1.12/jaxb2-basics-jaxb-xjc-2.1.12.jar (2105 KB at 2.2 KB/sec)
Downloading:
https://repository.apache.org/content/repositories/snapshots/relaxn
gDatatype/relaxngDatatype/20020414/relaxngDatatype-20020414.jar
Downloading:
http://repo1.maven.org/maven2/relaxngDatatype/relaxngDatatype/20020
414/relaxngDatatype-20020414.jar
Downloaded:
http://repo1.maven.org/maven2/relaxngDatatype/relaxngDatatype/200204
14/relaxngDatatype-20020414.jar (19 KB at 5.4 KB/sec)
Cannot find CatalogManager.properties
[INFO]
------------------------------------------------------------------------
[INFO] Reactor Summary:
[INFO]
[INFO] ActiveMQ .......................................... SUCCESS
[14:39.157s]
[INFO] ActiveMQ :: KahaDB ................................ SUCCESS
[4:46.890s]
[INFO] ActiveMQ :: JAAS .................................. SUCCESS
[9:16.469s]
[INFO] Openwire Generator ................................ SUCCESS
[5:48.344s]
[INFO] ActiveMQ :: jmdns 1.0 ............................. SUCCESS [7.515s]
[INFO] ActiveMQ :: Core .................................. SUCCESS
[28:58.375s]
[INFO] ActiveMQ :: RA .................................... SUCCESS
[2:09.328s]
[INFO] ActiveMQ :: Pool .................................. SUCCESS
[1:46.750s]
[INFO] ActiveMQ :: Camel ................................. SUCCESS
[5:31.219s]
[INFO] ActiveMQ :: Console ............................... SUCCESS
[4:18.297s]
[INFO] ActiveMQ :: Optional .............................. SUCCESS
[7:06.094s]
[INFO] ActiveMQ :: Jar Bundle ............................ SUCCESS
[6:19.328s]
[INFO] ActiveMQ :: File Server ........................... SUCCESS
[2:13.328s]
[INFO] ActiveMQ :: Blueprint ............................. SUCCESS
[1:41.000s]
[INFO] ActiveMQ :: Apache Karaf .......................... SUCCESS
[25:08.016s]
[INFO] ActiveMQ :: RAR ................................... SUCCESS [58.875s]
[INFO] ActiveMQ :: Run Jar ............................... SUCCESS [43.157s]
[INFO] ActiveMQ :: Spring ................................ SUCCESS
[1:47.750s]
[INFO] ActiveMQ Tooling .................................. SUCCESS [0.218s]
[INFO] ActiveMQ :: Memory Usage Test Plugin .............. SUCCESS
[8:04.578s]
[INFO] ActiveMQ :: Performance Test Plugin ............... SUCCESS
[5:36.266s]
[INFO] ActiveMQ :: StartUp Plugin ........................ SUCCESS
[1:06.875s]
[INFO] ActiveMQ :: Web ................................... SUCCESS
[1:28.844s]
[INFO] ActiveMQ :: Web Demo .............................. SUCCESS
[1:05.937s]
[INFO] ActiveMQ :: XMPP .................................. FAILURE
[21:27.109s]
[INFO] ActiveMQ :: Web Console ........................... SKIPPED
[INFO] ActiveMQ :: Assembly .............................. SKIPPED
[INFO]
------------------------------------------------------------------------
[INFO] BUILD FAILURE
[INFO]
------------------------------------------------------------------------
[INFO] Total time: 2:46:55.703s
[INFO] Finished at: Tue Dec 14 17:46:04 IST 2010
[INFO] Final Memory: 29M/98M
[INFO]
------------------------------------------------------------------------
[ERROR] Failed to execute goal
org.jvnet.jaxb2.maven2:maven-jaxb2-plugin:0.7.2:g
enerate (default) on project activemq-xmpp: Execution default of goal
org.jvnet.
jaxb2.maven2:maven-jaxb2-plugin:0.7.2:generate failed: An API
incompatibility wa
s encountered while executing
org.jvnet.jaxb2.maven2:maven-jaxb2-plugin:0.7.2:ge
nerate: java.lang.LinkageError: JAXB 2.0 API is being loaded from the
bootstrap
classloader, but this RI (from
jar:file:/C:/Documents%20and%20Settings/Administr
ator/.m2/repository/com/sun/xml/bind/jaxb-impl/2.1.12/jaxb-impl-2.1.12.jar!/com/
sun/xml/bind/v2/model/impl/ModelBuilder.class) needs 2.1 API. Use the
endorsed d
irectory mechanism to place jaxb-api.jar in the bootstrap classloader. (See
http
://java.sun.com/j2se/1.5.0/docs/guide/standards/)
[ERROR] -----------------------------------------------------
[ERROR] realm =    plugin>org.jvnet.jaxb2.maven2:maven-jaxb2-plugin:0.7.2
[ERROR] strategy =
org.codehaus.plexus.classworlds.strategy.SelfFirstStrategy
[ERROR] urls[0] =
file:/C:/Documents%20and%20Settings/Administrator/.m2/reposito
ry/org/jvnet/jaxb2/maven2/maven-jaxb2-plugin/0.7.2/maven-jaxb2-plugin-0.7.2.jar
[ERROR] urls[1] =
file:/C:/Documents%20and%20Settings/Administrator/.m2/reposito
ry/org/jvnet/jaxb2/maven2/maven-jaxb2-plugin-raw/0.7.2/maven-jaxb2-plugin-raw-0.
7.2.jar
[ERROR] urls[2] =
file:/C:/Documents%20and%20Settings/Administrator/.m2/reposito
ry/org/codehaus/plexus/plexus-utils/1.1/plexus-utils-1.1.jar
[ERROR] urls[3] =
file:/C:/Documents%20and%20Settings/Administrator/.m2/reposito
ry/junit/junit/3.8.1/junit-3.8.1.jar
[ERROR] urls[4] =
file:/C:/Documents%20and%20Settings/Administrator/.m2/reposito
ry/org/jfrog/maven/annomojo/maven-plugin-anno/1.3.1/maven-plugin-anno-1.3.1.jar
[ERROR] urls[5] =
file:/C:/Documents%20and%20Settings/Administrator/.m2/reposito
ry/com/sun/xml/bind/jaxb-impl/2.1.12/jaxb-impl-2.1.12.jar
[ERROR] urls[6] =
file:/C:/Documents%20and%20Settings/Administrator/.m2/reposito
ry/javax/xml/bind/jaxb-api/2.1/jaxb-api-2.1.jar
[ERROR] urls[7] =
file:/C:/Documents%20and%20Settings/Administrator/.m2/reposito
ry/javax/xml/stream/stax-api/1.0-2/stax-api-1.0-2.jar
[ERROR] urls[8] =
file:/C:/Documents%20and%20Settings/Administrator/.m2/reposito
ry/javax/activation/activation/1.1/activation-1.1.jar
[ERROR] urls[9] =
file:/C:/Documents%20and%20Settings/Administrator/.m2/reposito
ry/org/jvnet/jaxb2_commons/jaxb2-basics-jaxb-xjc/2.1.12/jaxb2-basics-jaxb-xjc-2.
1.12.jar
[ERROR] urls[10] =
file:/C:/Documents%20and%20Settings/Administrator/.m2/reposit
ory/com/sun/codemodel/codemodel/2.2/codemodel-2.2.jar
[ERROR] urls[11] =
file:/C:/Documents%20and%20Settings/Administrator/.m2/reposit
ory/com/sun/xml/dtd-parser/dtd-parser/1.0/dtd-parser-1.0.jar
[ERROR] urls[12] =
file:/C:/Documents%20and%20Settings/Administrator/.m2/reposit
ory/com/sun/istack/istack-commons-tools/1.1/istack-commons-tools-1.1.jar
[ERROR] urls[13] =
file:/C:/Documents%20and%20Settings/Administrator/.m2/reposit
ory/relaxngDatatype/relaxngDatatype/20020414/relaxngDatatype-20020414.jar
[ERROR] urls[14] =
file:/C:/Documents%20and%20Settings/Administrator/.m2/reposit
ory/com/sun/org/apache/xml/internal/resolver/20050927/resolver-20050927.jar
[ERROR] urls[15] =
file:/C:/Documents%20and%20Settings/Administrator/.m2/reposit
ory/org/kohsuke/rngom/rngom/20061207/rngom-20061207.jar
[ERROR] urls[16] =
file:/C:/Documents%20and%20Settings/Administrator/.m2/reposit
ory/com/sun/xsom/xsom/20081112/xsom-20081112.jar
[ERROR] Number of foreign imports: 1
[ERROR] import: Entry[import  from realm
ClassRealm[project>org.apache.activemq:
activemq-parent:5.4.1, parent: ClassRealm[maven.api, parent: null]]]
[ERROR]
[ERROR] -----------------------------------------------------
[ERROR] -> [Help 1]
[ERROR]
[ERROR] To see the full stack trace of the errors, re-run Maven with the -e
swit
ch.
[ERROR] Re-run Maven using the -X switch to enable full debug logging.
[ERROR]
[ERROR] For more information about the errors and possible solutions, please
rea
d the following articles:
[ERROR] [Help 1]
http://cwiki.apache.org/confluence/display/MAVEN/PluginContaine
rException
[ERROR]
[ERROR] After correcting the problems, you can resume the build with the
command

[ERROR]   mvn <goals> -rf :activemq-xmpp
D:\apacheds-1.0.2>
-- 
View this message in context: http://activemq.2283324.n4.nabble.com/Build-Failure-Error-at-activemq-xmpp-tp3086961p3086961.html
Sent from the ActiveMQ - Dev mailing list archive at Nabble.com.

Mime
View raw message