activemq-dev mailing list archives

Site index · List index
Message view « Date » · « Thread »
Top « Date » · « Thread »
From Apache Hudson Server <hud...@hudson.apache.org>
Subject Build failed in Hudson: ActiveMQ-Apollo #15
Date Mon, 15 Nov 2010 21:14:23 GMT
See <https://hudson.apache.org/hudson/job/ActiveMQ-Apollo/15/changes>

Changes:

[chirino] Made the connection regroup feature an option that can be enabled via config

------------------------------------------
[...truncated 9297 lines...]
[INFO] ------------------------------------------------------------------------
[INFO] [clean:clean {execution: default-clean}]
[INFO] [enforcer:enforce {execution: default}]
[INFO] [remote-resources:process {execution: default}]
[INFO] [resources:resources {execution: default-resources}]
[INFO] Using 'UTF-8' encoding to copy filtered resources.
[INFO] skip non existing resourceDirectory <https://hudson.apache.org/hudson/job/ActiveMQ-Apollo/ws/trunk/apollo-website/target/schema>
[INFO] Copying 1 resource
[INFO] Copying 3 resources
[INFO] [compiler:compile {execution: default-compile}]
[INFO] Nothing to compile - all classes are up to date
[INFO] [scala:compile {execution: default}]
[INFO] Checking for multiple versions of scala
[INFO] includes = [**/*.scala,**/*.java,]
[INFO] excludes = []
[INFO] <https://hudson.apache.org/hudson/job/ActiveMQ-Apollo/ws/trunk/apollo-website/src/main/scala>:-1:
info: compiling
[INFO] Compiling 3 source files to <https://hudson.apache.org/hudson/job/ActiveMQ-Apollo/ws/trunk/apollo-website/target/classes>
at 1289855490799
[INFO] compiler plugin: BasicArtifact(org.scala-lang.plugins,continuations,2.8.0)
[INFO] prepare-compile in 0 s
[INFO] compile in 5 s
[INFO] [resources:testResources {execution: default-testResources}]
[INFO] Using 'UTF-8' encoding to copy filtered resources.
[INFO] skip non existing resourceDirectory <https://hudson.apache.org/hudson/job/ActiveMQ-Apollo/ws/trunk/apollo-website/src/test/resources>
[INFO] Copying 3 resources
[INFO] [compiler:testCompile {execution: default-testCompile}]
[INFO] No sources to compile
[INFO] [scala:testCompile {execution: default}]
[INFO] Checking for multiple versions of scala
[INFO] includes = [**/*.scala,**/*.java,]
[INFO] excludes = []
[WARNING] No source files found.
[INFO] [surefire:test {execution: default-test}]
[INFO] Surefire report directory: <https://hudson.apache.org/hudson/job/ActiveMQ-Apollo/ws/trunk/apollo-website/target/surefire-reports>

-------------------------------------------------------
 T E S T S
-------------------------------------------------------
There are no tests to run.

Results :

Tests run: 0, Failures: 0, Errors: 0, Skipped: 0

[HUDSON] Recording test results
[INFO] [war:war {execution: default-war}]
[INFO] Packaging webapp
[INFO] Assembling webapp[apollo-website] in [<https://hudson.apache.org/hudson/job/ActiveMQ-Apollo/ws/trunk/apollo-website/target/apollo-website-1.0-SNAPSHOT]>
[INFO] Processing war project
[INFO] Copying webapp resources[<https://hudson.apache.org/hudson/job/ActiveMQ-Apollo/ws/trunk/apollo-website/src/main/webapp]>
[INFO] Webapp assembled in[89 msecs]
[INFO] Building war: <https://hudson.apache.org/hudson/job/ActiveMQ-Apollo/ws/trunk/apollo-website/target/apollo-website-1.0-SNAPSHOT.war>
[INFO] Preparing source:jar
[WARNING] Removing: jar from forked lifecycle, to prevent recursive invocation.
[HUDSON] Archiving <https://hudson.apache.org/hudson/job/ActiveMQ-Apollo/ws/trunk/apollo-website/pom.xml>
to /home/hudson/hudson/jobs/ActiveMQ-Apollo/modules/org.apache.activemq$apollo-website/builds/2010-11-15_20-49-06/archive/org.apache.activemq/apollo-website/1.0-SNAPSHOT/pom.xml
[HUDSON] Archiving <https://hudson.apache.org/hudson/job/ActiveMQ-Apollo/ws/trunk/apollo-website/target/apollo-website-1.0-SNAPSHOT.war>
to /home/hudson/hudson/jobs/ActiveMQ-Apollo/modules/org.apache.activemq$apollo-website/builds/2010-11-15_20-49-06/archive/org.apache.activemq/apollo-website/1.0-SNAPSHOT/apollo-website-1.0-SNAPSHOT.war
[INFO] [enforcer:enforce {execution: default}]
[INFO] [source:jar {execution: attach-sources}]
[INFO] Building jar: <https://hudson.apache.org/hudson/job/ActiveMQ-Apollo/ws/trunk/apollo-website/target/apollo-website-1.0-SNAPSHOT-sources.jar>
[INFO] Preparing scalate:sitegen
[WARNING] Removing: jar from forked lifecycle, to prevent recursive invocation.
[WARNING] Removing: sitegen from forked lifecycle, to prevent recursive invocation.
[HUDSON] Archiving <https://hudson.apache.org/hudson/job/ActiveMQ-Apollo/ws/trunk/apollo-website/target/apollo-website-1.0-SNAPSHOT-sources.jar>
to /home/hudson/hudson/jobs/ActiveMQ-Apollo/modules/org.apache.activemq$apollo-website/builds/2010-11-15_20-49-06/archive/org.apache.activemq/apollo-website/1.0-SNAPSHOT/apollo-website-1.0-SNAPSHOT-sources.jar
[INFO] [enforcer:enforce {execution: default}]
[INFO] [remote-resources:process {execution: default}]
[INFO] [resources:resources {execution: default-resources}]
[INFO] Using 'UTF-8' encoding to copy filtered resources.
[INFO] skip non existing resourceDirectory <https://hudson.apache.org/hudson/job/ActiveMQ-Apollo/ws/trunk/apollo-website/target/schema>
[INFO] Copying 1 resource
[INFO] Copying 3 resources
[INFO] Copying 3 resources
[INFO] [compiler:compile {execution: default-compile}]
[INFO] Nothing to compile - all classes are up to date
[INFO] [scala:compile {execution: default}]
[INFO] Checking for multiple versions of scala
[INFO] Nothing to compile - all classes are up to date
[INFO] [resources:testResources {execution: default-testResources}]
[INFO] Using 'UTF-8' encoding to copy filtered resources.
[INFO] skip non existing resourceDirectory <https://hudson.apache.org/hudson/job/ActiveMQ-Apollo/ws/trunk/apollo-website/src/test/resources>
[INFO] Copying 3 resources
[INFO] Copying 3 resources
[INFO] [compiler:testCompile {execution: default-testCompile}]
[INFO] No sources to compile
[INFO] [scala:testCompile {execution: default}]
[INFO] Checking for multiple versions of scala
[INFO] includes = [**/*.scala,**/*.java,]
[INFO] excludes = []
[WARNING] No source files found.
[INFO] [surefire:test {execution: default-test}]
[INFO] Surefire report directory: <https://hudson.apache.org/hudson/job/ActiveMQ-Apollo/ws/trunk/apollo-website/target/surefire-reports>

-------------------------------------------------------
 T E S T S
-------------------------------------------------------
There are no tests to run.

Results :

Tests run: 0, Failures: 0, Errors: 0, Skipped: 0

[HUDSON] Recording test results
[INFO] [war:war {execution: default-war}]
[INFO] Packaging webapp
[INFO] Assembling webapp[apollo-website] in [<https://hudson.apache.org/hudson/job/ActiveMQ-Apollo/ws/trunk/apollo-website/target/apollo-website-1.0-SNAPSHOT]>
[INFO] Dependency[Dependency {groupId=org.fusesource.scalate, artifactId=scalate-wikitext,
version=1.4-SNAPSHOT, type=jar}] has changed (was Dependency {groupId=org.fusesource.scalate,
artifactId=scalate-wikitext, version=1.4-SNAPSHOT, type=jar}).
[INFO] Dependency[Dependency {groupId=org.fusesource.scalate, artifactId=scalate-page, version=1.4-SNAPSHOT,
type=jar}] has changed (was Dependency {groupId=org.fusesource.scalate, artifactId=scalate-page,
version=1.4-SNAPSHOT, type=jar}).
[WARNING] Could not retrieve the target file name of dependency[Dependency {groupId=org.fusesource.scalate,
artifactId=scalate-page, version=1.4-SNAPSHOT, type=jar}]
[INFO] Dependency[Dependency {groupId=org.fusesource.scalamd, artifactId=scalamd, version=1.2,
type=jar}] has changed (was Dependency {groupId=org.fusesource.scalamd, artifactId=scalamd,
version=1.2, type=jar}).
[INFO] Dependency[Dependency {groupId=org.slf4j, artifactId=slf4j-log4j12, version=1.6.0,
type=jar}] has changed (was Dependency {groupId=org.slf4j, artifactId=slf4j-log4j12, version=1.6.0,
type=jar}).
[INFO] Dependency[Dependency {groupId=org.scala-lang, artifactId=scala-library, version=2.8.0,
type=jar}] has changed (was Dependency {groupId=org.scala-lang, artifactId=scala-library,
version=2.8.0, type=jar}).
[INFO] Processing war project
[INFO] Copying webapp resources[<https://hudson.apache.org/hudson/job/ActiveMQ-Apollo/ws/trunk/apollo-website/src/main/webapp]>
[INFO] Webapp assembled in[55 msecs]
[INFO] Building war: <https://hudson.apache.org/hudson/job/ActiveMQ-Apollo/ws/trunk/apollo-website/target/apollo-website-1.0-SNAPSHOT.war>
[HUDSON] Re-archiving <https://hudson.apache.org/hudson/job/ActiveMQ-Apollo/ws/trunk/apollo-website/target/apollo-website-1.0-SNAPSHOT.war>
Processing Configuration for child elements
Processing child [project]
Processing child [scalateWorkDir]
Processing child [warSourceDirectory]
Processing child [resourcesSourceDirectory]
Processing child [targetDirectory]
Processing child [testClassPathElements]
[INFO] [scalate:sitegen {execution: sitegen}]
[INFO] Generating static website from Scalate Templates and wiki files...
[INFO]     processing <https://hudson.apache.org/hudson/job/ActiveMQ-Apollo/ws/trunk/apollo-website/src/main/webapp/versions/index.page>
with uri: /versions/index.page => 
Using dir: <https://hudson.apache.org/hudson/job/ActiveMQ-Apollo/ws/trunk/apollo-website/src/main/webapp/blog>
at request path: /blog
[INFO]     processing <https://hudson.apache.org/hudson/job/ActiveMQ-Apollo/ws/trunk/apollo-website/src/main/webapp/blog/index.page>
with uri: /blog/index.page => 
Using dir: <https://hudson.apache.org/hudson/job/ActiveMQ-Apollo/ws/trunk/apollo-website/src/main/webapp/blog>
at request path: /blog
[INFO]     processing <https://hudson.apache.org/hudson/job/ActiveMQ-Apollo/ws/trunk/apollo-website/src/main/webapp/blog/index.rss.feed>
with uri: /blog/index.rss.feed => 
[INFO]     processing <https://hudson.apache.org/hudson/job/ActiveMQ-Apollo/ws/trunk/apollo-website/src/main/webapp/index.page>
with uri: /index.page => 
[INFO]     processing <https://hudson.apache.org/hudson/job/ActiveMQ-Apollo/ws/trunk/apollo-website/src/main/webapp/download.page>
with uri: /download.page => 
[INFO]     processing <https://hudson.apache.org/hudson/job/ActiveMQ-Apollo/ws/trunk/apollo-website/src/main/webapp/community/faq.page>
with uri: /community/faq.page => 
[INFO]     processing <https://hudson.apache.org/hudson/job/ActiveMQ-Apollo/ws/trunk/apollo-website/src/main/webapp/community/site.page>
with uri: /community/site.page => 
[INFO]     processing <https://hudson.apache.org/hudson/job/ActiveMQ-Apollo/ws/trunk/apollo-website/src/main/webapp/community/index.page>
with uri: /community/index.page => 
[INFO]     processing <https://hudson.apache.org/hudson/job/ActiveMQ-Apollo/ws/trunk/apollo-website/src/main/webapp/community/building.page>
with uri: /community/building.page => 
[INFO]     processing <https://hudson.apache.org/hudson/job/ActiveMQ-Apollo/ws/trunk/apollo-website/src/main/webapp/community/release-guide.page>
with uri: /community/release-guide.page => 
[INFO]     processing <https://hudson.apache.org/hudson/job/ActiveMQ-Apollo/ws/trunk/apollo-website/src/main/webapp/community/developers.page>
with uri: /community/developers.page => 
[INFO]     processing <https://hudson.apache.org/hudson/job/ActiveMQ-Apollo/ws/trunk/apollo-website/src/main/webapp/community/support.page>
with uri: /community/support.page => 
[INFO]     processing <https://hudson.apache.org/hudson/job/ActiveMQ-Apollo/ws/trunk/apollo-website/src/main/webapp/community/contributing.page>
with uri: /community/contributing.page => 
[INFO]     processing <https://hudson.apache.org/hudson/job/ActiveMQ-Apollo/ws/trunk/apollo-website/src/main/webapp/community/source.page>
with uri: /community/source.page => 
[INFO]     processing <https://hudson.apache.org/hudson/job/ActiveMQ-Apollo/ws/trunk/apollo-website/src/main/webapp/documentation/performance-scaling.md>
with uri: /documentation/performance-scaling.md => 
[INFO]     processing <https://hudson.apache.org/hudson/job/ActiveMQ-Apollo/ws/trunk/apollo-website/src/main/webapp/documentation/index.page>
with uri: /documentation/index.page => 
[INFO]     processing <https://hudson.apache.org/hudson/job/ActiveMQ-Apollo/ws/trunk/apollo-website/src/main/webapp/documentation/architecture.md>
with uri: /documentation/architecture.md => 
[INFO]     processing <https://hudson.apache.org/hudson/job/ActiveMQ-Apollo/ws/trunk/apollo-website/src/main/webapp/documentation/module-organization.page>
with uri: /documentation/module-organization.page => 
[INFO]     processing <https://hudson.apache.org/hudson/job/ActiveMQ-Apollo/ws/trunk/apollo-website/src/main/webapp/documentation/getting-started.md>
with uri: /documentation/getting-started.md => 
[INFO]     processing <https://hudson.apache.org/hudson/job/ActiveMQ-Apollo/ws/trunk/apollo-website/src/main/webapp/privacy-policy.page>
with uri: /privacy-policy.page => 
[INFO] [install:install {execution: default-install}]
[INFO] Installing <https://hudson.apache.org/hudson/job/ActiveMQ-Apollo/ws/trunk/apollo-website/target/apollo-website-1.0-SNAPSHOT.war>
to <https://hudson.apache.org/hudson/job/ActiveMQ-Apollo/ws/.repository/org/apache/activemq/apollo-website/1.0-SNAPSHOT/apollo-website-1.0-SNAPSHOT.war>
[INFO] Installing <https://hudson.apache.org/hudson/job/ActiveMQ-Apollo/ws/trunk/apollo-website/target/apollo-website-1.0-SNAPSHOT-sources.jar>
to <https://hudson.apache.org/hudson/job/ActiveMQ-Apollo/ws/.repository/org/apache/activemq/apollo-website/1.0-SNAPSHOT/apollo-website-1.0-SNAPSHOT-sources.jar>
[INFO] Preparing source:jar
[WARNING] Removing: jar from forked lifecycle, to prevent recursive invocation.
[INFO] [enforcer:enforce {execution: default}]
[INFO] [source:jar {execution: default-cli}]
[INFO] Building jar: <https://hudson.apache.org/hudson/job/ActiveMQ-Apollo/ws/trunk/apollo-website/target/apollo-website-1.0-SNAPSHOT-sources.jar>
[HUDSON] Re-archiving <https://hudson.apache.org/hudson/job/ActiveMQ-Apollo/ws/trunk/apollo-website/target/apollo-website-1.0-SNAPSHOT-sources.jar>
[INFO] ------------------------------------------------------------------------
[INFO] SKIPPING apache-apollo
[INFO]    task-segment: [clean, install, source:jar]
[INFO] This project has been banned from further executions due to previous failures.
[INFO] ------------------------------------------------------------------------
[INFO] 
[INFO] 
[INFO] ------------------------------------------------------------------------
[INFO] Reactor Summary:
[INFO] ------------------------------------------------------------------------
[INFO] Apache ActiveMQ Apollo Project ........................ SUCCESS [6:15.674s]
[INFO] apollo-scala .......................................... SUCCESS [2:24.746s]
[INFO] apollo-util ........................................... SUCCESS [2:52.851s]
[INFO] apollo-transport ...................................... SUCCESS [4.421s]
[INFO] apollo-dto ............................................ SUCCESS [44.377s]
[INFO] apollo-store .......................................... SUCCESS [20.417s]
[INFO] apollo-cassandra ...................................... SUCCESS [33.444s]
[INFO] apollo-selector ....................................... SUCCESS [1:19.845s]
[INFO] apollo-broker ......................................... SUCCESS [39.262s]
[INFO] apollo-tcp ............................................ FAILED [0.723s]
[INFO] apollo-web ............................................ SUCCESS [4:44.086s]
[INFO] apollo-hawtdb ......................................... SUCCESS [37.076s]
[INFO] apollo-bdb ............................................ SUCCESS [36.651s]
[INFO] apollo-stomp .......................................... SKIPPED (dependency build failed
or was skipped)
[INFO] apollo-cli ............................................ SKIPPED (dependency build failed
or was skipped)
[INFO] apollo-website ........................................ SUCCESS [2:48.178s]
[INFO] apache-apollo ......................................... SKIPPED (dependency build failed
or was skipped)
[INFO] ------------------------------------------------------------------------
[INFO] Error for project: apollo-tcp (during install)
[INFO] ------------------------------------------------------------------------
[INFO] Compilation failure
<https://hudson.apache.org/hudson/job/ActiveMQ-Apollo/ws/trunk/apollo-tcp/src/main/java/org/apache/activemq/apollo/transport/tcp/SslTransportServer.java>:[52,35]
cannot find symbol
symbol  : method getDefault()
location: class javax.net.ssl.SSLContext


[INFO] ------------------------------------------------------------------------
[INFO] Trace
org.apache.maven.BuildFailureException: Compilation failure
<https://hudson.apache.org/hudson/job/ActiveMQ-Apollo/ws/trunk/apollo-tcp/src/main/java/org/apache/activemq/apollo/transport/tcp/SslTransportServer.java>:[52,35]
cannot find symbol
symbol  : method getDefault()
location: class javax.net.ssl.SSLContext


	at org.apache.maven.lifecycle.DefaultLifecycleExecutor.executeGoals(DefaultLifecycleExecutor.java:715)
	at org.apache.maven.lifecycle.DefaultLifecycleExecutor.executeGoalWithLifecycle(DefaultLifecycleExecutor.java:556)
	at org.apache.maven.lifecycle.DefaultLifecycleExecutor.executeGoal(DefaultLifecycleExecutor.java:535)
	at org.apache.maven.lifecycle.DefaultLifecycleExecutor.executeGoalAndHandleFailures(DefaultLifecycleExecutor.java:387)
	at org.apache.maven.lifecycle.DefaultLifecycleExecutor.executeTaskSegments(DefaultLifecycleExecutor.java:348)
	at org.apache.maven.lifecycle.DefaultLifecycleExecutor.execute(DefaultLifecycleExecutor.java:180)
	at org.apache.maven.lifecycle.LifecycleExecutorInterceptor.execute(LifecycleExecutorInterceptor.java:65)
	at org.apache.maven.DefaultMaven.doExecute(DefaultMaven.java:328)
	at org.apache.maven.DefaultMaven.execute(DefaultMaven.java:138)
	at org.apache.maven.cli.MavenCli.main(MavenCli.java:362)
	at sun.reflect.NativeMethodAccessorImpl.invoke0(Native Method)
	at sun.reflect.NativeMethodAccessorImpl.invoke(NativeMethodAccessorImpl.java:39)
	at sun.reflect.DelegatingMethodAccessorImpl.invoke(DelegatingMethodAccessorImpl.java:25)
	at java.lang.reflect.Method.invoke(Method.java:592)
	at org.codehaus.classworlds.Launcher.launchEnhanced(Launcher.java:315)
	at org.codehaus.classworlds.Launcher.launch(Launcher.java:255)
	at hudson.maven.agent.Main.launch(Main.java:165)
	at hudson.maven.MavenBuilder.call(MavenBuilder.java:165)
	at hudson.maven.MavenModuleSetBuild$Builder.call(MavenModuleSetBuild.java:750)
	at hudson.maven.MavenModuleSetBuild$Builder.call(MavenModuleSetBuild.java:694)
	at hudson.remoting.UserRequest.perform(UserRequest.java:114)
	at hudson.remoting.UserRequest.perform(UserRequest.java:48)
	at hudson.remoting.Request$2.run(Request.java:270)
	at java.util.concurrent.Executors$RunnableAdapter.call(Executors.java:417)
	at java.util.concurrent.FutureTask$Sync.innerRun(FutureTask.java:269)
	at java.util.concurrent.FutureTask.run(FutureTask.java:123)
	at java.util.concurrent.ThreadPoolExecutor$Worker.runTask(ThreadPoolExecutor.java:651)
	at java.util.concurrent.ThreadPoolExecutor$Worker.run(ThreadPoolExecutor.java:676)
	at java.lang.Thread.run(Thread.java:595)
Caused by: org.apache.maven.plugin.CompilationFailureException: Compilation failure
<https://hudson.apache.org/hudson/job/ActiveMQ-Apollo/ws/trunk/apollo-tcp/src/main/java/org/apache/activemq/apollo/transport/tcp/SslTransportServer.java>:[52,35]
cannot find symbol
symbol  : method getDefault()
location: class javax.net.ssl.SSLContext


	at org.apache.maven.plugin.AbstractCompilerMojo.execute(AbstractCompilerMojo.java:516)
	at org.apache.maven.plugin.CompilerMojo.execute(CompilerMojo.java:114)
	at org.apache.maven.plugin.DefaultPluginManager.executeMojo(DefaultPluginManager.java:490)
	at hudson.maven.agent.PluginManagerInterceptor.executeMojo(PluginManagerInterceptor.java:182)
	at org.apache.maven.lifecycle.DefaultLifecycleExecutor.executeGoals(DefaultLifecycleExecutor.java:694)
	... 28 more
[INFO] ------------------------------------------------------------------------
[INFO] BUILD ERRORS
[INFO] ------------------------------------------------------------------------
[INFO] Total time: 25 minutes 5 seconds
[INFO] Finished at: Mon Nov 15 21:14:20 UTC 2010
[INFO] Final Memory: 89M/1102M
[INFO] ------------------------------------------------------------------------
Sending e-mails to: dev@activemq.apache.org
Sending e-mails to: dev@activemq.apache.org
channel stopped


Mime
View raw message