activemq-dev mailing list archives

Site index · List index
Message view « Date » · « Thread »
Top « Date » · « Thread »
From Apache Hudson Server <hud...@hudson.apache.org>
Subject Build failed in Hudson: ActiveMQ #498
Date Mon, 08 Nov 2010 16:06:32 GMT
See <https://hudson.apache.org/hudson/job/ActiveMQ/498/changes>

Changes:

[dejanb] https://issues.apache.org/activemq/browse/AMQ-3021 - HttpTunnelServlet leak

------------------------------------------
[...truncated 11725 lines...]
Downloading: http://repo1.maven.org/maven2/opensymphony/sitemesh/2.2.1/sitemesh-2.2.1.jar
[INFO] Unable to find resource 'org.eclipse.jdt.core.compiler:ecj:jar:3.5.1' in repository
com.springsource.repository.bundles.external (http://repository.springsource.com/maven/bundles/external)
Downloading: http://download.java.net/maven/1/org.eclipse.jdt.core.compiler/jars/ecj-3.5.1.jar
[INFO] Unable to find resource 'org.eclipse.jdt.core.compiler:ecj:jar:3.5.1' in repository
dev.java.net (http://download.java.net/maven/1)
Downloading: http://download.java.net/maven/2/org/eclipse/jdt/core/compiler/ecj/3.5.1/ecj-3.5.1.jar
[INFO] Unable to find resource 'org.eclipse.jdt.core.compiler:ecj:jar:3.5.1' in repository
java.net (http://download.java.net/maven/2)
Downloading: http://download.java.net/maven/1/org.eclipse.jdt.core.compiler/jars/ecj-3.5.1.jar
[INFO] Unable to find resource 'org.eclipse.jdt.core.compiler:ecj:jar:3.5.1' in repository
m1.java.net (http://download.java.net/maven/1)
Downloading: http://repo1.maven.org/maven2/org/eclipse/jdt/core/compiler/ecj/3.5.1/ecj-3.5.1.jar



Downloading: http://repository.springsource.com/maven/bundles/external/org/mortbay/jetty/jsp-api-2.1-glassfish/2.1.v20100127/jsp-api-2.1-glassfish-2.1.v20100127.jar
[INFO] Unable to find resource 'org.mortbay.jetty:jsp-api-2.1-glassfish:jar:2.1.v20100127'
in repository com.springsource.repository.bundles.external (http://repository.springsource.com/maven/bundles/external)
Downloading: http://download.java.net/maven/1/org.mortbay.jetty/jars/jsp-api-2.1-glassfish-2.1.v20100127.jar

[INFO] Unable to find resource 'org.mortbay.jetty:jsp-api-2.1-glassfish:jar:2.1.v20100127'
in repository dev.java.net (http://download.java.net/maven/1)
Downloading: http://download.java.net/maven/2/org/mortbay/jetty/jsp-api-2.1-glassfish/2.1.v20100127/jsp-api-2.1-glassfish-2.1.v20100127.jar
[INFO] Unable to find resource 'org.mortbay.jetty:jsp-api-2.1-glassfish:jar:2.1.v20100127'
in repository java.net (http://download.java.net/maven/2)
Downloading: http://download.java.net/maven/1/org.mortbay.jetty/jars/jsp-api-2.1-glassfish-2.1.v20100127.jar
[INFO] Unable to find resource 'org.mortbay.jetty:jsp-api-2.1-glassfish:jar:2.1.v20100127'
in repository m1.java.net (http://download.java.net/maven/1)
Downloading: http://repo1.maven.org/maven2/org/mortbay/jetty/jsp-api-2.1-glassfish/2.1.v20100127/jsp-api-2.1-glassfish-2.1.v20100127.jar


[INFO] [enforcer:enforce {execution: default}]
[INFO] [bundle:cleanVersions {execution: cleanVersions}]
[INFO] [remote-resources:process {execution: default}]
[INFO] [resources:resources {execution: default-resources}]
[INFO] Using 'UTF-8' encoding to copy filtered resources.
[INFO] Copying 1 resource
[INFO] Copying 3 resources
[INFO] [compiler:compile {execution: default-compile}]
[INFO] Compiling 13 source files to <https://hudson.apache.org/hudson/job/ActiveMQ/ws/trunk/activemq-web-console/target/classes>
[INFO] [bundle:manifest {execution: bundle-manifest}]
[WARNING] Warning in manifest for org.apache.activemq:activemq-web-console:war:5.5-SNAPSHOT
: No sub JAR or directory WEB-INF/classes
[WARNING] Warning in manifest for org.apache.activemq:activemq-web-console:war:5.5-SNAPSHOT
: No sub JAR or directory WEB-INF/lib/jetty-util-7.1.6.v20100715.jar
[WARNING] Warning in manifest for org.apache.activemq:activemq-web-console:war:5.5-SNAPSHOT
: No sub JAR or directory WEB-INF/lib/commons-pool-1.5.4.jar
[WARNING] Warning in manifest for org.apache.activemq:activemq-web-console:war:5.5-SNAPSHOT
: No sub JAR or directory WEB-INF/lib/aopalliance-1.0.jar
[WARNING] Warning in manifest for org.apache.activemq:activemq-web-console:war:5.5-SNAPSHOT
: No sub JAR or directory WEB-INF/lib/spring-expression-3.0.3.RELEASE.jar
[WARNING] Warning in manifest for org.apache.activemq:activemq-web-console:war:5.5-SNAPSHOT
: No sub JAR or directory WEB-INF/lib/jetty-http-7.1.6.v20100715.jar
[WARNING] Warning in manifest for org.apache.activemq:activemq-web-console:war:5.5-SNAPSHOT
: No sub JAR or directory WEB-INF/lib/geronimo-jms_1.1_spec-1.1.1.jar
[WARNING] Warning in manifest for org.apache.activemq:activemq-web-console:war:5.5-SNAPSHOT
: No sub JAR or directory WEB-INF/lib/stax-api-1.0-2.jar
[WARNING] Warning in manifest for org.apache.activemq:activemq-web-console:war:5.5-SNAPSHOT
: No sub JAR or directory WEB-INF/lib/sitemesh-2.2.1.jar
[WARNING] Warning in manifest for org.apache.activemq:activemq-web-console:war:5.5-SNAPSHOT
: No sub JAR or directory WEB-INF/lib/stax-api-1.0.1.jar
[WARNING] Warning in manifest for org.apache.activemq:activemq-web-console:war:5.5-SNAPSHOT
: No sub JAR or directory WEB-INF/lib/spring-web-3.0.3.RELEASE.jar
[WARNING] Warning in manifest for org.apache.activemq:activemq-web-console:war:5.5-SNAPSHOT
: No sub JAR or directory WEB-INF/lib/jstl-1.0.jar
[WARNING] Warning in manifest for org.apache.activemq:activemq-web-console:war:5.5-SNAPSHOT
: No sub JAR or directory WEB-INF/lib/geronimo-jta_1.0.1B_spec-1.0.1.jar
[WARNING] Warning in manifest for org.apache.activemq:activemq-web-console:war:5.5-SNAPSHOT
: No sub JAR or directory WEB-INF/lib/standard-1.1.2.jar
[WARNING] Warning in manifest for org.apache.activemq:activemq-web-console:war:5.5-SNAPSHOT
: No sub JAR or directory WEB-INF/lib/commons-management-1.0.jar
[WARNING] Warning in manifest for org.apache.activemq:activemq-web-console:war:5.5-SNAPSHOT
: No sub JAR or directory WEB-INF/lib/jetty-server-7.1.6.v20100715.jar
[WARNING] Warning in manifest for org.apache.activemq:activemq-web-console:war:5.5-SNAPSHOT
: No sub JAR or directory WEB-INF/lib/xpp3-1.1.4c.jar
[WARNING] Warning in manifest for org.apache.activemq:activemq-web-console:war:5.5-SNAPSHOT
: No sub JAR or directory WEB-INF/lib/jaxb-impl-2.1.6.jar
[WARNING] Warning in manifest for org.apache.activemq:activemq-web-console:war:5.5-SNAPSHOT
: No sub JAR or directory WEB-INF/lib/commons-net-2.0.jar
[WARNING] Warning in manifest for org.apache.activemq:activemq-web-console:war:5.5-SNAPSHOT
: No sub JAR or directory WEB-INF/lib/jasypt-1.6.jar
[WARNING] Warning in manifest for org.apache.activemq:activemq-web-console:war:5.5-SNAPSHOT
: No sub JAR or directory WEB-INF/lib/activemq-protobuf-1.1.jar
[WARNING] Warning in manifest for org.apache.activemq:activemq-web-console:war:5.5-SNAPSHOT
: No sub JAR or directory WEB-INF/lib/josql-1.5.jar
[WARNING] Warning in manifest for org.apache.activemq:activemq-web-console:war:5.5-SNAPSHOT
: No sub JAR or directory WEB-INF/lib/rome-0.8.jar
[WARNING] Warning in manifest for org.apache.activemq:activemq-web-console:war:5.5-SNAPSHOT
: No sub JAR or directory WEB-INF/lib/commons-collections-3.2.1.jar
[WARNING] Warning in manifest for org.apache.activemq:activemq-web-console:war:5.5-SNAPSHOT
: No sub JAR or directory WEB-INF/lib/org.osgi.core-4.1.0.jar
[WARNING] Warning in manifest for org.apache.activemq:activemq-web-console:war:5.5-SNAPSHOT
: No sub JAR or directory WEB-INF/lib/activemq-xmpp-5.5-SNAPSHOT.jar
[WARNING] Warning in manifest for org.apache.activemq:activemq-web-console:war:5.5-SNAPSHOT
: No sub JAR or directory WEB-INF/lib/commons-logging-1.1.jar
[WARNING] Warning in manifest for org.apache.activemq:activemq-web-console:war:5.5-SNAPSHOT
: No sub JAR or directory WEB-INF/lib/activemq-console-5.5-SNAPSHOT.jar
[WARNING] Warning in manifest for org.apache.activemq:activemq-web-console:war:5.5-SNAPSHOT
: No sub JAR or directory WEB-INF/lib/xpp3_min-1.1.4c.jar
[WARNING] Warning in manifest for org.apache.activemq:activemq-web-console:war:5.5-SNAPSHOT
: No sub JAR or directory WEB-INF/lib/activemq-core-5.5-SNAPSHOT.jar
[WARNING] Warning in manifest for org.apache.activemq:activemq-web-console:war:5.5-SNAPSHOT
: No sub JAR or directory WEB-INF/lib/spring-webmvc-3.0.3.RELEASE.jar
[WARNING] Warning in manifest for org.apache.activemq:activemq-web-console:war:5.5-SNAPSHOT
: No sub JAR or directory WEB-INF/lib/commons-codec-1.1.jar
[WARNING] Warning in manifest for org.apache.activemq:activemq-web-console:war:5.5-SNAPSHOT
: No sub JAR or directory WEB-INF/lib/xstream-1.3.1.jar
[WARNING] Warning in manifest for org.apache.activemq:activemq-web-console:war:5.5-SNAPSHOT
: No sub JAR or directory WEB-INF/lib/camel-spring-2.4.0.jar
[WARNING] Warning in manifest for org.apache.activemq:activemq-web-console:war:5.5-SNAPSHOT
: No sub JAR or directory WEB-INF/lib/slf4j-api-1.5.0.jar
[WARNING] Warning in manifest for org.apache.activemq:activemq-web-console:war:5.5-SNAPSHOT
: No sub JAR or directory WEB-INF/lib/spring-context-support-3.0.3.RELEASE.jar
[WARNING] Warning in manifest for org.apache.activemq:activemq-web-console:war:5.5-SNAPSHOT
: No sub JAR or directory WEB-INF/lib/spring-asm-3.0.3.RELEASE.jar
[WARNING] Warning in manifest for org.apache.activemq:activemq-web-console:war:5.5-SNAPSHOT
: No sub JAR or directory WEB-INF/lib/commons-logging-api-1.1.jar
[WARNING] Warning in manifest for org.apache.activemq:activemq-web-console:war:5.5-SNAPSHOT
: No sub JAR or directory WEB-INF/lib/jetty-io-7.1.6.v20100715.jar
[WARNING] Warning in manifest for org.apache.activemq:activemq-web-console:war:5.5-SNAPSHOT
: No sub JAR or directory WEB-INF/lib/stax2-api-3.0.1.jar
[WARNING] Warning in manifest for org.apache.activemq:activemq-web-console:war:5.5-SNAPSHOT
: No sub JAR or directory WEB-INF/lib/log4j-1.2.14.jar
[WARNING] Warning in manifest for org.apache.activemq:activemq-web-console:war:5.5-SNAPSHOT
: No sub JAR or directory WEB-INF/lib/camel-core-2.4.0.jar
[WARNING] Warning in manifest for org.apache.activemq:activemq-web-console:war:5.5-SNAPSHOT
: No sub JAR or directory WEB-INF/lib/woodstox-core-asl-4.0.7.jar
[WARNING] Warning in manifest for org.apache.activemq:activemq-web-console:war:5.5-SNAPSHOT
: No sub JAR or directory WEB-INF/lib/jaxb-api-2.1.jar
[WARNING] Warning in manifest for org.apache.activemq:activemq-web-console:war:5.5-SNAPSHOT
: No sub JAR or directory WEB-INF/lib/activemq-camel-5.5-SNAPSHOT.jar
[WARNING] Warning in manifest for org.apache.activemq:activemq-web-console:war:5.5-SNAPSHOT
: No sub JAR or directory WEB-INF/lib/jetty-continuation-7.1.6.v20100715.jar
[WARNING] Warning in manifest for org.apache.activemq:activemq-web-console:war:5.5-SNAPSHOT
: No sub JAR or directory WEB-INF/lib/jetty-websocket-7.1.6.v20100715.jar
[WARNING] Warning in manifest for org.apache.activemq:activemq-web-console:war:5.5-SNAPSHOT
: No sub JAR or directory WEB-INF/lib/geronimo-activation_1.1_spec-1.0.2.jar
[WARNING] Warning in manifest for org.apache.activemq:activemq-web-console:war:5.5-SNAPSHOT
: No sub JAR or directory WEB-INF/lib/geronimo-jacc_1.1_spec-1.0.1.jar
[WARNING] Warning in manifest for org.apache.activemq:activemq-web-console:war:5.5-SNAPSHOT
: No sub JAR or directory WEB-INF/lib/servlet-api-2.5.jar
[WARNING] Warning in manifest for org.apache.activemq:activemq-web-console:war:5.5-SNAPSHOT
: No sub JAR or directory WEB-INF/lib/velocity-1.6.2.jar
[WARNING] Warning in manifest for org.apache.activemq:activemq-web-console:war:5.5-SNAPSHOT
: No sub JAR or directory WEB-INF/lib/kahadb-5.5-SNAPSHOT.jar
[WARNING] Warning in manifest for org.apache.activemq:activemq-web-console:war:5.5-SNAPSHOT
: No sub JAR or directory WEB-INF/lib/jdom-1.0.jar
[WARNING] Warning in manifest for org.apache.activemq:activemq-web-console:war:5.5-SNAPSHOT
: No sub JAR or directory WEB-INF/lib/camel-jms-2.4.0.jar
[WARNING] Warning in manifest for org.apache.activemq:activemq-web-console:war:5.5-SNAPSHOT
: No sub JAR or directory WEB-INF/lib/oro-2.0.8.jar
[WARNING] Warning in manifest for org.apache.activemq:activemq-web-console:war:5.5-SNAPSHOT
: No sub JAR or directory WEB-INF/lib/spring-jms-3.0.3.RELEASE.jar
[WARNING] Warning in manifest for org.apache.activemq:activemq-web-console:war:5.5-SNAPSHOT
: No sub JAR or directory WEB-INF/lib/icu4j-4.0.1.jar
[WARNING] Warning in manifest for org.apache.activemq:activemq-web-console:war:5.5-SNAPSHOT
: No sub JAR or directory WEB-INF/lib/slf4j-log4j12-1.5.0.jar
[WARNING] Warning in manifest for org.apache.activemq:activemq-web-console:war:5.5-SNAPSHOT
: No sub JAR or directory WEB-INF/lib/derby-10.1.3.1.jar
[WARNING] Warning in manifest for org.apache.activemq:activemq-web-console:war:5.5-SNAPSHOT
: No sub JAR or directory WEB-INF/lib/stax-1.2.0.jar
[WARNING] Warning in manifest for org.apache.activemq:activemq-web-console:war:5.5-SNAPSHOT
: No sub JAR or directory WEB-INF/lib/spring-tx-3.0.3.RELEASE.jar
[WARNING] Warning in manifest for org.apache.activemq:activemq-web-console:war:5.5-SNAPSHOT
: No sub JAR or directory WEB-INF/lib/activeio-core-3.1.2.jar
[WARNING] Warning in manifest for org.apache.activemq:activemq-web-console:war:5.5-SNAPSHOT
: No sub JAR or directory WEB-INF/lib/activemq-pool-5.5-SNAPSHOT.jar
[WARNING] Warning in manifest for org.apache.activemq:activemq-web-console:war:5.5-SNAPSHOT
: No sub JAR or directory WEB-INF/lib/commons-lang-2.4.jar
[WARNING] Warning in manifest for org.apache.activemq:activemq-web-console:war:5.5-SNAPSHOT
: No sub JAR or directory WEB-INF/lib/spring-beans-3.0.3.RELEASE.jar
[WARNING] Warning in manifest for org.apache.activemq:activemq-web-console:war:5.5-SNAPSHOT
: No sub JAR or directory WEB-INF/lib/activemq-jaas-5.5-SNAPSHOT.jar
[WARNING] Warning in manifest for org.apache.activemq:activemq-web-console:war:5.5-SNAPSHOT
: No sub JAR or directory WEB-INF/lib/gentlyweb-utils-1.5.jar
[WARNING] Warning in manifest for org.apache.activemq:activemq-web-console:war:5.5-SNAPSHOT
: No sub JAR or directory WEB-INF/lib/xbean-spring-3.7.jar
[WARNING] Warning in manifest for org.apache.activemq:activemq-web-console:war:5.5-SNAPSHOT
: No sub JAR or directory WEB-INF/lib/spring-core-3.0.3.RELEASE.jar
[WARNING] Warning in manifest for org.apache.activemq:activemq-web-console:war:5.5-SNAPSHOT
: No sub JAR or directory WEB-INF/lib/spring-context-3.0.3.RELEASE.jar
[WARNING] Warning in manifest for org.apache.activemq:activemq-web-console:war:5.5-SNAPSHOT
: No sub JAR or directory WEB-INF/lib/activemq-web-5.5-SNAPSHOT.jar
[WARNING] Warning in manifest for org.apache.activemq:activemq-web-console:war:5.5-SNAPSHOT
: No sub JAR or directory WEB-INF/lib/geronimo-j2ee-management_1.1_spec-1.0.1.jar
[WARNING] Warning in manifest for org.apache.activemq:activemq-web-console:war:5.5-SNAPSHOT
: No sub JAR or directory WEB-INF/lib/spring-aop-3.0.3.RELEASE.jar
[WARNING] Warning in manifest for org.apache.activemq:activemq-web-console:war:5.5-SNAPSHOT
: Did not find matching referal for org.apache.log4j*
[WARNING] Warning in manifest for org.apache.activemq:activemq-web-console:war:5.5-SNAPSHOT
: Did not find matching referal for org.slf4j*
[INFO] [resources:testResources {execution: default-testResources}]
[INFO] Using 'UTF-8' encoding to copy filtered resources.
[INFO] skip non existing resourceDirectory <https://hudson.apache.org/hudson/job/ActiveMQ/ws/trunk/activemq-web-console/src/test/resources>
[INFO] Copying 3 resources
[INFO] [compiler:testCompile {execution: default-testCompile}]
[INFO] Compiling 1 source file to <https://hudson.apache.org/hudson/job/ActiveMQ/ws/trunk/activemq-web-console/target/test-classes>
[INFO] [surefire:test {execution: default-test}]
[INFO] Surefire report directory: <https://hudson.apache.org/hudson/job/ActiveMQ/ws/trunk/activemq-web-console/target/surefire-reports>

-------------------------------------------------------
 T E S T S
-------------------------------------------------------
There are no tests to run.

Results :

Tests run: 0, Failures: 0, Errors: 0, Skipped: 0

[HUDSON] Recording test results
[INFO] [war:war {execution: default-war}]
[INFO] Packaging webapp
[INFO] Assembling webapp[activemq-web-console] in [<https://hudson.apache.org/hudson/job/ActiveMQ/ws/trunk/activemq-web-console/target/activemq-web-console-5.5-SNAPSHOT]>
[INFO] Processing war project
[INFO] Copying webapp resources[<https://hudson.apache.org/hudson/job/ActiveMQ/ws/trunk/activemq-web-console/src/main/webapp]>
[INFO] Webapp assembled in [396 msecs]
[INFO] Building war: <https://hudson.apache.org/hudson/job/ActiveMQ/ws/trunk/activemq-web-console/target/activemq-web-console-5.5-SNAPSHOT.war>
[INFO] [ianal:verify-legal-files {execution: default}]
[INFO] Checking legal files in: activemq-web-console-5.5-SNAPSHOT.war
[INFO] [install:install {execution: default-install}]
[INFO] Installing <https://hudson.apache.org/hudson/job/ActiveMQ/ws/trunk/activemq-web-console/target/activemq-web-console-5.5-SNAPSHOT.war>
to <https://hudson.apache.org/hudson/job/ActiveMQ/ws/.repository/org/apache/activemq/activemq-web-console/5.5-SNAPSHOT/activemq-web-console-5.5-SNAPSHOT.war>
[INFO] Preparing source:jar
[HUDSON] Archiving <https://hudson.apache.org/hudson/job/ActiveMQ/ws/trunk/activemq-web-console/pom.xml>
to /home/hudson/hudson/jobs/ActiveMQ/modules/org.apache.activemq$activemq-web-console/builds/2010-11-08_12-33-41/archive/org.apache.activemq/activemq-web-console/5.5-SNAPSHOT/pom.xml
[HUDSON] Archiving <https://hudson.apache.org/hudson/job/ActiveMQ/ws/trunk/activemq-web-console/target/activemq-web-console-5.5-SNAPSHOT.war>
to /home/hudson/hudson/jobs/ActiveMQ/modules/org.apache.activemq$activemq-web-console/builds/2010-11-08_12-33-41/archive/org.apache.activemq/activemq-web-console/5.5-SNAPSHOT/activemq-web-console-5.5-SNAPSHOT.war
[INFO] [enforcer:enforce {execution: default}]
[INFO] [bundle:cleanVersions {execution: cleanVersions}]
[INFO] [source:jar {execution: default-cli}]
[INFO] Building jar: <https://hudson.apache.org/hudson/job/ActiveMQ/ws/trunk/activemq-web-console/target/activemq-web-console-5.5-SNAPSHOT-sources.jar>
[HUDSON] Archiving <https://hudson.apache.org/hudson/job/ActiveMQ/ws/trunk/activemq-web-console/target/activemq-web-console-5.5-SNAPSHOT-sources.jar>
to /home/hudson/hudson/jobs/ActiveMQ/modules/org.apache.activemq$activemq-web-console/builds/2010-11-08_12-33-41/archive/org.apache.activemq/activemq-web-console/5.5-SNAPSHOT/activemq-web-console-5.5-SNAPSHOT-sources.jar
[INFO] ------------------------------------------------------------------------
[INFO] SKIPPING ActiveMQ :: Assembly
[INFO]    task-segment: [clean, install, source:jar]
[INFO] This project has been banned from further executions due to previous failures.
[INFO] ------------------------------------------------------------------------
[INFO] 
[INFO] 
[INFO] ------------------------------------------------------------------------
[INFO] Reactor Summary:
[INFO] ------------------------------------------------------------------------
[INFO] ActiveMQ .............................................. SUCCESS [5:32.036s]
[INFO] ActiveMQ :: KahaDB .................................... SUCCESS [1:02.279s]
[INFO] ActiveMQ :: JAAS ...................................... SUCCESS [1:23.236s]
[INFO] Openwire Generator .................................... SUCCESS [20.120s]
[INFO] ActiveMQ :: jmdns 1.0 ................................. SUCCESS [3.628s]
[INFO] ActiveMQ :: Core ...................................... SUCCESS [3:07:24.016s]
[INFO] ActiveMQ :: RA ........................................ SUCCESS [1:43.549s]
[INFO] ActiveMQ :: Pool ...................................... SUCCESS [35.711s]
[INFO] ActiveMQ :: Camel ..................................... SUCCESS [2:02.773s]
[INFO] ActiveMQ :: Console ................................... SUCCESS [7.941s]
[INFO] ActiveMQ :: Optional .................................. FAILED [57.356s]
[INFO] ActiveMQ :: Jar Bundle ................................ SKIPPED (dependency build failed
or was skipped)
[INFO] ActiveMQ :: File Server ............................... SUCCESS [32.663s]
[INFO] ActiveMQ :: Blueprint ................................. SUCCESS [25.124s]
[INFO] ActiveMQ :: Apache Karaf .............................. SKIPPED (dependency build failed
or was skipped)
[INFO] ActiveMQ :: RAR ....................................... SKIPPED (dependency build failed
or was skipped)
[INFO] ActiveMQ :: Run Jar ................................... SUCCESS [8.512s]
[INFO] ActiveMQ :: Spring .................................... SUCCESS [1:34.509s]
[INFO] ActiveMQ Tooling ...................................... SUCCESS [2.418s]
[INFO] ActiveMQ :: Memory Usage Test Plugin .................. SUCCESS [34.069s]
[INFO] ActiveMQ :: Performance Test Plugin ................... SUCCESS [6.026s]
[INFO] ActiveMQ :: StartUp Plugin ............................ SUCCESS [12.131s]
[INFO] ActiveMQ :: Web ....................................... SUCCESS [20.632s]
[INFO] ActiveMQ :: Web Demo .................................. SUCCESS [1:39.854s]
[INFO] ActiveMQ :: XMPP ...................................... SUCCESS [1:09.107s]
[INFO] ActiveMQ :: Web Console ............................... SUCCESS [1:59.895s]
[INFO] ActiveMQ :: Assembly .................................. SKIPPED (dependency build failed
or was skipped)
[INFO] ------------------------------------------------------------------------
[INFO] Error for project: ActiveMQ :: Optional (during install)
[INFO] ------------------------------------------------------------------------
[INFO] Compilation failure

<https://hudson.apache.org/hudson/job/ActiveMQ/ws/trunk/activemq-optional/src/main/java/org/apache/activemq/transport/https/HttpsTransport.java>:[26,42]
[deprecation] org.apache.activemq.transport.http.HttpTransport in org.apache.activemq.transport.http
has been deprecated

<https://hudson.apache.org/hudson/job/ActiveMQ/ws/trunk/activemq-optional/src/main/java/org/apache/activemq/transport/http/HttpTunnelServlet.java>:[198,13]
method does not override a method from its superclass

<https://hudson.apache.org/hudson/job/ActiveMQ/ws/trunk/activemq-optional/src/main/java/org/apache/activemq/transport/http/HttpTunnelServlet.java>:[203,13]
method does not override a method from its superclass


[INFO] ------------------------------------------------------------------------
[INFO] Trace
org.apache.maven.BuildFailureException: Compilation failure
	at org.apache.maven.lifecycle.DefaultLifecycleExecutor.executeGoals(DefaultLifecycleExecutor.java:715)
	at org.apache.maven.lifecycle.DefaultLifecycleExecutor.executeGoalWithLifecycle(DefaultLifecycleExecutor.java:556)
	at org.apache.maven.lifecycle.DefaultLifecycleExecutor.executeGoal(DefaultLifecycleExecutor.java:535)
	at org.apache.maven.lifecycle.DefaultLifecycleExecutor.executeGoalAndHandleFailures(DefaultLifecycleExecutor.java:387)
	at org.apache.maven.lifecycle.DefaultLifecycleExecutor.executeTaskSegments(DefaultLifecycleExecutor.java:348)
	at org.apache.maven.lifecycle.DefaultLifecycleExecutor.execute(DefaultLifecycleExecutor.java:180)
	at org.apache.maven.lifecycle.LifecycleExecutorInterceptor.execute(LifecycleExecutorInterceptor.java:65)
	at org.apache.maven.DefaultMaven.doExecute(DefaultMaven.java:328)
	at org.apache.maven.DefaultMaven.execute(DefaultMaven.java:138)
	at org.apache.maven.cli.MavenCli.main(MavenCli.java:362)
	at sun.reflect.NativeMethodAccessorImpl.invoke0(Native Method)
	at sun.reflect.NativeMethodAccessorImpl.invoke(NativeMethodAccessorImpl.java:39)
	at sun.reflect.DelegatingMethodAccessorImpl.invoke(DelegatingMethodAccessorImpl.java:25)
	at java.lang.reflect.Method.invoke(Method.java:592)
	at org.codehaus.classworlds.Launcher.launchEnhanced(Launcher.java:315)
	at org.codehaus.classworlds.Launcher.launch(Launcher.java:255)
	at hudson.maven.agent.Main.launch(Main.java:165)
	at hudson.maven.MavenBuilder.call(MavenBuilder.java:165)
	at hudson.maven.MavenModuleSetBuild$Builder.call(MavenModuleSetBuild.java:750)
	at hudson.maven.MavenModuleSetBuild$Builder.call(MavenModuleSetBuild.java:694)
	at hudson.remoting.UserRequest.perform(UserRequest.java:114)
	at hudson.remoting.UserRequest.perform(UserRequest.java:48)
	at hudson.remoting.Request$2.run(Request.java:270)
	at java.util.concurrent.Executors$RunnableAdapter.call(Executors.java:417)
	at java.util.concurrent.FutureTask$Sync.innerRun(FutureTask.java:269)
	at java.util.concurrent.FutureTask.run(FutureTask.java:123)
	at java.util.concurrent.ThreadPoolExecutor$Worker.runTask(ThreadPoolExecutor.java:651)
	at java.util.concurrent.ThreadPoolExecutor$Worker.run(ThreadPoolExecutor.java:676)
	at java.lang.Thread.run(Thread.java:595)
Caused by: org.apache.maven.plugin.CompilationFailureException: Compilation failure
	at org.apache.maven.plugin.AbstractCompilerMojo.execute(AbstractCompilerMojo.java:516)
	at org.apache.maven.plugin.CompilerMojo.execute(CompilerMojo.java:114)
	at org.apache.maven.plugin.DefaultPluginManager.executeMojo(DefaultPluginManager.java:490)
	at hudson.maven.agent.PluginManagerInterceptor.executeMojo(PluginManagerInterceptor.java:182)
	at org.apache.maven.lifecycle.DefaultLifecycleExecutor.executeGoals(DefaultLifecycleExecutor.java:694)
	... 28 more
[INFO] ------------------------------------------------------------------------
[INFO] BUILD ERRORS
[INFO] ------------------------------------------------------------------------
[INFO] Total time: 212 minutes 38 seconds
[INFO] Finished at: Mon Nov 08 16:06:29 UTC 2010
[INFO] Final Memory: 86M/1939M
[INFO] ------------------------------------------------------------------------
Sending e-mails to: dev@activemq.apache.org
Sending e-mails to: dev@activemq.apache.org
Sending e-mails to: dev@activemq.apache.org
Sending e-mails to: dev@activemq.apache.org
channel stopped
[locks-and-latches] Releasing all the locks
[locks-and-latches] All the locks released


Mime
View raw message