activemq-dev mailing list archives

Site index · List index
Message view « Date » · « Thread »
Top « Date » · « Thread »
From Apache Hudson Server <hud...@hudson.apache.org>
Subject Build failed in Hudson: ActiveMQ-Apollo-Deploy #11
Date Tue, 16 Nov 2010 03:47:47 GMT
See <https://hudson.apache.org/hudson/job/ActiveMQ-Apollo-Deploy/11/changes>

Changes:

[chirino] Made the connection regroup feature an option that can be enabled via config

------------------------------------------
[...truncated 9497 lines...]
  File "/usr/lib/python2.6/dist-packages/pkg_resources.py", line 2655, in <module>
    working_set.require(__requires__)
  File "/usr/lib/python2.6/dist-packages/pkg_resources.py", line 648, in require
    needed = self.resolve(parse_requirements(requirements))
  File "/usr/lib/python2.6/dist-packages/pkg_resources.py", line 546, in resolve
    raise DistributionNotFound(req)
pkg_resources.DistributionNotFound: Pygments==1.3.1
/usr/bin/pygmentize:5: UserWarning: Unbuilt egg for setuptools [unknown version] (/usr/lib/python2.6/dist-packages)
  from pkg_resources import load_entry_point
Traceback (most recent call last):
  File "/usr/bin/pygmentize", line 5, in <module>
    from pkg_resources import load_entry_point
  File "/usr/lib/python2.6/dist-packages/pkg_resources.py", line 2655, in <module>
    working_set.require(__requires__)
  File "/usr/lib/python2.6/dist-packages/pkg_resources.py", line 648, in require
    needed = self.resolve(parse_requirements(requirements))
  File "/usr/lib/python2.6/dist-packages/pkg_resources.py", line 546, in resolve
    raise DistributionNotFound(req)
pkg_resources.DistributionNotFound: Pygments==1.3.1
[INFO]     processing <https://hudson.apache.org/hudson/job/ActiveMQ-Apollo-Deploy/ws/trunk/apollo-website/src/main/webapp/documentation/getting-started.md>
with uri: /documentation/getting-started.md => 
[INFO]     processing <https://hudson.apache.org/hudson/job/ActiveMQ-Apollo-Deploy/ws/trunk/apollo-website/src/main/webapp/documentation/index.page>
with uri: /documentation/index.page => 
[INFO]     processing <https://hudson.apache.org/hudson/job/ActiveMQ-Apollo-Deploy/ws/trunk/apollo-website/src/main/webapp/documentation/performance-scaling.md>
with uri: /documentation/performance-scaling.md => 
[INFO]     processing <https://hudson.apache.org/hudson/job/ActiveMQ-Apollo-Deploy/ws/trunk/apollo-website/src/main/webapp/documentation/architecture.md>
with uri: /documentation/architecture.md => 
[INFO]     processing <https://hudson.apache.org/hudson/job/ActiveMQ-Apollo-Deploy/ws/trunk/apollo-website/src/main/webapp/documentation/module-organization.page>
with uri: /documentation/module-organization.page => 
[INFO]     processing <https://hudson.apache.org/hudson/job/ActiveMQ-Apollo-Deploy/ws/trunk/apollo-website/src/main/webapp/privacy-policy.page>
with uri: /privacy-policy.page => 
[INFO]     processing <https://hudson.apache.org/hudson/job/ActiveMQ-Apollo-Deploy/ws/trunk/apollo-website/src/main/webapp/download.page>
with uri: /download.page => 
Using dir: <https://hudson.apache.org/hudson/job/ActiveMQ-Apollo-Deploy/ws/trunk/apollo-website/src/main/webapp/blog>
at request path: /blog
[INFO]     processing <https://hudson.apache.org/hudson/job/ActiveMQ-Apollo-Deploy/ws/trunk/apollo-website/src/main/webapp/blog/index.page>
with uri: /blog/index.page => 
Using dir: <https://hudson.apache.org/hudson/job/ActiveMQ-Apollo-Deploy/ws/trunk/apollo-website/src/main/webapp/blog>
at request path: /blog
[INFO]     processing <https://hudson.apache.org/hudson/job/ActiveMQ-Apollo-Deploy/ws/trunk/apollo-website/src/main/webapp/blog/index.rss.feed>
with uri: /blog/index.rss.feed => 
[INFO]     processing <https://hudson.apache.org/hudson/job/ActiveMQ-Apollo-Deploy/ws/trunk/apollo-website/src/main/webapp/versions/index.page>
with uri: /versions/index.page => 
[INFO]     processing <https://hudson.apache.org/hudson/job/ActiveMQ-Apollo-Deploy/ws/trunk/apollo-website/src/main/webapp/community/faq.page>
with uri: /community/faq.page => 
/usr/bin/pygmentize:5: UserWarning: Unbuilt egg for setuptools [unknown version] (/usr/lib/python2.6/dist-packages)
  from pkg_resources import load_entry_point
Traceback (most recent call last):
  File "/usr/bin/pygmentize", line 5, in <module>
    from pkg_resources import load_entry_point
  File "/usr/lib/python2.6/dist-packages/pkg_resources.py", line 2655, in <module>
    working_set.require(__requires__)
  File "/usr/lib/python2.6/dist-packages/pkg_resources.py", line 648, in require
    needed = self.resolve(parse_requirements(requirements))
  File "/usr/lib/python2.6/dist-packages/pkg_resources.py", line 546, in resolve
    raise DistributionNotFound(req)
pkg_resources.DistributionNotFound: Pygments==1.3.1
[INFO]     processing <https://hudson.apache.org/hudson/job/ActiveMQ-Apollo-Deploy/ws/trunk/apollo-website/src/main/webapp/community/site.page>
with uri: /community/site.page => 
[INFO]     processing <https://hudson.apache.org/hudson/job/ActiveMQ-Apollo-Deploy/ws/trunk/apollo-website/src/main/webapp/community/index.page>
with uri: /community/index.page => 
[INFO]     processing <https://hudson.apache.org/hudson/job/ActiveMQ-Apollo-Deploy/ws/trunk/apollo-website/src/main/webapp/community/contributing.page>
with uri: /community/contributing.page => 
[INFO]     processing <https://hudson.apache.org/hudson/job/ActiveMQ-Apollo-Deploy/ws/trunk/apollo-website/src/main/webapp/community/source.page>
with uri: /community/source.page => 
[INFO]     processing <https://hudson.apache.org/hudson/job/ActiveMQ-Apollo-Deploy/ws/trunk/apollo-website/src/main/webapp/community/support.page>
with uri: /community/support.page => 
[INFO]     processing <https://hudson.apache.org/hudson/job/ActiveMQ-Apollo-Deploy/ws/trunk/apollo-website/src/main/webapp/community/developers.page>
with uri: /community/developers.page => 
[INFO]     processing <https://hudson.apache.org/hudson/job/ActiveMQ-Apollo-Deploy/ws/trunk/apollo-website/src/main/webapp/community/building.page>
with uri: /community/building.page => 
/usr/bin/pygmentize:5: UserWarning: Unbuilt egg for setuptools [unknown version] (/usr/lib/python2.6/dist-packages)
  from pkg_resources import load_entry_point
Traceback (most recent call last):
  File "/usr/bin/pygmentize", line 5, in <module>
    from pkg_resources import load_entry_point
  File "/usr/lib/python2.6/dist-packages/pkg_resources.py", line 2655, in <module>
    working_set.require(__requires__)
  File "/usr/lib/python2.6/dist-packages/pkg_resources.py", line 648, in require
    needed = self.resolve(parse_requirements(requirements))
  File "/usr/lib/python2.6/dist-packages/pkg_resources.py", line 546, in resolve
    raise DistributionNotFound(req)
pkg_resources.DistributionNotFound: Pygments==1.3.1
/usr/bin/pygmentize:5: UserWarning: Unbuilt egg for setuptools [unknown version] (/usr/lib/python2.6/dist-packages)
  from pkg_resources import load_entry_point
Traceback (most recent call last):
  File "/usr/bin/pygmentize", line 5, in <module>
    from pkg_resources import load_entry_point
  File "/usr/lib/python2.6/dist-packages/pkg_resources.py", line 2655, in <module>
    working_set.require(__requires__)
  File "/usr/lib/python2.6/dist-packages/pkg_resources.py", line 648, in require
    needed = self.resolve(parse_requirements(requirements))
  File "/usr/lib/python2.6/dist-packages/pkg_resources.py", line 546, in resolve
    raise DistributionNotFound(req)
pkg_resources.DistributionNotFound: Pygments==1.3.1
[INFO]     processing <https://hudson.apache.org/hudson/job/ActiveMQ-Apollo-Deploy/ws/trunk/apollo-website/src/main/webapp/community/release-guide.page>
with uri: /community/release-guide.page => 
[INFO] [install:install {execution: default-install}]
[INFO] Installing <https://hudson.apache.org/hudson/job/ActiveMQ-Apollo-Deploy/ws/trunk/apollo-website/target/apollo-website-1.0-SNAPSHOT.war>
to <https://hudson.apache.org/hudson/job/ActiveMQ-Apollo-Deploy/ws/.repository/org/apache/activemq/apollo-website/1.0-SNAPSHOT/apollo-website-1.0-SNAPSHOT.war>
[INFO] Installing <https://hudson.apache.org/hudson/job/ActiveMQ-Apollo-Deploy/ws/trunk/apollo-website/target/apollo-website-1.0-SNAPSHOT-sources.jar>
to <https://hudson.apache.org/hudson/job/ActiveMQ-Apollo-Deploy/ws/.repository/org/apache/activemq/apollo-website/1.0-SNAPSHOT/apollo-website-1.0-SNAPSHOT-sources.jar>
[INFO] [deploy:deploy {execution: default-deploy}]
[INFO] Retrieving previous build number from apache.snapshots.https
Uploading: https://repository.apache.org/content/repositories/snapshots/org/apache/activemq/apollo-website/1.0-SNAPSHOT/apollo-website-1.0-20101116.032921-14.war
10254K uploaded  (apollo-website-1.0-20101116.032921-14.war)
[INFO] Retrieving previous metadata from apache.snapshots.https
[INFO] Uploading repository metadata for: 'artifact org.apache.activemq:apollo-website'
[INFO] Uploading project information for apollo-website 1.0-20101116.032921-14
[INFO] Retrieving previous metadata from apache.snapshots.https
[INFO] Uploading repository metadata for: 'snapshot org.apache.activemq:apollo-website:1.0-SNAPSHOT'
[INFO] Retrieving previous build number from apache.snapshots.https
Uploading: https://repository.apache.org/content/repositories/snapshots/org/apache/activemq/apollo-website/1.0-SNAPSHOT/apollo-website-1.0-20101116.032921-14-sources.jar
9K uploaded  (apollo-website-1.0-20101116.032921-14-sources.jar)
[INFO] [scalate:deploy {execution: deploy}]
scp://people.apache.org/x1/www/activemq.apache.org/apollo/versions/1.0-SNAPSHOT/website/ -
Session: Connection refused
scp://people.apache.org/x1/www/activemq.apache.org/apollo/versions/1.0-SNAPSHOT/website/ -
Session: Disconnecting  
scp://people.apache.org/x1/www/activemq.apache.org/apollo/versions/1.0-SNAPSHOT/website/ -
Session: Disconnected
[HUDSON] Archiving <https://hudson.apache.org/hudson/job/ActiveMQ-Apollo-Deploy/ws/trunk/apollo-website/target/apollo-website-1.0-SNAPSHOT.war>
to /home/hudson/hudson/jobs/ActiveMQ-Apollo-Deploy/modules/org.apache.activemq$apollo-website/builds/2010-11-16_03-23-01/archive/org.apache.activemq/apollo-website/1.0-20101116.032921-14/apollo-website-1.0-SNAPSHOT.war
[HUDSON] Archiving <https://hudson.apache.org/hudson/job/ActiveMQ-Apollo-Deploy/ws/trunk/apollo-website/target/apollo-website-1.0-SNAPSHOT-sources.jar>
to /home/hudson/hudson/jobs/ActiveMQ-Apollo-Deploy/modules/org.apache.activemq$apollo-website/builds/2010-11-16_03-23-01/archive/org.apache.activemq/apollo-website/1.0-20101116.032921-14/apollo-website-1.0-SNAPSHOT-sources.jar
[INFO] ------------------------------------------------------------------------
[INFO] SKIPPING apache-apollo
[INFO]    task-segment: [clean, deploy]
[INFO] This project has been banned from further executions due to previous failures.
[INFO] ------------------------------------------------------------------------
[INFO] 
[INFO] 
[INFO] ------------------------------------------------------------------------
[INFO] Reactor Summary:
[INFO] ------------------------------------------------------------------------
[INFO] Apache ActiveMQ Apollo Project ........................ SUCCESS [6:15.640s]
[INFO] apollo-scala .......................................... SUCCESS [2:09.262s]
[INFO] apollo-util ........................................... SUCCESS [2:12.769s]
[INFO] apollo-transport ...................................... SUCCESS [3.692s]
[INFO] apollo-dto ............................................ SUCCESS [41.536s]
[INFO] apollo-store .......................................... SUCCESS [21.908s]
[INFO] apollo-cassandra ...................................... SUCCESS [42.121s]
[INFO] apollo-selector ....................................... SUCCESS [1:12.243s]
[INFO] apollo-broker ......................................... SUCCESS [39.168s]
[INFO] apollo-tcp ............................................ FAILED [0.832s]
[INFO] apollo-web ............................................ SUCCESS [3:30.480s]
[INFO] apollo-hawtdb ......................................... SUCCESS [32.159s]
[INFO] apollo-bdb ............................................ SUCCESS [38.918s]
[INFO] apollo-stomp .......................................... SKIPPED (dependency build failed
or was skipped)
[INFO] apollo-cli ............................................ SKIPPED (dependency build failed
or was skipped)
[INFO] apollo-website ........................................ FAILED [2:34.871s]
[INFO] apache-apollo ......................................... SKIPPED (dependency build failed
or was skipped)
[INFO] ------------------------------------------------------------------------
[INFO] Error for project: apollo-tcp (during deploy)
[INFO] ------------------------------------------------------------------------
[INFO] Compilation failure
<https://hudson.apache.org/hudson/job/ActiveMQ-Apollo-Deploy/ws/trunk/apollo-tcp/src/main/java/org/apache/activemq/apollo/transport/tcp/SslTransportServer.java>:[52,35]
cannot find symbol
symbol  : method getDefault()
location: class javax.net.ssl.SSLContext


[INFO] ------------------------------------------------------------------------
[INFO] Trace
org.apache.maven.BuildFailureException: Compilation failure
<https://hudson.apache.org/hudson/job/ActiveMQ-Apollo-Deploy/ws/trunk/apollo-tcp/src/main/java/org/apache/activemq/apollo/transport/tcp/SslTransportServer.java>:[52,35]
cannot find symbol
symbol  : method getDefault()
location: class javax.net.ssl.SSLContext


	at org.apache.maven.lifecycle.DefaultLifecycleExecutor.executeGoals(DefaultLifecycleExecutor.java:715)
	at org.apache.maven.lifecycle.DefaultLifecycleExecutor.executeGoalWithLifecycle(DefaultLifecycleExecutor.java:556)
	at org.apache.maven.lifecycle.DefaultLifecycleExecutor.executeGoal(DefaultLifecycleExecutor.java:535)
	at org.apache.maven.lifecycle.DefaultLifecycleExecutor.executeGoalAndHandleFailures(DefaultLifecycleExecutor.java:387)
	at org.apache.maven.lifecycle.DefaultLifecycleExecutor.executeTaskSegments(DefaultLifecycleExecutor.java:348)
	at org.apache.maven.lifecycle.DefaultLifecycleExecutor.execute(DefaultLifecycleExecutor.java:180)
	at org.apache.maven.lifecycle.LifecycleExecutorInterceptor.execute(LifecycleExecutorInterceptor.java:65)
	at org.apache.maven.DefaultMaven.doExecute(DefaultMaven.java:328)
	at org.apache.maven.DefaultMaven.execute(DefaultMaven.java:138)
	at org.apache.maven.cli.MavenCli.main(MavenCli.java:362)
	at sun.reflect.NativeMethodAccessorImpl.invoke0(Native Method)
	at sun.reflect.NativeMethodAccessorImpl.invoke(NativeMethodAccessorImpl.java:39)
	at sun.reflect.DelegatingMethodAccessorImpl.invoke(DelegatingMethodAccessorImpl.java:25)
	at java.lang.reflect.Method.invoke(Method.java:592)
	at org.codehaus.classworlds.Launcher.launchEnhanced(Launcher.java:315)
	at org.codehaus.classworlds.Launcher.launch(Launcher.java:255)
	at hudson.maven.agent.Main.launch(Main.java:165)
	at hudson.maven.MavenBuilder.call(MavenBuilder.java:165)
	at hudson.maven.MavenModuleSetBuild$Builder.call(MavenModuleSetBuild.java:750)
	at hudson.maven.MavenModuleSetBuild$Builder.call(MavenModuleSetBuild.java:694)
	at hudson.remoting.UserRequest.perform(UserRequest.java:114)
	at hudson.remoting.UserRequest.perform(UserRequest.java:48)
	at hudson.remoting.Request$2.run(Request.java:270)
	at java.util.concurrent.Executors$RunnableAdapter.call(Executors.java:417)
	at java.util.concurrent.FutureTask$Sync.innerRun(FutureTask.java:269)
	at java.util.concurrent.FutureTask.run(FutureTask.java:123)
	at java.util.concurrent.ThreadPoolExecutor$Worker.runTask(ThreadPoolExecutor.java:651)
	at java.util.concurrent.ThreadPoolExecutor$Worker.run(ThreadPoolExecutor.java:676)
	at java.lang.Thread.run(Thread.java:595)
Caused by: org.apache.maven.plugin.CompilationFailureException: Compilation failure
<https://hudson.apache.org/hudson/job/ActiveMQ-Apollo-Deploy/ws/trunk/apollo-tcp/src/main/java/org/apache/activemq/apollo/transport/tcp/SslTransportServer.java>:[52,35]
cannot find symbol
symbol  : method getDefault()
location: class javax.net.ssl.SSLContext


	at org.apache.maven.plugin.AbstractCompilerMojo.execute(AbstractCompilerMojo.java:516)
	at org.apache.maven.plugin.CompilerMojo.execute(CompilerMojo.java:114)
	at org.apache.maven.plugin.DefaultPluginManager.executeMojo(DefaultPluginManager.java:490)
	at hudson.maven.agent.PluginManagerInterceptor.executeMojo(PluginManagerInterceptor.java:182)
	at org.apache.maven.lifecycle.DefaultLifecycleExecutor.executeGoals(DefaultLifecycleExecutor.java:694)
	... 28 more
[INFO] ------------------------------------------------------------------------
[INFO] Error for project: apollo-website (during deploy)
[INFO] ------------------------------------------------------------------------
[INFO] Error uploading site

Embedded error: Cannot connect. Reason: Auth fail
[INFO] ------------------------------------------------------------------------
[INFO] Trace
org.apache.maven.lifecycle.LifecycleExecutionException: Error uploading site
	at org.apache.maven.lifecycle.DefaultLifecycleExecutor.executeGoals(DefaultLifecycleExecutor.java:719)
	at org.apache.maven.lifecycle.DefaultLifecycleExecutor.executeGoalWithLifecycle(DefaultLifecycleExecutor.java:556)
	at org.apache.maven.lifecycle.DefaultLifecycleExecutor.executeGoal(DefaultLifecycleExecutor.java:535)
	at org.apache.maven.lifecycle.DefaultLifecycleExecutor.executeGoalAndHandleFailures(DefaultLifecycleExecutor.java:387)
	at org.apache.maven.lifecycle.DefaultLifecycleExecutor.executeTaskSegments(DefaultLifecycleExecutor.java:348)
	at org.apache.maven.lifecycle.DefaultLifecycleExecutor.execute(DefaultLifecycleExecutor.java:180)
	at org.apache.maven.lifecycle.LifecycleExecutorInterceptor.execute(LifecycleExecutorInterceptor.java:65)
	at org.apache.maven.DefaultMaven.doExecute(DefaultMaven.java:328)
	at org.apache.maven.DefaultMaven.execute(DefaultMaven.java:138)
	at org.apache.maven.cli.MavenCli.main(MavenCli.java:362)
	at sun.reflect.NativeMethodAccessorImpl.invoke0(Native Method)
	at sun.reflect.NativeMethodAccessorImpl.invoke(NativeMethodAccessorImpl.java:39)
	at sun.reflect.DelegatingMethodAccessorImpl.invoke(DelegatingMethodAccessorImpl.java:25)
	at java.lang.reflect.Method.invoke(Method.java:592)
	at org.codehaus.classworlds.Launcher.launchEnhanced(Launcher.java:315)
	at org.codehaus.classworlds.Launcher.launch(Launcher.java:255)
	at hudson.maven.agent.Main.launch(Main.java:165)
	at hudson.maven.MavenBuilder.call(MavenBuilder.java:165)
	at hudson.maven.MavenModuleSetBuild$Builder.call(MavenModuleSetBuild.java:750)
	at hudson.maven.MavenModuleSetBuild$Builder.call(MavenModuleSetBuild.java:694)
	at hudson.remoting.UserRequest.perform(UserRequest.java:114)
	at hudson.remoting.UserRequest.perform(UserRequest.java:48)
	at hudson.remoting.Request$2.run(Request.java:270)
	at java.util.concurrent.Executors$RunnableAdapter.call(Executors.java:417)
	at java.util.concurrent.FutureTask$Sync.innerRun(FutureTask.java:269)
	at java.util.concurrent.FutureTask.run(FutureTask.java:123)
	at java.util.concurrent.ThreadPoolExecutor$Worker.runTask(ThreadPoolExecutor.java:651)
	at java.util.concurrent.ThreadPoolExecutor$Worker.run(ThreadPoolExecutor.java:676)
	at java.lang.Thread.run(Thread.java:595)
Caused by: org.apache.maven.plugin.MojoExecutionException: Error uploading site
	at org.fusesource.scalate.maven.SiteDeployMojo.execute(SiteDeployMojo.java:251)
	at org.apache.maven.plugin.DefaultPluginManager.executeMojo(DefaultPluginManager.java:490)
	at hudson.maven.agent.PluginManagerInterceptor.executeMojo(PluginManagerInterceptor.java:182)
	at org.apache.maven.lifecycle.DefaultLifecycleExecutor.executeGoals(DefaultLifecycleExecutor.java:694)
	... 28 more
Caused by: org.apache.maven.wagon.authentication.AuthenticationException: Cannot connect.
Reason: Auth fail
	at org.apache.maven.wagon.providers.ssh.jsch.AbstractJschWagon.openConnectionInternal(AbstractJschWagon.java:264)
	at org.apache.maven.wagon.AbstractWagon.openConnection(AbstractWagon.java:105)
	at org.apache.maven.wagon.AbstractWagon.connect(AbstractWagon.java:207)
	at org.apache.maven.wagon.AbstractWagon.connect(AbstractWagon.java:142)
	at org.fusesource.scalate.maven.SiteDeployMojo.execute(SiteDeployMojo.java:233)
	... 31 more
Caused by: com.jcraft.jsch.JSchException: Auth fail
	at com.jcraft.jsch.Session.connect(Session.java:451)
	at com.jcraft.jsch.Session.connect(Session.java:149)
	at org.apache.maven.wagon.providers.ssh.jsch.AbstractJschWagon.openConnectionInternal(AbstractJschWagon.java:236)
	... 35 more
[INFO] ------------------------------------------------------------------------
[INFO] BUILD ERRORS
[INFO] ------------------------------------------------------------------------
[INFO] Total time: 24 minutes 35 seconds
[INFO] Finished at: Tue Nov 16 03:47:45 UTC 2010
[INFO] Final Memory: 92M/1101M
[INFO] ------------------------------------------------------------------------
Sending e-mails to: dev@activemq.apache.org
Sending e-mails to: dev@activemq.apache.org
Sending e-mails to: dev@activemq.apache.org
channel stopped


Mime
View raw message