activemq-dev mailing list archives

Site index · List index
Message view « Date » · « Thread »
Top « Date » · « Thread »
From Apache Hudson Server <hud...@hudson.apache.org>
Subject Build failed in Hudson: ActiveMQ-Trunk-Deploy » ActiveMQ Tooling #176
Date Sat, 13 Nov 2010 09:09:18 GMT
See <https://hudson.apache.org/hudson/job/ActiveMQ-Trunk-Deploy/org.apache.activemq.tooling$activemq-tooling/176/>

------------------------------------------
[...truncated 118 lines...]

[INFO] ------------------------------------------------------------------------
[INFO] Trace
org.apache.maven.lifecycle.LifecycleExecutionException: Error installing artifact's metadata:
repository metadata for: 'snapshot org.apache.activemq:activemq-core:5.5-SNAPSHOT' could not
be retrieved from repository: apache.snapshots.https due to an error: Error transferring file:
Server returned HTTP response code: 502 for URL: https://repository.apache.org/content/repositories/snapshots/org/apache/activemq/activemq-core/5.5-SNAPSHOT/maven-metadata.xml.sha1
	at org.apache.maven.lifecycle.DefaultLifecycleExecutor.executeGoals(DefaultLifecycleExecutor.java:719)
	at org.apache.maven.lifecycle.DefaultLifecycleExecutor.executeGoalWithLifecycle(DefaultLifecycleExecutor.java:556)
	at org.apache.maven.lifecycle.DefaultLifecycleExecutor.executeGoal(DefaultLifecycleExecutor.java:535)
	at org.apache.maven.lifecycle.DefaultLifecycleExecutor.executeGoalAndHandleFailures(DefaultLifecycleExecutor.java:387)
	at org.apache.maven.lifecycle.DefaultLifecycleExecutor.executeTaskSegments(DefaultLifecycleExecutor.java:348)
	at org.apache.maven.lifecycle.DefaultLifecycleExecutor.execute(DefaultLifecycleExecutor.java:180)
	at org.apache.maven.lifecycle.LifecycleExecutorInterceptor.execute(LifecycleExecutorInterceptor.java:65)
	at org.apache.maven.DefaultMaven.doExecute(DefaultMaven.java:328)
	at org.apache.maven.DefaultMaven.execute(DefaultMaven.java:138)
	at org.apache.maven.cli.MavenCli.main(MavenCli.java:362)
	at sun.reflect.NativeMethodAccessorImpl.invoke0(Native Method)
	at sun.reflect.NativeMethodAccessorImpl.invoke(NativeMethodAccessorImpl.java:39)
	at sun.reflect.DelegatingMethodAccessorImpl.invoke(DelegatingMethodAccessorImpl.java:25)
	at java.lang.reflect.Method.invoke(Method.java:592)
	at org.codehaus.classworlds.Launcher.launchEnhanced(Launcher.java:315)
	at org.codehaus.classworlds.Launcher.launch(Launcher.java:255)
	at hudson.maven.agent.Main.launch(Main.java:165)
	at hudson.maven.MavenBuilder.call(MavenBuilder.java:165)
	at hudson.maven.MavenModuleSetBuild$Builder.call(MavenModuleSetBuild.java:750)
	at hudson.maven.MavenModuleSetBuild$Builder.call(MavenModuleSetBuild.java:694)
	at hudson.remoting.UserRequest.perform(UserRequest.java:114)
	at hudson.remoting.UserRequest.perform(UserRequest.java:48)
	at hudson.remoting.Request$2.run(Request.java:270)
	at java.util.concurrent.Executors$RunnableAdapter.call(Executors.java:417)
	at java.util.concurrent.FutureTask$Sync.innerRun(FutureTask.java:269)
	at java.util.concurrent.FutureTask.run(FutureTask.java:123)
	at java.util.concurrent.ThreadPoolExecutor$Worker.runTask(ThreadPoolExecutor.java:651)
	at java.util.concurrent.ThreadPoolExecutor$Worker.run(ThreadPoolExecutor.java:676)
	at java.lang.Thread.run(Thread.java:595)
Caused by: org.apache.maven.plugin.MojoExecutionException: Error installing artifact's metadata:
repository metadata for: 'snapshot org.apache.activemq:activemq-core:5.5-SNAPSHOT' could not
be retrieved from repository: apache.snapshots.https due to an error: Error transferring file:
Server returned HTTP response code: 502 for URL: https://repository.apache.org/content/repositories/snapshots/org/apache/activemq/activemq-core/5.5-SNAPSHOT/maven-metadata.xml.sha1
	at org.apache.maven.plugin.deploy.DeployMojo.execute(DeployMojo.java:189)
	at org.apache.maven.plugin.DefaultPluginManager.executeMojo(DefaultPluginManager.java:490)
	at hudson.maven.agent.PluginManagerInterceptor.executeMojo(PluginManagerInterceptor.java:182)
	at org.apache.maven.lifecycle.DefaultLifecycleExecutor.executeGoals(DefaultLifecycleExecutor.java:694)
	... 28 more
Caused by: org.apache.maven.artifact.deployer.ArtifactDeploymentException: Error installing
artifact's metadata: repository metadata for: 'snapshot org.apache.activemq:activemq-core:5.5-SNAPSHOT'
could not be retrieved from repository: apache.snapshots.https due to an error: Error transferring
file: Server returned HTTP response code: 502 for URL: https://repository.apache.org/content/repositories/snapshots/org/apache/activemq/activemq-core/5.5-SNAPSHOT/maven-metadata.xml.sha1
	at org.apache.maven.artifact.deployer.DefaultArtifactDeployer.deploy(DefaultArtifactDeployer.java:129)
	at org.apache.maven.plugin.deploy.DeployMojo.execute(DeployMojo.java:156)
	... 31 more
Caused by: org.apache.maven.artifact.repository.metadata.RepositoryMetadataDeploymentException:
repository metadata for: 'snapshot org.apache.activemq:activemq-core:5.5-SNAPSHOT' could not
be retrieved from repository: apache.snapshots.https due to an error: Error transferring file:
Server returned HTTP response code: 502 for URL: https://repository.apache.org/content/repositories/snapshots/org/apache/activemq/activemq-core/5.5-SNAPSHOT/maven-metadata.xml.sha1
	at org.apache.maven.artifact.repository.metadata.DefaultRepositoryMetadataManager.deploy(DefaultRepositoryMetadataManager.java:422)
	at org.apache.maven.artifact.deployer.DefaultArtifactDeployer.deploy(DefaultArtifactDeployer.java:113)
	... 32 more
Caused by: org.apache.maven.wagon.TransferFailedException: Error transferring file: Server
returned HTTP response code: 502 for URL: https://repository.apache.org/content/repositories/snapshots/org/apache/activemq/activemq-core/5.5-SNAPSHOT/maven-metadata.xml.sha1
	at org.apache.maven.wagon.providers.http.LightweightHttpWagon.fillInputData(LightweightHttpWagon.java:143)
	at org.apache.maven.wagon.StreamWagon.getInputStream(StreamWagon.java:116)
	at org.apache.maven.wagon.StreamWagon.getIfNewer(StreamWagon.java:88)
	at org.apache.maven.wagon.StreamWagon.get(StreamWagon.java:61)
	at org.apache.maven.artifact.manager.DefaultWagonManager.verifyChecksum(DefaultWagonManager.java:748)
	at org.apache.maven.artifact.manager.DefaultWagonManager.getRemoteFile(DefaultWagonManager.java:577)
	at org.apache.maven.artifact.manager.DefaultWagonManager.getArtifactMetadataFromDeploymentRepository(DefaultWagonManager.java:452)
	at org.apache.maven.artifact.repository.metadata.DefaultRepositoryMetadataManager.getArtifactMetadataFromDeploymentRepository(DefaultRepositoryMetadataManager.java:379)
	at org.apache.maven.artifact.repository.metadata.DefaultRepositoryMetadataManager.deploy(DefaultRepositoryMetadataManager.java:418)
	... 33 more
Caused by: java.io.IOException: Server returned HTTP response code: 502 for URL: https://repository.apache.org/content/repositories/snapshots/org/apache/activemq/activemq-core/5.5-SNAPSHOT/maven-metadata.xml.sha1
	at sun.reflect.NativeConstructorAccessorImpl.newInstance0(Native Method)
	at sun.reflect.NativeConstructorAccessorImpl.newInstance(NativeConstructorAccessorImpl.java:39)
	at sun.reflect.DelegatingConstructorAccessorImpl.newInstance(DelegatingConstructorAccessorImpl.java:27)
	at java.lang.reflect.Constructor.newInstance(Constructor.java:501)
	at sun.net.www.protocol.http.HttpURLConnection$6.run(HttpURLConnection.java:1250)
	at java.security.AccessController.doPrivileged(Native Method)
	at sun.net.www.protocol.http.HttpURLConnection.getChainedException(HttpURLConnection.java:1244)
	at sun.net.www.protocol.http.HttpURLConnection.getInputStream(HttpURLConnection.java:932)
	at sun.net.www.protocol.https.HttpsURLConnectionImpl.getInputStream(HttpsURLConnectionImpl.java:234)
	at org.apache.maven.wagon.providers.http.LightweightHttpWagon.fillInputData(LightweightHttpWagon.java:122)
	... 41 more
Caused by: java.io.IOException: Server returned HTTP response code: 502 for URL: https://repository.apache.org/content/repositories/snapshots/org/apache/activemq/activemq-core/5.5-SNAPSHOT/maven-metadata.xml.sha1
	at sun.net.www.protocol.http.HttpURLConnection.getInputStream(HttpURLConnection.java:1196)
	at java.net.HttpURLConnection.getResponseCode(HttpURLConnection.java:367)
	at sun.net.www.protocol.https.HttpsURLConnectionImpl.getResponseCode(HttpsURLConnectionImpl.java:318)
	at org.apache.maven.wagon.providers.http.LightweightHttpWagon.fillInputData(LightweightHttpWagon.java:115)
	... 41 more
[INFO] ------------------------------------------------------------------------
[INFO] Error for project: ActiveMQ :: Blueprint (during deploy)
[INFO] ------------------------------------------------------------------------
[INFO] Error retrieving previous build number for artifact 'org.apache.activemq:activemq-blueprint:bundle':
repository metadata for: 'snapshot org.apache.activemq:activemq-blueprint:5.5-SNAPSHOT' could
not be retrieved from repository: apache.snapshots.https due to an error: Error transferring
file: Server returned HTTP response code: 502 for URL: https://repository.apache.org/content/repositories/snapshots/org/apache/activemq/activemq-blueprint/5.5-SNAPSHOT/maven-metadata.xml.sha1

[INFO] ------------------------------------------------------------------------
[INFO] Trace
org.apache.maven.lifecycle.LifecycleExecutionException: Error retrieving previous build number
for artifact 'org.apache.activemq:activemq-blueprint:bundle': repository metadata for: 'snapshot
org.apache.activemq:activemq-blueprint:5.5-SNAPSHOT' could not be retrieved from repository:
apache.snapshots.https due to an error: Error transferring file: Server returned HTTP response
code: 502 for URL: https://repository.apache.org/content/repositories/snapshots/org/apache/activemq/activemq-blueprint/5.5-SNAPSHOT/maven-metadata.xml.sha1
	at org.apache.maven.lifecycle.DefaultLifecycleExecutor.executeGoals(DefaultLifecycleExecutor.java:719)
	at org.apache.maven.lifecycle.DefaultLifecycleExecutor.executeGoalWithLifecycle(DefaultLifecycleExecutor.java:556)
	at org.apache.maven.lifecycle.DefaultLifecycleExecutor.executeGoal(DefaultLifecycleExecutor.java:535)
	at org.apache.maven.lifecycle.DefaultLifecycleExecutor.executeGoalAndHandleFailures(DefaultLifecycleExecutor.java:387)
	at org.apache.maven.lifecycle.DefaultLifecycleExecutor.executeTaskSegments(DefaultLifecycleExecutor.java:348)
	at org.apache.maven.lifecycle.DefaultLifecycleExecutor.execute(DefaultLifecycleExecutor.java:180)
	at org.apache.maven.lifecycle.LifecycleExecutorInterceptor.execute(LifecycleExecutorInterceptor.java:65)
	at org.apache.maven.DefaultMaven.doExecute(DefaultMaven.java:328)
	at org.apache.maven.DefaultMaven.execute(DefaultMaven.java:138)
	at org.apache.maven.cli.MavenCli.main(MavenCli.java:362)
	at sun.reflect.NativeMethodAccessorImpl.invoke0(Native Method)
	at sun.reflect.NativeMethodAccessorImpl.invoke(NativeMethodAccessorImpl.java:39)
	at sun.reflect.DelegatingMethodAccessorImpl.invoke(DelegatingMethodAccessorImpl.java:25)
	at java.lang.reflect.Method.invoke(Method.java:592)
	at org.codehaus.classworlds.Launcher.launchEnhanced(Launcher.java:315)
	at org.codehaus.classworlds.Launcher.launch(Launcher.java:255)
	at hudson.maven.agent.Main.launch(Main.java:165)
	at hudson.maven.MavenBuilder.call(MavenBuilder.java:165)
	at hudson.maven.MavenModuleSetBuild$Builder.call(MavenModuleSetBuild.java:750)
	at hudson.maven.MavenModuleSetBuild$Builder.call(MavenModuleSetBuild.java:694)
	at hudson.remoting.UserRequest.perform(UserRequest.java:114)
	at hudson.remoting.UserRequest.perform(UserRequest.java:48)
	at hudson.remoting.Request$2.run(Request.java:270)
	at java.util.concurrent.Executors$RunnableAdapter.call(Executors.java:417)
	at java.util.concurrent.FutureTask$Sync.innerRun(FutureTask.java:269)
	at java.util.concurrent.FutureTask.run(FutureTask.java:123)
	at java.util.concurrent.ThreadPoolExecutor$Worker.runTask(ThreadPoolExecutor.java:651)
	at java.util.concurrent.ThreadPoolExecutor$Worker.run(ThreadPoolExecutor.java:676)
	at java.lang.Thread.run(Thread.java:595)
Caused by: org.apache.maven.plugin.MojoExecutionException: Error retrieving previous build
number for artifact 'org.apache.activemq:activemq-blueprint:bundle': repository metadata for:
'snapshot org.apache.activemq:activemq-blueprint:5.5-SNAPSHOT' could not be retrieved from
repository: apache.snapshots.https due to an error: Error transferring file: Server returned
HTTP response code: 502 for URL: https://repository.apache.org/content/repositories/snapshots/org/apache/activemq/activemq-blueprint/5.5-SNAPSHOT/maven-metadata.xml.sha1
	at org.apache.maven.plugin.deploy.DeployMojo.execute(DeployMojo.java:189)
	at org.apache.maven.plugin.DefaultPluginManager.executeMojo(DefaultPluginManager.java:490)
	at hudson.maven.agent.PluginManagerInterceptor.executeMojo(PluginManagerInterceptor.java:182)
	at org.apache.maven.lifecycle.DefaultLifecycleExecutor.executeGoals(DefaultLifecycleExecutor.java:694)
	... 28 more
Caused by: org.apache.maven.artifact.deployer.ArtifactDeploymentException: Error retrieving
previous build number for artifact 'org.apache.activemq:activemq-blueprint:bundle': repository
metadata for: 'snapshot org.apache.activemq:activemq-blueprint:5.5-SNAPSHOT' could not be
retrieved from repository: apache.snapshots.https due to an error: Error transferring file:
Server returned HTTP response code: 502 for URL: https://repository.apache.org/content/repositories/snapshots/org/apache/activemq/activemq-blueprint/5.5-SNAPSHOT/maven-metadata.xml.sha1
	at org.apache.maven.artifact.transform.SnapshotTransformation.transformForDeployment(SnapshotTransformation.java:106)
	at org.apache.maven.artifact.transform.DefaultArtifactTransformationManager.transformForDeployment(DefaultArtifactTransformationManager.java:74)
	at org.apache.maven.artifact.deployer.DefaultArtifactDeployer.deploy(DefaultArtifactDeployer.java:86)
	at org.apache.maven.plugin.deploy.DeployMojo.execute(DeployMojo.java:156)
	... 31 more
Caused by: org.apache.maven.artifact.repository.metadata.RepositoryMetadataResolutionException:
repository metadata for: 'snapshot org.apache.activemq:activemq-blueprint:5.5-SNAPSHOT' could
not be retrieved from repository: apache.snapshots.https due to an error: Error transferring
file: Server returned HTTP response code: 502 for URL: https://repository.apache.org/content/repositories/snapshots/org/apache/activemq/activemq-blueprint/5.5-SNAPSHOT/maven-metadata.xml.sha1
	at org.apache.maven.artifact.repository.metadata.DefaultRepositoryMetadataManager.resolveAlways(DefaultRepositoryMetadataManager.java:351)
	at org.apache.maven.artifact.transform.SnapshotTransformation.resolveLatestSnapshotBuildNumber(SnapshotTransformation.java:161)
	at org.apache.maven.artifact.transform.SnapshotTransformation.transformForDeployment(SnapshotTransformation.java:100)
	... 34 more
Caused by: org.apache.maven.wagon.TransferFailedException: Error transferring file: Server
returned HTTP response code: 502 for URL: https://repository.apache.org/content/repositories/snapshots/org/apache/activemq/activemq-blueprint/5.5-SNAPSHOT/maven-metadata.xml.sha1
	at org.apache.maven.wagon.providers.http.LightweightHttpWagon.fillInputData(LightweightHttpWagon.java:143)
	at org.apache.maven.wagon.StreamWagon.getInputStream(StreamWagon.java:116)
	at org.apache.maven.wagon.StreamWagon.getIfNewer(StreamWagon.java:88)
	at org.apache.maven.wagon.StreamWagon.get(StreamWagon.java:61)
	at org.apache.maven.artifact.manager.DefaultWagonManager.verifyChecksum(DefaultWagonManager.java:748)
	at org.apache.maven.artifact.manager.DefaultWagonManager.getRemoteFile(DefaultWagonManager.java:577)
	at org.apache.maven.artifact.manager.DefaultWagonManager.getArtifactMetadataFromDeploymentRepository(DefaultWagonManager.java:452)
	at org.apache.maven.artifact.repository.metadata.DefaultRepositoryMetadataManager.getArtifactMetadataFromDeploymentRepository(DefaultRepositoryMetadataManager.java:379)
	at org.apache.maven.artifact.repository.metadata.DefaultRepositoryMetadataManager.resolveAlways(DefaultRepositoryMetadataManager.java:347)
	... 36 more
Caused by: java.io.IOException: Server returned HTTP response code: 502 for URL: https://repository.apache.org/content/repositories/snapshots/org/apache/activemq/activemq-blueprint/5.5-SNAPSHOT/maven-metadata.xml.sha1
	at sun.reflect.NativeConstructorAccessorImpl.newInstance0(Native Method)
	at sun.reflect.NativeConstructorAccessorImpl.newInstance(NativeConstructorAccessorImpl.java:39)
	at sun.reflect.DelegatingConstructorAccessorImpl.newInstance(DelegatingConstructorAccessorImpl.java:27)
	at java.lang.reflect.Constructor.newInstance(Constructor.java:501)
	at sun.net.www.protocol.http.HttpURLConnection$6.run(HttpURLConnection.java:1250)
	at java.security.AccessController.doPrivileged(Native Method)
	at sun.net.www.protocol.http.HttpURLConnection.getChainedException(HttpURLConnection.java:1244)
	at sun.net.www.protocol.http.HttpURLConnection.getInputStream(HttpURLConnection.java:932)
	at sun.net.www.protocol.https.HttpsURLConnectionImpl.getInputStream(HttpsURLConnectionImpl.java:234)
	at org.apache.maven.wagon.providers.http.LightweightHttpWagon.fillInputData(LightweightHttpWagon.java:122)
	... 44 more
Caused by: java.io.IOException: Server returned HTTP response code: 502 for URL: https://repository.apache.org/content/repositories/snapshots/org/apache/activemq/activemq-blueprint/5.5-SNAPSHOT/maven-metadata.xml.sha1
	at sun.net.www.protocol.http.HttpURLConnection.getInputStream(HttpURLConnection.java:1196)
	at java.net.HttpURLConnection.getResponseCode(HttpURLConnection.java:367)
	at sun.net.www.protocol.https.HttpsURLConnectionImpl.getResponseCode(HttpsURLConnectionImpl.java:318)
	at org.apache.maven.wagon.providers.http.LightweightHttpWagon.fillInputData(LightweightHttpWagon.java:115)
	... 44 more
[INFO] ------------------------------------------------------------------------
[INFO] Error for project: ActiveMQ Tooling (during deploy)
[INFO] ------------------------------------------------------------------------
[INFO] Error retrieving previous build number for artifact 'org.apache.activemq.tooling:activemq-tooling:pom':
repository metadata for: 'snapshot org.apache.activemq.tooling:activemq-tooling:5.5-SNAPSHOT'
could not be retrieved from repository: apache.snapshots.https due to an error: Error transferring
file: Server returned HTTP response code: 502 for URL: https://repository.apache.org/content/repositories/snapshots/org/apache/activemq/tooling/activemq-tooling/5.5-SNAPSHOT/maven-metadata.xml.sha1

[INFO] ------------------------------------------------------------------------
[INFO] Trace
org.apache.maven.lifecycle.LifecycleExecutionException: Error retrieving previous build number
for artifact 'org.apache.activemq.tooling:activemq-tooling:pom': repository metadata for:
'snapshot org.apache.activemq.tooling:activemq-tooling:5.5-SNAPSHOT' could not be retrieved
from repository: apache.snapshots.https due to an error: Error transferring file: Server returned
HTTP response code: 502 for URL: https://repository.apache.org/content/repositories/snapshots/org/apache/activemq/tooling/activemq-tooling/5.5-SNAPSHOT/maven-metadata.xml.sha1
	at org.apache.maven.lifecycle.DefaultLifecycleExecutor.executeGoals(DefaultLifecycleExecutor.java:719)
	at org.apache.maven.lifecycle.DefaultLifecycleExecutor.executeGoalWithLifecycle(DefaultLifecycleExecutor.java:556)
	at org.apache.maven.lifecycle.DefaultLifecycleExecutor.executeGoal(DefaultLifecycleExecutor.java:535)
	at org.apache.maven.lifecycle.DefaultLifecycleExecutor.executeGoalAndHandleFailures(DefaultLifecycleExecutor.java:387)
	at org.apache.maven.lifecycle.DefaultLifecycleExecutor.executeTaskSegments(DefaultLifecycleExecutor.java:348)
	at org.apache.maven.lifecycle.DefaultLifecycleExecutor.execute(DefaultLifecycleExecutor.java:180)
	at org.apache.maven.lifecycle.LifecycleExecutorInterceptor.execute(LifecycleExecutorInterceptor.java:65)
	at org.apache.maven.DefaultMaven.doExecute(DefaultMaven.java:328)
	at org.apache.maven.DefaultMaven.execute(DefaultMaven.java:138)
	at org.apache.maven.cli.MavenCli.main(MavenCli.java:362)
	at sun.reflect.NativeMethodAccessorImpl.invoke0(Native Method)
	at sun.reflect.NativeMethodAccessorImpl.invoke(NativeMethodAccessorImpl.java:39)
	at sun.reflect.DelegatingMethodAccessorImpl.invoke(DelegatingMethodAccessorImpl.java:25)
	at java.lang.reflect.Method.invoke(Method.java:592)
	at org.codehaus.classworlds.Launcher.launchEnhanced(Launcher.java:315)
	at org.codehaus.classworlds.Launcher.launch(Launcher.java:255)
	at hudson.maven.agent.Main.launch(Main.java:165)
	at hudson.maven.MavenBuilder.call(MavenBuilder.java:165)
	at hudson.maven.MavenModuleSetBuild$Builder.call(MavenModuleSetBuild.java:750)
	at hudson.maven.MavenModuleSetBuild$Builder.call(MavenModuleSetBuild.java:694)
	at hudson.remoting.UserRequest.perform(UserRequest.java:114)
	at hudson.remoting.UserRequest.perform(UserRequest.java:48)
	at hudson.remoting.Request$2.run(Request.java:270)
	at java.util.concurrent.Executors$RunnableAdapter.call(Executors.java:417)
	at java.util.concurrent.FutureTask$Sync.innerRun(FutureTask.java:269)
	at java.util.concurrent.FutureTask.run(FutureTask.java:123)
	at java.util.concurrent.ThreadPoolExecutor$Worker.runTask(ThreadPoolExecutor.java:651)
	at java.util.concurrent.ThreadPoolExecutor$Worker.run(ThreadPoolExecutor.java:676)
	at java.lang.Thread.run(Thread.java:595)
Caused by: org.apache.maven.plugin.MojoExecutionException: Error retrieving previous build
number for artifact 'org.apache.activemq.tooling:activemq-tooling:pom': repository metadata
for: 'snapshot org.apache.activemq.tooling:activemq-tooling:5.5-SNAPSHOT' could not be retrieved
from repository: apache.snapshots.https due to an error: Error transferring file: Server returned
HTTP response code: 502 for URL: https://repository.apache.org/content/repositories/snapshots/org/apache/activemq/tooling/activemq-tooling/5.5-SNAPSHOT/maven-metadata.xml.sha1
	at org.apache.maven.plugin.deploy.DeployMojo.execute(DeployMojo.java:189)
	at org.apache.maven.plugin.DefaultPluginManager.executeMojo(DefaultPluginManager.java:490)
	at hudson.maven.agent.PluginManagerInterceptor.executeMojo(PluginManagerInterceptor.java:182)
	at org.apache.maven.lifecycle.DefaultLifecycleExecutor.executeGoals(DefaultLifecycleExecutor.java:694)
	... 28 more
Caused by: org.apache.maven.artifact.deployer.ArtifactDeploymentException: Error retrieving
previous build number for artifact 'org.apache.activemq.tooling:activemq-tooling:pom': repository
metadata for: 'snapshot org.apache.activemq.tooling:activemq-tooling:5.5-SNAPSHOT' could not
be retrieved from repository: apache.snapshots.https due to an error: Error transferring file:
Server returned HTTP response code: 502 for URL: https://repository.apache.org/content/repositories/snapshots/org/apache/activemq/tooling/activemq-tooling/5.5-SNAPSHOT/maven-metadata.xml.sha1
	at org.apache.maven.artifact.transform.SnapshotTransformation.transformForDeployment(SnapshotTransformation.java:106)
	at org.apache.maven.artifact.transform.DefaultArtifactTransformationManager.transformForDeployment(DefaultArtifactTransformationManager.java:74)
	at org.apache.maven.artifact.deployer.DefaultArtifactDeployer.deploy(DefaultArtifactDeployer.java:86)
	at org.apache.maven.plugin.deploy.DeployMojo.execute(DeployMojo.java:148)
	... 31 more
Caused by: org.apache.maven.artifact.repository.metadata.RepositoryMetadataResolutionException:
repository metadata for: 'snapshot org.apache.activemq.tooling:activemq-tooling:5.5-SNAPSHOT'
could not be retrieved from repository: apache.snapshots.https due to an error: Error transferring
file: Server returned HTTP response code: 502 for URL: https://repository.apache.org/content/repositories/snapshots/org/apache/activemq/tooling/activemq-tooling/5.5-SNAPSHOT/maven-metadata.xml.sha1
	at org.apache.maven.artifact.repository.metadata.DefaultRepositoryMetadataManager.resolveAlways(DefaultRepositoryMetadataManager.java:351)
	at org.apache.maven.artifact.transform.SnapshotTransformation.resolveLatestSnapshotBuildNumber(SnapshotTransformation.java:161)
	at org.apache.maven.artifact.transform.SnapshotTransformation.transformForDeployment(SnapshotTransformation.java:100)
	... 34 more
Caused by: org.apache.maven.wagon.TransferFailedException: Error transferring file: Server
returned HTTP response code: 502 for URL: https://repository.apache.org/content/repositories/snapshots/org/apache/activemq/tooling/activemq-tooling/5.5-SNAPSHOT/maven-metadata.xml.sha1
	at org.apache.maven.wagon.providers.http.LightweightHttpWagon.fillInputData(LightweightHttpWagon.java:143)
	at org.apache.maven.wagon.StreamWagon.getInputStream(StreamWagon.java:116)
	at org.apache.maven.wagon.StreamWagon.getIfNewer(StreamWagon.java:88)
	at org.apache.maven.wagon.StreamWagon.get(StreamWagon.java:61)
	at org.apache.maven.artifact.manager.DefaultWagonManager.verifyChecksum(DefaultWagonManager.java:748)
	at org.apache.maven.artifact.manager.DefaultWagonManager.getRemoteFile(DefaultWagonManager.java:577)
	at org.apache.maven.artifact.manager.DefaultWagonManager.getArtifactMetadataFromDeploymentRepository(DefaultWagonManager.java:452)
	at org.apache.maven.artifact.repository.metadata.DefaultRepositoryMetadataManager.getArtifactMetadataFromDeploymentRepository(DefaultRepositoryMetadataManager.java:379)
	at org.apache.maven.artifact.repository.metadata.DefaultRepositoryMetadataManager.resolveAlways(DefaultRepositoryMetadataManager.java:347)
	... 36 more
Caused by: java.io.IOException: Server returned HTTP response code: 502 for URL: https://repository.apache.org/content/repositories/snapshots/org/apache/activemq/tooling/activemq-tooling/5.5-SNAPSHOT/maven-metadata.xml.sha1
	at sun.reflect.NativeConstructorAccessorImpl.newInstance0(Native Method)
	at sun.reflect.NativeConstructorAccessorImpl.newInstance(NativeConstructorAccessorImpl.java:39)
	at sun.reflect.DelegatingConstructorAccessorImpl.newInstance(DelegatingConstructorAccessorImpl.java:27)
	at java.lang.reflect.Constructor.newInstance(Constructor.java:501)
	at sun.net.www.protocol.http.HttpURLConnection$6.run(HttpURLConnection.java:1250)
	at java.security.AccessController.doPrivileged(Native Method)
	at sun.net.www.protocol.http.HttpURLConnection.getChainedException(HttpURLConnection.java:1244)
	at sun.net.www.protocol.http.HttpURLConnection.getInputStream(HttpURLConnection.java:932)
	at sun.net.www.protocol.https.HttpsURLConnectionImpl.getInputStream(HttpsURLConnectionImpl.java:234)
	at org.apache.maven.wagon.providers.http.LightweightHttpWagon.fillInputData(LightweightHttpWagon.java:122)
	... 44 more
Caused by: java.io.IOException: Server returned HTTP response code: 502 for URL: https://repository.apache.org/content/repositories/snapshots/org/apache/activemq/tooling/activemq-tooling/5.5-SNAPSHOT/maven-metadata.xml.sha1
	at sun.net.www.protocol.http.HttpURLConnection.getInputStream(HttpURLConnection.java:1196)
	at java.net.HttpURLConnection.getResponseCode(HttpURLConnection.java:367)
	at sun.net.www.protocol.https.HttpsURLConnectionImpl.getResponseCode(HttpsURLConnectionImpl.java:318)
	at org.apache.maven.wagon.providers.http.LightweightHttpWagon.fillInputData(LightweightHttpWagon.java:115)
	... 44 more
[INFO] ------------------------------------------------------------------------
[INFO] BUILD ERRORS
[INFO] ------------------------------------------------------------------------
[INFO] Total time: 97 minutes 6 seconds
[INFO] Finished at: Sat Nov 13 09:09:16 UTC 2010
[INFO] Final Memory: 89M/1094M
[INFO] ------------------------------------------------------------------------


Mime
View raw message