activemq-dev mailing list archives

Site index · List index
Message view « Date » · « Thread »
Top « Date » · « Thread »
From Apache Hudson Server <hud...@hudson.apache.org>
Subject Build failed in Hudson: ActiveMQ-Trunk-Deploy #182
Date Thu, 25 Nov 2010 10:23:23 GMT
See <https://hudson.apache.org/hudson/job/ActiveMQ-Trunk-Deploy/182/changes>

Changes:

[dejanb] https://issues.apache.org/activemq/browse/AMQ-3017 - fllesystem blob strategy

[gtully] https://issues.apache.org/activemq/browse/AMQ-2985 - fix order so alter table works
for oracle - ORA-30649:missing directory keyword

[dejanb] https://issues.apache.org/activemq/browse/AMQ-3052 - memory leak in SimpleAuthenticationBroker

[gtully] https://issues.apache.org/activemq/browse/AMQ-2985 - fix npe on remove consumer track
new consumer last ack at lowest priority such that there can be no replay

[dejanb] https://issues.apache.org/activemq/browse/AMQ-3028 - sync pageCache

[gtully] https://issues.apache.org/activemq/browse/AMQ-2985 - fix regression of DurableSubscriptionUnsubscribeTest,
check for empty topic

[dejanb] https://issues.apache.org/activemq/browse/AMQ-3050 - return value for activemq stop
command

------------------------------------------
[...truncated 8261 lines...]
[INFO] [surefire:test {execution: default-test}]
Downloading: http://repository.apache.org/snapshots/org/apache/maven/surefire/surefire-junit/2.5/surefire-junit-2.5.pom
[INFO] Unable to find resource 'org.apache.maven.surefire:surefire-junit:pom:2.5' in repository
apache.snapshots (https://repository.apache.org/content/repositories/snapshots/)
Downloading: http://repo1.maven.org/maven2/org/apache/maven/surefire/surefire-junit/2.5/surefire-junit-2.5.pom

Downloading: http://repository.apache.org/snapshots/junit/junit/3.8.1/junit-3.8.1.jar
Downloading: http://repository.apache.org/snapshots/org/apache/maven/surefire/surefire-junit/2.5/surefire-junit-2.5.jar
[INFO] Unable to find resource 'junit:junit:jar:3.8.1' in repository apache.snapshots (https://repository.apache.org/content/repositories/snapshots/)
Downloading: http://repo1.maven.org/maven2/junit/junit/3.8.1/junit-3.8.1.jar
[INFO] Unable to find resource 'org.apache.maven.surefire:surefire-junit:jar:2.5' in repository
apache.snapshots (https://repository.apache.org/content/repositories/snapshots/)
Downloading: http://repo1.maven.org/maven2/org/apache/maven/surefire/surefire-junit/2.5/surefire-junit-2.5.jar


[INFO] Surefire report directory: <https://hudson.apache.org/hudson/job/ActiveMQ-Trunk-Deploy/ws/trunk/activemq-blueprint/target/surefire-reports>

-------------------------------------------------------
 T E S T S
-------------------------------------------------------
There are no tests to run.

Results :

Tests run: 0, Failures: 0, Errors: 0, Skipped: 0

[INFO] [bundle:bundle {execution: default-bundle}]

[WARNING] Warning building bundle org.apache.activemq:activemq-blueprint:bundle:5.5-SNAPSHOT
: Instructions in Export-Package that are never used: org\.apache\.activemq.*.*
[WARNING] Warning building bundle org.apache.activemq:activemq-blueprint:bundle:5.5-SNAPSHOT
: Superfluous export-package instructions: [org.apache.activemq**]
[INFO] Preparing source:jar
[WARNING] Removing: jar from forked lifecycle, to prevent recursive invocation.
[HUDSON] Archiving <https://hudson.apache.org/hudson/job/ActiveMQ-Trunk-Deploy/ws/trunk/activemq-blueprint/pom.xml>
to /home/hudson/hudson/jobs/ActiveMQ-Trunk-Deploy/modules/org.apache.activemq$activemq-blueprint/builds/2010-11-25_10-05-38/archive/org.apache.activemq/activemq-blueprint/5.5-SNAPSHOT/pom.xml
[HUDSON] Archiving <https://hudson.apache.org/hudson/job/ActiveMQ-Trunk-Deploy/ws/trunk/activemq-blueprint/target/activemq-blueprint-5.5-SNAPSHOT.jar>
to /home/hudson/hudson/jobs/ActiveMQ-Trunk-Deploy/modules/org.apache.activemq$activemq-blueprint/builds/2010-11-25_10-05-38/archive/org.apache.activemq/activemq-blueprint/5.5-SNAPSHOT/activemq-blueprint-5.5-SNAPSHOT.jar
[INFO] [enforcer:enforce {execution: default}]
[INFO] [bundle:cleanVersions {execution: cleanVersions}]
[INFO] [source:jar {execution: attach-sources}]
[INFO] Building jar: <https://hudson.apache.org/hudson/job/ActiveMQ-Trunk-Deploy/ws/trunk/activemq-blueprint/target/activemq-blueprint-5.5-SNAPSHOT-sources.jar>
[INFO] [javadoc:jar {execution: attach-javadocs}]
[INFO] [ianal:verify-legal-files {execution: default}]
[INFO] Checking legal files in: activemq-blueprint-5.5-SNAPSHOT.jar
[INFO] Checking legal files in: activemq-blueprint-5.5-SNAPSHOT-sources.jar
[INFO] [install:install {execution: default-install}]
[INFO] Installing <https://hudson.apache.org/hudson/job/ActiveMQ-Trunk-Deploy/ws/trunk/activemq-blueprint/target/activemq-blueprint-5.5-SNAPSHOT.jar>
to <https://hudson.apache.org/hudson/job/ActiveMQ-Trunk-Deploy/ws/.repository/org/apache/activemq/activemq-blueprint/5.5-SNAPSHOT/activemq-blueprint-5.5-SNAPSHOT.jar>
[INFO] Installing <https://hudson.apache.org/hudson/job/ActiveMQ-Trunk-Deploy/ws/trunk/activemq-blueprint/target/activemq-blueprint-5.5-SNAPSHOT-sources.jar>
to <https://hudson.apache.org/hudson/job/ActiveMQ-Trunk-Deploy/ws/.repository/org/apache/activemq/activemq-blueprint/5.5-SNAPSHOT/activemq-blueprint-5.5-SNAPSHOT-sources.jar>
[INFO] [bundle:install {execution: default-install}]
[INFO] Installing org/apache/activemq/activemq-blueprint/5.5-SNAPSHOT/activemq-blueprint-5.5-SNAPSHOT.jar
[INFO] Writing OBR metadata
[INFO] [deploy:deploy {execution: default-deploy}]
[INFO] Retrieving previous build number from apache.snapshots.https
Uploading: https://repository.apache.org/content/repositories/snapshots/org/apache/activemq/activemq-blueprint/5.5-SNAPSHOT/activemq-blueprint-5.5-SNAPSHOT.jar
8K uploaded  (activemq-blueprint-5.5-SNAPSHOT.jar)
[INFO] Uploading project information for activemq-blueprint 5.5-SNAPSHOT
[INFO] Retrieving previous metadata from apache.snapshots.https
[INFO] Uploading repository metadata for: 'artifact org.apache.activemq:activemq-blueprint'
[INFO] Retrieving previous metadata from apache.snapshots.https
[INFO] Uploading repository metadata for: 'snapshot org.apache.activemq:activemq-blueprint:5.5-SNAPSHOT'
[INFO] Retrieving previous build number from apache.snapshots.https
Uploading: https://repository.apache.org/content/repositories/snapshots/org/apache/activemq/activemq-blueprint/5.5-SNAPSHOT/activemq-blueprint-5.5-SNAPSHOT-sources.jar
6K uploaded  (activemq-blueprint-5.5-SNAPSHOT-sources.jar)
[INFO] [bundle:deploy {execution: default-deploy}]
[INFO] Remote OBR update disabled (enable with -DremoteOBR)
[HUDSON] Archiving <https://hudson.apache.org/hudson/job/ActiveMQ-Trunk-Deploy/ws/trunk/activemq-blueprint/target/activemq-blueprint-5.5-SNAPSHOT-sources.jar>
to /home/hudson/hudson/jobs/ActiveMQ-Trunk-Deploy/modules/org.apache.activemq$activemq-blueprint/builds/2010-11-25_10-05-38/archive/org.apache.activemq/activemq-blueprint/5.5-SNAPSHOT/activemq-blueprint-5.5-SNAPSHOT-sources.jar
[INFO] ------------------------------------------------------------------------
[INFO] SKIPPING ActiveMQ :: Apache Karaf
[INFO]    task-segment: [clean, deploy]
[INFO] This project has been banned from further executions due to previous failures.
[INFO] ------------------------------------------------------------------------
[INFO] ------------------------------------------------------------------------
[INFO] SKIPPING ActiveMQ :: RAR
[INFO]    task-segment: [clean, deploy]
[INFO] This project has been banned from further executions due to previous failures.
[INFO] ------------------------------------------------------------------------
[INFO] ------------------------------------------------------------------------
[INFO] SKIPPING ActiveMQ :: Run Jar
[INFO]    task-segment: [clean, deploy]
[INFO] This project has been banned from further executions due to previous failures.
[INFO] ------------------------------------------------------------------------
[INFO] ------------------------------------------------------------------------
[INFO] SKIPPING ActiveMQ :: Spring
[INFO]    task-segment: [clean, deploy]
[INFO] This project has been banned from further executions due to previous failures.
[INFO] ------------------------------------------------------------------------
[INFO] ------------------------------------------------------------------------
[INFO] Building ActiveMQ Tooling
[INFO]    task-segment: [clean, deploy]
[INFO] ------------------------------------------------------------------------
[INFO] [clean:clean {execution: default-clean}]
[INFO] [enforcer:enforce {execution: default}]
[INFO] [bundle:cleanVersions {execution: cleanVersions}]
[INFO] [remote-resources:process {execution: default}]
[INFO] [site:attach-descriptor {execution: default-attach-descriptor}]
[INFO] Preparing source:jar
[WARNING] Removing: jar from forked lifecycle, to prevent recursive invocation.
[HUDSON] Archiving <https://hudson.apache.org/hudson/job/ActiveMQ-Trunk-Deploy/ws/trunk/activemq-tooling/pom.xml>
to /home/hudson/hudson/jobs/ActiveMQ-Trunk-Deploy/modules/org.apache.activemq.tooling$activemq-tooling/builds/2010-11-25_10-05-38/archive/org.apache.activemq.tooling/activemq-tooling/5.5-SNAPSHOT/pom.xml
[INFO] [enforcer:enforce {execution: default}]
[INFO] [bundle:cleanVersions {execution: cleanVersions}]
[INFO] [source:jar {execution: attach-sources}]
[INFO] [javadoc:jar {execution: attach-javadocs}]
[INFO] Not executing Javadoc as the project is not a Java classpath-capable package
[INFO] [ianal:verify-legal-files {execution: default}]
[INFO] [install:install {execution: default-install}]
[INFO] Installing <https://hudson.apache.org/hudson/job/ActiveMQ-Trunk-Deploy/ws/trunk/activemq-tooling/pom.xml>
to <https://hudson.apache.org/hudson/job/ActiveMQ-Trunk-Deploy/ws/.repository/org/apache/activemq/tooling/activemq-tooling/5.5-SNAPSHOT/activemq-tooling-5.5-SNAPSHOT.pom>
[INFO] [deploy:deploy {execution: default-deploy}]
[INFO] Retrieving previous build number from apache.snapshots.https
Uploading: https://repository.apache.org/content/repositories/snapshots/org/apache/activemq/tooling/activemq-tooling/5.5-SNAPSHOT/activemq-tooling-5.5-SNAPSHOT.pom
1K uploaded  (activemq-tooling-5.5-SNAPSHOT.pom)
[INFO] Retrieving previous metadata from apache.snapshots.https
[INFO] Uploading repository metadata for: 'snapshot org.apache.activemq.tooling:activemq-tooling:5.5-SNAPSHOT'
[INFO] Retrieving previous metadata from apache.snapshots.https
[INFO] Uploading repository metadata for: 'artifact org.apache.activemq.tooling:activemq-tooling'
[HUDSON] Archiving <https://hudson.apache.org/hudson/job/ActiveMQ-Trunk-Deploy/ws/.repository/org/apache/activemq/tooling/activemq-tooling/5.5-SNAPSHOT/activemq-tooling-5.5-SNAPSHOT.pom>
to /home/hudson/hudson/jobs/ActiveMQ-Trunk-Deploy/modules/org.apache.activemq.tooling$activemq-tooling/builds/2010-11-25_10-05-38/archive/org.apache.activemq.tooling/activemq-tooling/5.5-SNAPSHOT/activemq-tooling-5.5-SNAPSHOT.pom
[INFO] ------------------------------------------------------------------------
[INFO] SKIPPING ActiveMQ :: Memory Usage Test Plugin
[INFO]    task-segment: [clean, deploy]
[INFO] This project has been banned from further executions due to previous failures.
[INFO] ------------------------------------------------------------------------
[INFO] ------------------------------------------------------------------------
[INFO] SKIPPING ActiveMQ :: Performance Test Plugin
[INFO]    task-segment: [clean, deploy]
[INFO] This project has been banned from further executions due to previous failures.
[INFO] ------------------------------------------------------------------------
[INFO] ------------------------------------------------------------------------
[INFO] SKIPPING ActiveMQ :: StartUp Plugin
[INFO]    task-segment: [clean, deploy]
[INFO] This project has been banned from further executions due to previous failures.
[INFO] ------------------------------------------------------------------------
[INFO] ------------------------------------------------------------------------
[INFO] SKIPPING ActiveMQ :: Web
[INFO]    task-segment: [clean, deploy]
[INFO] This project has been banned from further executions due to previous failures.
[INFO] ------------------------------------------------------------------------
[INFO] ------------------------------------------------------------------------
[INFO] SKIPPING ActiveMQ :: Web Demo
[INFO]    task-segment: [clean, deploy]
[INFO] This project has been banned from further executions due to previous failures.
[INFO] ------------------------------------------------------------------------
[INFO] ------------------------------------------------------------------------
[INFO] SKIPPING ActiveMQ :: XMPP
[INFO]    task-segment: [clean, deploy]
[INFO] This project has been banned from further executions due to previous failures.
[INFO] ------------------------------------------------------------------------
[INFO] ------------------------------------------------------------------------
[INFO] SKIPPING ActiveMQ :: Web Console
[INFO]    task-segment: [clean, deploy]
[INFO] This project has been banned from further executions due to previous failures.
[INFO] ------------------------------------------------------------------------
[INFO] ------------------------------------------------------------------------
[INFO] SKIPPING ActiveMQ :: Assembly
[INFO]    task-segment: [clean, deploy]
[INFO] This project has been banned from further executions due to previous failures.
[INFO] ------------------------------------------------------------------------
[INFO] 
[INFO] 
[INFO] ------------------------------------------------------------------------
[INFO] Reactor Summary:
[INFO] ------------------------------------------------------------------------
[INFO] ActiveMQ .............................................. SUCCESS [6:16.379s]
[INFO] ActiveMQ :: KahaDB .................................... SUCCESS [1:37.131s]
[INFO] ActiveMQ :: JAAS ...................................... SUCCESS [2:44.508s]
[INFO] Openwire Generator .................................... SUCCESS [1:15.154s]
[INFO] ActiveMQ :: jmdns 1.0 ................................. SUCCESS [51.146s]
[INFO] ActiveMQ :: Core ...................................... FAILED [2:15.442s]
[INFO] ActiveMQ :: RA ........................................ SKIPPED (dependency build failed
or was skipped)
[INFO] ActiveMQ :: Pool ...................................... SKIPPED (dependency build failed
or was skipped)
[INFO] ActiveMQ :: Camel ..................................... SKIPPED (dependency build failed
or was skipped)
[INFO] ActiveMQ :: Console ................................... SKIPPED (dependency build failed
or was skipped)
[INFO] ActiveMQ :: Optional .................................. SKIPPED (dependency build failed
or was skipped)
[INFO] ActiveMQ :: Jar Bundle ................................ SKIPPED (dependency build failed
or was skipped)
[INFO] ActiveMQ :: File Server ............................... SKIPPED (dependency build failed
or was skipped)
[INFO] ActiveMQ :: Blueprint ................................. SUCCESS [54.238s]
[INFO] ActiveMQ :: Apache Karaf .............................. SKIPPED (dependency build failed
or was skipped)
[INFO] ActiveMQ :: RAR ....................................... SKIPPED (dependency build failed
or was skipped)
[INFO] ActiveMQ :: Run Jar ................................... SKIPPED (dependency build failed
or was skipped)
[INFO] ActiveMQ :: Spring .................................... SKIPPED (dependency build failed
or was skipped)
[INFO] ActiveMQ Tooling ...................................... SUCCESS [9.170s]
[INFO] ActiveMQ :: Memory Usage Test Plugin .................. SKIPPED (dependency build failed
or was skipped)
[INFO] ActiveMQ :: Performance Test Plugin ................... SKIPPED (dependency build failed
or was skipped)
[INFO] ActiveMQ :: StartUp Plugin ............................ SKIPPED (dependency build failed
or was skipped)
[INFO] ActiveMQ :: Web ....................................... SKIPPED (dependency build failed
or was skipped)
[INFO] ActiveMQ :: Web Demo .................................. SKIPPED (dependency build failed
or was skipped)
[INFO] ActiveMQ :: XMPP ...................................... SKIPPED (dependency build failed
or was skipped)
[INFO] ActiveMQ :: Web Console ............................... SKIPPED (dependency build failed
or was skipped)
[INFO] ActiveMQ :: Assembly .................................. SKIPPED (dependency build failed
or was skipped)
[INFO] ------------------------------------------------------------------------
[INFO] Error for project: ActiveMQ :: Core (during deploy)
[INFO] ------------------------------------------------------------------------
[INFO] Compilation failure
<https://hudson.apache.org/hudson/job/ActiveMQ-Trunk-Deploy/ws/trunk/activemq-core/src/main/java/org/apache/activemq/blob/FileSystemBlobStrategy.java>:[121,38]
cannot find symbol
symbol  : constructor IOException(java.lang.String,java.net.URISyntaxException)
location: class java.io.IOException


[INFO] ------------------------------------------------------------------------
[INFO] Trace
org.apache.maven.BuildFailureException: Compilation failure
<https://hudson.apache.org/hudson/job/ActiveMQ-Trunk-Deploy/ws/trunk/activemq-core/src/main/java/org/apache/activemq/blob/FileSystemBlobStrategy.java>:[121,38]
cannot find symbol
symbol  : constructor IOException(java.lang.String,java.net.URISyntaxException)
location: class java.io.IOException


	at org.apache.maven.lifecycle.DefaultLifecycleExecutor.executeGoals(DefaultLifecycleExecutor.java:715)
	at org.apache.maven.lifecycle.DefaultLifecycleExecutor.executeGoalWithLifecycle(DefaultLifecycleExecutor.java:556)
	at org.apache.maven.lifecycle.DefaultLifecycleExecutor.executeGoal(DefaultLifecycleExecutor.java:535)
	at org.apache.maven.lifecycle.DefaultLifecycleExecutor.executeGoalAndHandleFailures(DefaultLifecycleExecutor.java:387)
	at org.apache.maven.lifecycle.DefaultLifecycleExecutor.executeTaskSegments(DefaultLifecycleExecutor.java:348)
	at org.apache.maven.lifecycle.DefaultLifecycleExecutor.execute(DefaultLifecycleExecutor.java:180)
	at org.apache.maven.lifecycle.LifecycleExecutorInterceptor.execute(LifecycleExecutorInterceptor.java:65)
	at org.apache.maven.DefaultMaven.doExecute(DefaultMaven.java:328)
	at org.apache.maven.DefaultMaven.execute(DefaultMaven.java:138)
	at org.apache.maven.cli.MavenCli.main(MavenCli.java:362)
	at sun.reflect.NativeMethodAccessorImpl.invoke0(Native Method)
	at sun.reflect.NativeMethodAccessorImpl.invoke(NativeMethodAccessorImpl.java:39)
	at sun.reflect.DelegatingMethodAccessorImpl.invoke(DelegatingMethodAccessorImpl.java:25)
	at java.lang.reflect.Method.invoke(Method.java:592)
	at org.codehaus.classworlds.Launcher.launchEnhanced(Launcher.java:315)
	at org.codehaus.classworlds.Launcher.launch(Launcher.java:255)
	at hudson.maven.agent.Main.launch(Main.java:165)
	at hudson.maven.MavenBuilder.call(MavenBuilder.java:165)
	at hudson.maven.MavenModuleSetBuild$Builder.call(MavenModuleSetBuild.java:750)
	at hudson.maven.MavenModuleSetBuild$Builder.call(MavenModuleSetBuild.java:694)
	at hudson.remoting.UserRequest.perform(UserRequest.java:114)
	at hudson.remoting.UserRequest.perform(UserRequest.java:48)
	at hudson.remoting.Request$2.run(Request.java:270)
	at java.util.concurrent.Executors$RunnableAdapter.call(Executors.java:417)
	at java.util.concurrent.FutureTask$Sync.innerRun(FutureTask.java:269)
	at java.util.concurrent.FutureTask.run(FutureTask.java:123)
	at java.util.concurrent.ThreadPoolExecutor$Worker.runTask(ThreadPoolExecutor.java:651)
	at java.util.concurrent.ThreadPoolExecutor$Worker.run(ThreadPoolExecutor.java:676)
	at java.lang.Thread.run(Thread.java:595)
Caused by: org.apache.maven.plugin.CompilationFailureException: Compilation failure
<https://hudson.apache.org/hudson/job/ActiveMQ-Trunk-Deploy/ws/trunk/activemq-core/src/main/java/org/apache/activemq/blob/FileSystemBlobStrategy.java>:[121,38]
cannot find symbol
symbol  : constructor IOException(java.lang.String,java.net.URISyntaxException)
location: class java.io.IOException


	at org.apache.maven.plugin.AbstractCompilerMojo.execute(AbstractCompilerMojo.java:516)
	at org.apache.maven.plugin.CompilerMojo.execute(CompilerMojo.java:114)
	at org.apache.maven.plugin.DefaultPluginManager.executeMojo(DefaultPluginManager.java:490)
	at hudson.maven.agent.PluginManagerInterceptor.executeMojo(PluginManagerInterceptor.java:182)
	at org.apache.maven.lifecycle.DefaultLifecycleExecutor.executeGoals(DefaultLifecycleExecutor.java:694)
	... 28 more
[INFO] ------------------------------------------------------------------------
[INFO] BUILD ERRORS
[INFO] ------------------------------------------------------------------------
[INFO] Total time: 17 minutes 35 seconds
[INFO] Finished at: Thu Nov 25 10:23:21 UTC 2010
[INFO] Final Memory: 71M/1060M
[INFO] ------------------------------------------------------------------------
Sending e-mails to: dev@activemq.apache.org
channel stopped


Mime
View raw message