activemq-dev mailing list archives

Site index · List index
Message view « Date » · « Thread »
Top « Date » · « Thread »
From Apache Hudson Server <hud...@hudson.apache.org>
Subject Build failed in Hudson: ActiveMQ-Apollo-Deploy #8
Date Fri, 12 Nov 2010 07:16:56 GMT
See <https://hudson.apache.org/hudson/job/ActiveMQ-Apollo-Deploy/8/changes>

Changes:

[chirino] Simplified stomp handler logic a bit.

[chirino] Updating the stomp protocol to use the security services configured on a virtual
host.

[chirino] Removing dead code.

[chirino] laying down the initial framework for pluggable security.

[chirino] Converted to from scaml to jade templates since they are more concise.

[chirino] All configuration DTO fields are now reference fields and not defaulted to values.
 This allows the XML to be written back out /w the same data it was load from.  The previous
approach to defaulting data values was causing the written XML balloon with more data.

[chirino] Added a test case that uses stomp over ssl.

[chirino] Broker now loads the key and trust configured so that they can be injected into
the connector's transport server if they are needed.

[chirino] Allows configuring a key/storage element per broker.

[chirino] Added a tls/ssl transport.

[chirino] Moved the RichFile stuff into the FileSupport class in the util module.

------------------------------------------
[...truncated 8975 lines...]
[INFO] Unable to find resource 'asm:asm-commons:pom:3.1' in repository snapshots.scala-tools.org
(http://scala-tools.org/repo-snapshots)
Downloading: http://repo.fusesource.com/nexus/content/repositories/snapshots/asm/asm-commons/3.1/asm-commons-3.1.pom
[INFO] Unable to find resource 'asm:asm-commons:pom:3.1' in repository fusesource.snapshots
(http://repo.fusesource.com/nexus/content/repositories/snapshots)
Downloading: http://repo1.maven.org/maven2/asm/asm-commons/3.1/asm-commons-3.1.pom

Downloading: http://repo.open.iona.com/maven2/asm/asm-tree/3.1/asm-tree-3.1.pom
[INFO] Unable to find resource 'asm:asm-tree:pom:3.1' in repository open.iona.m2 (http://repo.open.iona.com/maven2)
Downloading: http://download.java.net/maven/2/asm/asm-tree/3.1/asm-tree-3.1.pom
[INFO] Unable to find resource 'asm:asm-tree:pom:3.1' in repository maven2-repository.dev.java.net
(http://download.java.net/maven/2)
Downloading: http://scala-tools.org/repo-releases/asm/asm-tree/3.1/asm-tree-3.1.pom
[INFO] Unable to find resource 'asm:asm-tree:pom:3.1' in repository scala (http://scala-tools.org/repo-releases)
Downloading: http://scala-tools.org/repo-snapshots/asm/asm-tree/3.1/asm-tree-3.1.pom
[INFO] Unable to find resource 'asm:asm-tree:pom:3.1' in repository snapshots.scala-tools.org
(http://scala-tools.org/repo-snapshots)
Downloading: http://repo.fusesource.com/nexus/content/repositories/snapshots/asm/asm-tree/3.1/asm-tree-3.1.pom
[INFO] Unable to find resource 'asm:asm-tree:pom:3.1' in repository fusesource.snapshots (http://repo.fusesource.com/nexus/content/repositories/snapshots)
Downloading: http://repo1.maven.org/maven2/asm/asm-tree/3.1/asm-tree-3.1.pom

Downloading: http://repo.open.iona.com/maven2/org/apache/maven/shared/maven-dependency-tree/1.1/maven-dependency-tree-1.1.pom
[INFO] Unable to find resource 'org.apache.maven.shared:maven-dependency-tree:pom:1.1' in
repository open.iona.m2 (http://repo.open.iona.com/maven2)
Downloading: http://download.java.net/maven/2/org/apache/maven/shared/maven-dependency-tree/1.1/maven-dependency-tree-1.1.pom
[INFO] Unable to find resource 'org.apache.maven.shared:maven-dependency-tree:pom:1.1' in
repository maven2-repository.dev.java.net (http://download.java.net/maven/2)
Downloading: http://scala-tools.org/repo-releases/org/apache/maven/shared/maven-dependency-tree/1.1/maven-dependency-tree-1.1.pom
[INFO] Unable to find resource 'org.apache.maven.shared:maven-dependency-tree:pom:1.1' in
repository scala (http://scala-tools.org/repo-releases)
Downloading: http://scala-tools.org/repo-snapshots/org/apache/maven/shared/maven-dependency-tree/1.1/maven-dependency-tree-1.1.pom
[INFO] Unable to find resource 'org.apache.maven.shared:maven-dependency-tree:pom:1.1' in
repository snapshots.scala-tools.org (http://scala-tools.org/repo-snapshots)
Downloading: http://repo.fusesource.com/nexus/content/repositories/snapshots/org/apache/maven/shared/maven-dependency-tree/1.1/maven-dependency-tree-1.1.pom
[INFO] Unable to find resource 'org.apache.maven.shared:maven-dependency-tree:pom:1.1' in
repository fusesource.snapshots (http://repo.fusesource.com/nexus/content/repositories/snapshots)
Downloading: http://repo1.maven.org/maven2/org/apache/maven/shared/maven-dependency-tree/1.1/maven-dependency-tree-1.1.pom

Downloading: http://repo.open.iona.com/maven2/org/apache/maven/shared/maven-dependency-tree/1.1/maven-dependency-tree-1.1.jar
Downloading: http://repo.open.iona.com/maven2/asm/asm-commons/3.1/asm-commons-3.1.jar
Downloading: http://repo.open.iona.com/maven2/com/google/code/google-collections/google-collect/snapshot-20080530/google-collect-snapshot-20080530.jar
Downloading: http://repo.open.iona.com/maven2/jdom/jdom/1.0/jdom-1.0.jar
[INFO] Unable to find resource 'jdom:jdom:jar:1.0' in repository open.iona.m2 (http://repo.open.iona.com/maven2)
Downloading: http://download.java.net/maven/2/jdom/jdom/1.0/jdom-1.0.jar
[INFO] Unable to find resource 'com.google.code.google-collections:google-collect:jar:snapshot-20080530'
in repository open.iona.m2 (http://repo.open.iona.com/maven2)
[INFO] Unable to find resource 'org.apache.maven.shared:maven-dependency-tree:jar:1.1' in
repository open.iona.m2 (http://repo.open.iona.com/maven2)
Downloading: http://download.java.net/maven/2/com/google/code/google-collections/google-collect/snapshot-20080530/google-collect-snapshot-20080530.jar
Downloading: http://download.java.net/maven/2/org/apache/maven/shared/maven-dependency-tree/1.1/maven-dependency-tree-1.1.jar
[INFO] Unable to find resource 'asm:asm-commons:jar:3.1' in repository open.iona.m2 (http://repo.open.iona.com/maven2)
Downloading: http://download.java.net/maven/2/asm/asm-commons/3.1/asm-commons-3.1.jar
[INFO] Unable to find resource 'jdom:jdom:jar:1.0' in repository maven2-repository.dev.java.net
(http://download.java.net/maven/2)
Downloading: http://scala-tools.org/repo-releases/jdom/jdom/1.0/jdom-1.0.jar
[INFO] Unable to find resource 'org.apache.maven.shared:maven-dependency-tree:jar:1.1' in
repository maven2-repository.dev.java.net (http://download.java.net/maven/2)
Downloading: http://scala-tools.org/repo-releases/org/apache/maven/shared/maven-dependency-tree/1.1/maven-dependency-tree-1.1.jar
[INFO] Unable to find resource 'com.google.code.google-collections:google-collect:jar:snapshot-20080530'
in repository maven2-repository.dev.java.net (http://download.java.net/maven/2)
Downloading: http://scala-tools.org/repo-releases/com/google/code/google-collections/google-collect/snapshot-20080530/google-collect-snapshot-20080530.jar
[INFO] Unable to find resource 'asm:asm-commons:jar:3.1' in repository maven2-repository.dev.java.net
(http://download.java.net/maven/2)
Downloading: http://scala-tools.org/repo-releases/asm/asm-commons/3.1/asm-commons-3.1.jar
[INFO] Unable to find resource 'jdom:jdom:jar:1.0' in repository scala (http://scala-tools.org/repo-releases)
[INFO] Unable to find resource 'org.apache.maven.shared:maven-dependency-tree:jar:1.1' in
repository scala (http://scala-tools.org/repo-releases)
Downloading: http://scala-tools.org/repo-snapshots/jdom/jdom/1.0/jdom-1.0.jar
[INFO] Unable to find resource 'com.google.code.google-collections:google-collect:jar:snapshot-20080530'
in repository scala (http://scala-tools.org/repo-releases)
[INFO] Unable to find resource 'asm:asm-commons:jar:3.1' in repository scala (http://scala-tools.org/repo-releases)
Downloading: http://scala-tools.org/repo-snapshots/com/google/code/google-collections/google-collect/snapshot-20080530/google-collect-snapshot-20080530.jar
Downloading: http://scala-tools.org/repo-snapshots/org/apache/maven/shared/maven-dependency-tree/1.1/maven-dependency-tree-1.1.jar
Downloading: http://scala-tools.org/repo-snapshots/asm/asm-commons/3.1/asm-commons-3.1.jar
[INFO] Unable to find resource 'jdom:jdom:jar:1.0' in repository snapshots.scala-tools.org
(http://scala-tools.org/repo-snapshots)
[INFO] Unable to find resource 'asm:asm-commons:jar:3.1' in repository snapshots.scala-tools.org
(http://scala-tools.org/repo-snapshots)
[INFO] Unable to find resource 'com.google.code.google-collections:google-collect:jar:snapshot-20080530'
in repository snapshots.scala-tools.org (http://scala-tools.org/repo-snapshots)
[INFO] Downloading: http://repo.fusesource.com/nexus/content/repositories/snapshots/asm/asm-commons/3.1/asm-commons-3.1.jar
Downloading: http://repo.fusesource.com/nexus/content/repositories/snapshots/jdom/jdom/1.0/jdom-1.0.jar
Unable to find resource 'org.apache.maven.shared:maven-dependency-tree:jar:1.1' in repository
snapshots.scala-tools.org (http://scala-tools.org/repo-snapshots)
Downloading: http://repo.fusesource.com/nexus/content/repositories/snapshots/org/apache/maven/shared/maven-dependency-tree/1.1/maven-dependency-tree-1.1.jar
Downloading: http://repo.fusesource.com/nexus/content/repositories/snapshots/com/google/code/google-collections/google-collect/snapshot-20080530/google-collect-snapshot-20080530.jar
[INFO] Unable to find resource 'org.apache.maven.shared:maven-dependency-tree:jar:1.1' in
repository fusesource.snapshots (http://repo.fusesource.com/nexus/content/repositories/snapshots)
Downloading: http://repo1.maven.org/maven2/org/apache/maven/shared/maven-dependency-tree/1.1/maven-dependency-tree-1.1.jar
[INFO] Unable to find resource 'asm:asm-commons:jar:3.1' in repository fusesource.snapshots
(http://repo.fusesource.com/nexus/content/repositories/snapshots)
Downloading: http://repo1.maven.org/maven2/asm/asm-commons/3.1/asm-commons-3.1.jar
[INFO] Unable to find resource 'com.google.code.google-collections:google-collect:jar:snapshot-20080530'
in repository fusesource.snapshots (http://repo.fusesource.com/nexus/content/repositories/snapshots)
Downloading: http://repo1.maven.org/maven2/com/google/code/google-collections/google-collect/snapshot-20080530/google-collect-snapshot-20080530.jar

[INFO] Unable to find resource 'jdom:jdom:jar:1.0' in repository fusesource.snapshots (http://repo.fusesource.com/nexus/content/repositories/snapshots)
Downloading: http://repo1.maven.org/maven2/jdom/jdom/1.0/jdom-1.0.jar

Downloading: http://repo.open.iona.com/maven2/asm/asm-tree/3.1/asm-tree-3.1.jar
[INFO] Unable to find resource 'asm:asm-tree:jar:3.1' in repository open.iona.m2 (http://repo.open.iona.com/maven2)
Downloading: http://download.java.net/maven/2/asm/asm-tree/3.1/asm-tree-3.1.jar
[INFO] Unable to find resource 'asm:asm-tree:jar:3.1' in repository maven2-repository.dev.java.net
(http://download.java.net/maven/2)
Downloading: http://scala-tools.org/repo-releases/asm/asm-tree/3.1/asm-tree-3.1.jar
[INFO] Unable to find resource 'asm:asm-tree:jar:3.1' in repository scala (http://scala-tools.org/repo-releases)
Downloading: http://scala-tools.org/repo-snapshots/asm/asm-tree/3.1/asm-tree-3.1.jar
[INFO] Unable to find resource 'asm:asm-tree:jar:3.1' in repository snapshots.scala-tools.org
(http://scala-tools.org/repo-snapshots)
Downloading: http://repo.fusesource.com/nexus/content/repositories/snapshots/asm/asm-tree/3.1/asm-tree-3.1.jar
[INFO] Unable to find resource 'asm:asm-tree:jar:3.1' in repository fusesource.snapshots (http://repo.fusesource.com/nexus/content/repositories/snapshots)
Downloading: http://repo1.maven.org/maven2/asm/asm-tree/3.1/asm-tree-3.1.jar



[INFO] [uberize:uberize {execution: slim}]
[INFO] Excluding org.apache.activemq:apollo-broker:jar:1.0-SNAPSHOT from the uber jar.
[INFO] Excluding org.apache.activemq:apollo-transport:jar:1.0-SNAPSHOT from the uber jar.
[INFO] Excluding org.slf4j:slf4j-api:jar:1.6.0 from the uber jar.
[INFO] Excluding org.apache.activemq:apollo-util:jar:1.0-SNAPSHOT from the uber jar.
[INFO] Excluding org.scala-lang:scala-library:jar:2.8.0 from the uber jar.
[INFO] Excluding org.fusesource.hawtbuf:hawtbuf:jar:1.3-SNAPSHOT from the uber jar.
[INFO] Excluding org.fusesource.hawtdispatch:hawtdispatch:jar:1.1-SNAPSHOT from the uber jar.
[INFO] Excluding org.apache.activemq:apollo-store:jar:1.0-SNAPSHOT from the uber jar.
[INFO] Excluding org.apache.activemq:apollo-dto:jar:1.0-SNAPSHOT from the uber jar.
[INFO] Excluding stax:stax-api:jar:1.0.1 from the uber jar.
[INFO] Excluding stax:stax:jar:1.2.0 from the uber jar.
[INFO] Excluding org.codehaus.jackson:jackson-core-asl:jar:1.5.2 from the uber jar.
[INFO] Excluding org.codehaus.jackson:jackson-mapper-asl:jar:1.5.2 from the uber jar.
[INFO] Excluding javax.xml.bind:jaxb-api:jar:2.1 from the uber jar.
[INFO] Excluding javax.xml.stream:stax-api:jar:1.0-2 from the uber jar.
[INFO] Excluding javax.activation:activation:jar:1.1 from the uber jar.
[INFO] Excluding com.sun.xml.bind:jaxb-impl:jar:2.1.6 from the uber jar.
[INFO] Excluding org.fusesource.hawtdispatch:hawtdispatch-scala:jar:1.1-SNAPSHOT from the
uber jar.
[INFO] Excluding org.apache.activemq:apollo-selector:jar:1.0-SNAPSHOT from the uber jar.
[INFO] Excluding org.springframework:spring-beans:jar:2.5.5 from the uber jar.
[INFO] Excluding commons-logging:commons-logging:jar:1.1 from the uber jar.
[INFO] Excluding org.springframework:spring-core:jar:2.5.5 from the uber jar.
[INFO] Excluding org.apache.activemq:activemq-jaas:jar:5.4.1 from the uber jar.
[INFO] Excluding log4j:log4j:jar:1.2.14 from the uber jar.
[INFO] Excluding org.fusesource.scalate:scalate-core:jar:1.3.1 from the uber jar.
[INFO] Excluding org.scala-lang:scala-compiler:jar:2.8.0 from the uber jar.
[INFO] Excluding com.sun.jersey:jersey-server:jar:1.5-ea03 from the uber jar.
[INFO] Excluding com.sun.jersey:jersey-core:jar:1.5-ea03 from the uber jar.
[INFO] Excluding asm:asm:jar:3.1 from the uber jar.
[INFO] Excluding org.codehaus.jackson:jackson-jaxrs:jar:1.5.2 from the uber jar.
[INFO] Excluding org.codehaus.jackson:jackson-xc:jar:1.5.2 from the uber jar.
[INFO] Excluding org.mortbay.jetty:jetty:jar:6.1.22 from the uber jar.
[INFO] Excluding org.mortbay.jetty:jetty-util:jar:6.1.22 from the uber jar.
[INFO] Excluding org.mortbay.jetty:servlet-api:jar:2.5-20081211 from the uber jar.
[INFO] Extracting jars...
[INFO] Applying transformer: org.fusesource.mvnplugins.uberize.transformer.ManifestEditor
[INFO] Uber jarring...
[INFO] Attaching uber artifact.
[INFO] [install:install {execution: default-install}]
[INFO] Installing <https://hudson.apache.org/hudson/job/ActiveMQ-Apollo-Deploy/ws/trunk/apollo-web/target/apollo-web-1.0-SNAPSHOT.war>
to <https://hudson.apache.org/hudson/job/ActiveMQ-Apollo-Deploy/ws/.repository/org/apache/activemq/apollo-web/1.0-SNAPSHOT/apollo-web-1.0-SNAPSHOT.war>
[INFO] Installing <https://hudson.apache.org/hudson/job/ActiveMQ-Apollo-Deploy/ws/trunk/apollo-web/target/apollo-web-1.0-SNAPSHOT-slim.jar>
to <https://hudson.apache.org/hudson/job/ActiveMQ-Apollo-Deploy/ws/.repository/org/apache/activemq/apollo-web/1.0-SNAPSHOT/apollo-web-1.0-SNAPSHOT-slim.jar>
[INFO] Installing <https://hudson.apache.org/hudson/job/ActiveMQ-Apollo-Deploy/ws/trunk/apollo-web/target/apollo-web-1.0-SNAPSHOT-slim.war>
to <https://hudson.apache.org/hudson/job/ActiveMQ-Apollo-Deploy/ws/.repository/org/apache/activemq/apollo-web/1.0-SNAPSHOT/apollo-web-1.0-SNAPSHOT-slim.war>
[INFO] [deploy:deploy {execution: default-deploy}]
[INFO] Retrieving previous build number from apache.snapshots.https
Uploading: https://repository.apache.org/content/repositories/snapshots/org/apache/activemq/apollo-web/1.0-SNAPSHOT/apollo-web-1.0-20101112.065949-11.war
12212K uploaded  (apollo-web-1.0-20101112.065949-11.war)
[INFO] Uploading project information for apollo-web 1.0-20101112.065949-11
[INFO] Retrieving previous metadata from apache.snapshots.https
[INFO] Uploading repository metadata for: 'artifact org.apache.activemq:apollo-web'
[INFO] Retrieving previous metadata from apache.snapshots.https
[INFO] Uploading repository metadata for: 'snapshot org.apache.activemq:apollo-web:1.0-SNAPSHOT'
[INFO] Retrieving previous build number from apache.snapshots.https
Uploading: https://repository.apache.org/content/repositories/snapshots/org/apache/activemq/apollo-web/1.0-SNAPSHOT/apollo-web-1.0-20101112.065949-11-slim.jar
188K uploaded  (apollo-web-1.0-20101112.065949-11-slim.jar)
[INFO] Retrieving previous build number from apache.snapshots.https
Uploading: https://repository.apache.org/content/repositories/snapshots/org/apache/activemq/apollo-web/1.0-SNAPSHOT/apollo-web-1.0-20101112.065949-11-slim.war
6K uploaded  (apollo-web-1.0-20101112.065949-11-slim.war)
[HUDSON] Archiving <https://hudson.apache.org/hudson/job/ActiveMQ-Apollo-Deploy/ws/trunk/apollo-web/pom.xml>
to /home/hudson/hudson/jobs/ActiveMQ-Apollo-Deploy/modules/org.apache.activemq$apollo-web/builds/2010-11-12_06-53-32/archive/org.apache.activemq/apollo-web/1.0-SNAPSHOT/pom.xml
[HUDSON] Archiving <https://hudson.apache.org/hudson/job/ActiveMQ-Apollo-Deploy/ws/trunk/apollo-web/target/apollo-web-1.0-SNAPSHOT.war>
to /home/hudson/hudson/jobs/ActiveMQ-Apollo-Deploy/modules/org.apache.activemq$apollo-web/builds/2010-11-12_06-53-32/archive/org.apache.activemq/apollo-web/1.0-20101112.065949-11/apollo-web-1.0-SNAPSHOT.war
[HUDSON] Archiving <https://hudson.apache.org/hudson/job/ActiveMQ-Apollo-Deploy/ws/trunk/apollo-web/target/apollo-web-1.0-SNAPSHOT-slim.jar>
to /home/hudson/hudson/jobs/ActiveMQ-Apollo-Deploy/modules/org.apache.activemq$apollo-web/builds/2010-11-12_06-53-32/archive/org.apache.activemq/apollo-web/1.0-20101112.065949-11/apollo-web-1.0-SNAPSHOT-slim.jar
[HUDSON] Archiving <https://hudson.apache.org/hudson/job/ActiveMQ-Apollo-Deploy/ws/trunk/apollo-web/target/apollo-web-1.0-SNAPSHOT-slim.war>
to /home/hudson/hudson/jobs/ActiveMQ-Apollo-Deploy/modules/org.apache.activemq$apollo-web/builds/2010-11-12_06-53-32/archive/org.apache.activemq/apollo-web/1.0-20101112.065949-11/apollo-web-1.0-SNAPSHOT-slim.war
[INFO] ------------------------------------------------------------------------
[INFO] SKIPPING apollo-cli
[INFO]    task-segment: [clean, deploy]
[INFO] This project has been banned from further executions due to previous failures.
[INFO] ------------------------------------------------------------------------
[INFO] ------------------------------------------------------------------------
[INFO] SKIPPING apache-apollo
[INFO]    task-segment: [clean, deploy]
[INFO] This project has been banned from further executions due to previous failures.
[INFO] ------------------------------------------------------------------------
[INFO] 
[INFO] 
[INFO] ------------------------------------------------------------------------
[INFO] Reactor Summary:
[INFO] ------------------------------------------------------------------------
[INFO] Apache ActiveMQ Apollo Project ........................ SUCCESS [6:25.795s]
[INFO] apollo-scala .......................................... SUCCESS [2:14.098s]
[INFO] apollo-util ........................................... SUCCESS [2:20.519s]
[INFO] apollo-transport ...................................... SUCCESS [9.397s]
[INFO] apollo-dto ............................................ SUCCESS [56.102s]
[INFO] apollo-store .......................................... SUCCESS [28.599s]
[INFO] apollo-cassandra ...................................... SUCCESS [53.846s]
[INFO] apollo-selector ....................................... SUCCESS [2:07.553s]
[INFO] apollo-broker ......................................... SUCCESS [42.185s]
[INFO] apollo-tcp ............................................ FAILED [0.726s]
[INFO] apollo-hawtdb ......................................... SUCCESS [32.856s]
[INFO] apollo-bdb ............................................ SUCCESS [34.178s]
[INFO] apollo-stomp .......................................... SKIPPED (dependency build failed
or was skipped)
[INFO] apollo-web ............................................ SUCCESS [4:23.038s]
[INFO] apollo-cli ............................................ SKIPPED (dependency build failed
or was skipped)
[INFO] apache-apollo ......................................... SKIPPED (dependency build failed
or was skipped)
[INFO] ------------------------------------------------------------------------
[INFO] Error for project: apollo-tcp (during deploy)
[INFO] ------------------------------------------------------------------------
[INFO] Compilation failure
<https://hudson.apache.org/hudson/job/ActiveMQ-Apollo-Deploy/ws/trunk/apollo-tcp/src/main/java/org/apache/activemq/apollo/transport/tcp/SslTransportServer.java>:[52,35]
cannot find symbol
symbol  : method getDefault()
location: class javax.net.ssl.SSLContext


[INFO] ------------------------------------------------------------------------
[INFO] Trace
org.apache.maven.BuildFailureException: Compilation failure
<https://hudson.apache.org/hudson/job/ActiveMQ-Apollo-Deploy/ws/trunk/apollo-tcp/src/main/java/org/apache/activemq/apollo/transport/tcp/SslTransportServer.java>:[52,35]
cannot find symbol
symbol  : method getDefault()
location: class javax.net.ssl.SSLContext


	at org.apache.maven.lifecycle.DefaultLifecycleExecutor.executeGoals(DefaultLifecycleExecutor.java:715)
	at org.apache.maven.lifecycle.DefaultLifecycleExecutor.executeGoalWithLifecycle(DefaultLifecycleExecutor.java:556)
	at org.apache.maven.lifecycle.DefaultLifecycleExecutor.executeGoal(DefaultLifecycleExecutor.java:535)
	at org.apache.maven.lifecycle.DefaultLifecycleExecutor.executeGoalAndHandleFailures(DefaultLifecycleExecutor.java:387)
	at org.apache.maven.lifecycle.DefaultLifecycleExecutor.executeTaskSegments(DefaultLifecycleExecutor.java:348)
	at org.apache.maven.lifecycle.DefaultLifecycleExecutor.execute(DefaultLifecycleExecutor.java:180)
	at org.apache.maven.lifecycle.LifecycleExecutorInterceptor.execute(LifecycleExecutorInterceptor.java:65)
	at org.apache.maven.DefaultMaven.doExecute(DefaultMaven.java:328)
	at org.apache.maven.DefaultMaven.execute(DefaultMaven.java:138)
	at org.apache.maven.cli.MavenCli.main(MavenCli.java:362)
	at sun.reflect.NativeMethodAccessorImpl.invoke0(Native Method)
	at sun.reflect.NativeMethodAccessorImpl.invoke(NativeMethodAccessorImpl.java:39)
	at sun.reflect.DelegatingMethodAccessorImpl.invoke(DelegatingMethodAccessorImpl.java:25)
	at java.lang.reflect.Method.invoke(Method.java:592)
	at org.codehaus.classworlds.Launcher.launchEnhanced(Launcher.java:315)
	at org.codehaus.classworlds.Launcher.launch(Launcher.java:255)
	at hudson.maven.agent.Main.launch(Main.java:165)
	at hudson.maven.MavenBuilder.call(MavenBuilder.java:165)
	at hudson.maven.MavenModuleSetBuild$Builder.call(MavenModuleSetBuild.java:750)
	at hudson.maven.MavenModuleSetBuild$Builder.call(MavenModuleSetBuild.java:694)
	at hudson.remoting.UserRequest.perform(UserRequest.java:114)
	at hudson.remoting.UserRequest.perform(UserRequest.java:48)
	at hudson.remoting.Request$2.run(Request.java:270)
	at java.util.concurrent.Executors$RunnableAdapter.call(Executors.java:417)
	at java.util.concurrent.FutureTask$Sync.innerRun(FutureTask.java:269)
	at java.util.concurrent.FutureTask.run(FutureTask.java:123)
	at java.util.concurrent.ThreadPoolExecutor$Worker.runTask(ThreadPoolExecutor.java:651)
	at java.util.concurrent.ThreadPoolExecutor$Worker.run(ThreadPoolExecutor.java:676)
	at java.lang.Thread.run(Thread.java:595)
Caused by: org.apache.maven.plugin.CompilationFailureException: Compilation failure
<https://hudson.apache.org/hudson/job/ActiveMQ-Apollo-Deploy/ws/trunk/apollo-tcp/src/main/java/org/apache/activemq/apollo/transport/tcp/SslTransportServer.java>:[52,35]
cannot find symbol
symbol  : method getDefault()
location: class javax.net.ssl.SSLContext


	at org.apache.maven.plugin.AbstractCompilerMojo.execute(AbstractCompilerMojo.java:516)
	at org.apache.maven.plugin.CompilerMojo.execute(CompilerMojo.java:114)
	at org.apache.maven.plugin.DefaultPluginManager.executeMojo(DefaultPluginManager.java:490)
	at hudson.maven.agent.PluginManagerInterceptor.executeMojo(PluginManagerInterceptor.java:182)
	at org.apache.maven.lifecycle.DefaultLifecycleExecutor.executeGoals(DefaultLifecycleExecutor.java:694)
	... 28 more
[INFO] ------------------------------------------------------------------------
[INFO] BUILD ERRORS
[INFO] ------------------------------------------------------------------------
[INFO] Total time: 23 minutes 10 seconds
[INFO] Finished at: Fri Nov 12 07:16:52 UTC 2010
[INFO] Final Memory: 88M/1017M
[INFO] ------------------------------------------------------------------------
Sending e-mails to: dev@activemq.apache.org
channel stopped


Mime
View raw message