activemq-dev mailing list archives

Site index · List index
Message view « Date » · « Thread »
Top « Date » · « Thread »
From Apache Hudson Server <hud...@hudson.zones.apache.org>
Subject Build failed in Hudson: ActiveMQ #408
Date Sun, 25 Jul 2010 05:39:57 GMT
See <http://hudson.zones.apache.org/hudson/job/ActiveMQ/408/changes>

Changes:

[rajdavies] prevent npe

[gtully] resolve https://issues.apache.org/activemq/browse/AMQ-2580 - patch was good for AMQ
store, fix needed for kahaDB and JDBC now done, test case was great, thanks.

[gtully] fix compilation error with 2.4, endpoints is a lur cache of endpoints so they will
disappear in time, really needs a new component api - list available endpoints - 2.5 wabol

[gtully] fix issue with size of SimplePriorityMessageDispatchChannel, cause intermittent failure
of FailoverConsumerUnconsumedTest

[dejanb] https://issues.apache.org/activemq/browse/AMQ-2843 - support database schema upgrades

[dejanb] https://issues.apache.org/activemq/browse/AMQ-2843 - first stab at supporting priority
for durable subs

[rajdavies] updated to Apache Camel 2.4.0

[gtully] resolve: https://issues.apache.org/activemq/browse/AMQ-2741 - visibility of abort
slow consumer policy in via jmx

[dejanb] https://issues.apache.org/activemq/browse/AMQ-2843 - first stab at adding priority
for queues in JDBC store

[dejanb] https://issues.apache.org/activemq/browse/AMQ-2789 and https://issues.apache.org/activemq/browse/AMQ-2843
- adds tests for cursors and stores and fixes a PrioritizedPendingList bug

[dejanb] https://issues.apache.org/activemq/browse/AMQ-2843 - add mechanism for stores to
know whether to use prioritized recovery or not

[dejanb] https://issues.apache.org/activemq/browse/AMQ-2841 - log stomp protocol errors

[dejanb] https://issues.apache.org/activemq/browse/AMQ-2702 - remove runtime spring dependency

[gtully] use larger max file length, less swapping of files

[rajdavies] Patch applied for  https://issues.apache.org/activemq/browse/AMQ-2833

[gtully] resolve: https://issues.apache.org/activemq/browse/AMQ-2836 - copy message before
logging

[gtully] resolve https://issues.apache.org/activemq/browse/AMQ-2832 - impl for AMQ pa

[dejanb] https://issues.apache.org/activemq/browse/AMQ-2574 - removing runtime OSGi dependency

[gtully] resolve https://issues.apache.org/activemq/browse/AMQ-2832 - track ack file references
to prevent cleanup of data files with acks for inuse message files, impl for kahaDB

------------------------------------------
[...truncated 9958 lines...]
Downloading: http://repository.apache.org/snapshots/org/codehaus/plexus/plexus-interpolation/1.7/plexus-interpolation-1.7.pom
Downloading: http://repo1.maven.org/maven2/org/codehaus/plexus/plexus-interpolation/1.7/plexus-interpolation-1.7.pom
Downloading: http://repository.apache.org/snapshots/org/codehaus/plexus/plexus-active-collections/1.0-beta-2/plexus-active-collections-1.0-beta-2.pom
Downloading: http://repo1.maven.org/maven2/org/codehaus/plexus/plexus-active-collections/1.0-beta-2/plexus-active-collections-1.0-beta-2.pom
Downloading: http://repository.apache.org/snapshots/org/codehaus/plexus/plexus-container-default/1.0-alpha-22/plexus-container-default-1.0-alpha-22.pom
Downloading: http://download.java.net/maven/2/org/codehaus/plexus/plexus-container-default/1.0-alpha-22/plexus-container-default-1.0-alpha-22.pom
Downloading: http://repository.springsource.com/maven/bundles/external/org/codehaus/plexus/plexus-container-default/1.0-alpha-22/plexus-container-default-1.0-alpha-22.pom
Downloading: http://repo1.maven.org/maven2/org/codehaus/plexus/plexus-container-default/1.0-alpha-22/plexus-container-default-1.0-alpha-22.pom
Downloading: http://repository.apache.org/snapshots/org/codehaus/plexus/plexus-containers/1.0-alpha-22/plexus-containers-1.0-alpha-22.pom
Downloading: http://download.java.net/maven/2/org/codehaus/plexus/plexus-containers/1.0-alpha-22/plexus-containers-1.0-alpha-22.pom
Downloading: http://repository.springsource.com/maven/bundles/external/org/codehaus/plexus/plexus-containers/1.0-alpha-22/plexus-containers-1.0-alpha-22.pom
Downloading: http://repo1.maven.org/maven2/org/codehaus/plexus/plexus-containers/1.0-alpha-22/plexus-containers-1.0-alpha-22.pom
Downloading: http://repository.apache.org/snapshots/org/apache/maven/shared/maven-repository-builder/1.0-alpha-2/maven-repository-builder-1.0-alpha-2.pom
Downloading: http://repo1.maven.org/maven2/org/apache/maven/shared/maven-repository-builder/1.0-alpha-2/maven-repository-builder-1.0-alpha-2.pom
Downloading: http://repository.apache.org/snapshots/org/apache/maven/shared/maven-common-artifact-filters/1.0-alpha-1/maven-common-artifact-filters-1.0-alpha-1.pom
Downloading: http://download.java.net/maven/2/org/apache/maven/shared/maven-common-artifact-filters/1.0-alpha-1/maven-common-artifact-filters-1.0-alpha-1.pom
Downloading: http://repository.springsource.com/maven/bundles/external/org/apache/maven/shared/maven-common-artifact-filters/1.0-alpha-1/maven-common-artifact-filters-1.0-alpha-1.pom
Downloading: http://repo1.maven.org/maven2/org/apache/maven/shared/maven-common-artifact-filters/1.0-alpha-1/maven-common-artifact-filters-1.0-alpha-1.pom
Downloading: http://repository.apache.org/snapshots/org/apache/maven/shared/maven-shared-components/6/maven-shared-components-6.pom
Downloading: http://download.java.net/maven/2/org/apache/maven/shared/maven-shared-components/6/maven-shared-components-6.pom
Downloading: http://repository.springsource.com/maven/bundles/external/org/apache/maven/shared/maven-shared-components/6/maven-shared-components-6.pom
Downloading: http://repo1.maven.org/maven2/org/apache/maven/shared/maven-shared-components/6/maven-shared-components-6.pom
Downloading: http://repository.apache.org/snapshots/org/apache/maven/shared/maven-common-artifact-filters/1.1/maven-common-artifact-filters-1.1.jar
Downloading: http://repo1.maven.org/maven2/org/apache/maven/shared/maven-common-artifact-filters/1.1/maven-common-artifact-filters-1.1.jar
Downloading: http://repository.apache.org/snapshots/org/codehaus/plexus/plexus-interpolation/1.7/plexus-interpolation-1.7.jar
Downloading: http://repo1.maven.org/maven2/org/codehaus/plexus/plexus-interpolation/1.7/plexus-interpolation-1.7.jar
Downloading: http://repository.apache.org/snapshots/org/codehaus/plexus/plexus-active-collections/1.0-beta-2/plexus-active-collections-1.0-beta-2.jar
Downloading: http://repo1.maven.org/maven2/org/codehaus/plexus/plexus-active-collections/1.0-beta-2/plexus-active-collections-1.0-beta-2.jar
Downloading: http://repository.apache.org/snapshots/org/apache/maven/shared/maven-repository-builder/1.0-alpha-2/maven-repository-builder-1.0-alpha-2.jar
Downloading: http://repo1.maven.org/maven2/org/apache/maven/shared/maven-repository-builder/1.0-alpha-2/maven-repository-builder-1.0-alpha-2.jar
[INFO] [assembly:attached {execution: unix-bin}]
[INFO] Reading assembly descriptor: src/main/descriptors/unix-bin.xml
[WARNING] Cannot include project artifact: org.apache.activemq:apache-activemq:pom:5.4-SNAPSHOT;
it doesn't have an associated file or directory.
[WARNING] Cannot include project artifact: org.apache.activemq:apache-activemq:pom:5.4-SNAPSHOT;
it doesn't have an associated file or directory.
[WARNING] Cannot include project artifact: org.apache.activemq:apache-activemq:pom:5.4-SNAPSHOT;
it doesn't have an associated file or directory.
[WARNING] Cannot include project artifact: org.apache.activemq:apache-activemq:pom:5.4-SNAPSHOT;
it doesn't have an associated file or directory.
[WARNING] Cannot include project artifact: org.apache.activemq:apache-activemq:pom:5.4-SNAPSHOT;
it doesn't have an associated file or directory.
[WARNING] Cannot include project artifact: org.apache.activemq:apache-activemq:pom:5.4-SNAPSHOT;
it doesn't have an associated file or directory.
[INFO] apache-activemq-5.4-SNAPSHOT/webapps/admin/WEB-INF already added, skipping
[INFO] Building tar : <http://hudson.zones.apache.org/hudson/job/ActiveMQ/ws/trunk/assembly/target/apache-activemq-5.4-SNAPSHOT-bin.tar.gz>
[INFO] apache-activemq-5.4-SNAPSHOT/webapps/admin/WEB-INF already added, skipping
[INFO] [assembly:attached {execution: windows-bin}]
[INFO] Reading assembly descriptor: src/main/descriptors/windows-bin.xml
[WARNING] Cannot include project artifact: org.apache.activemq:apache-activemq:pom:5.4-SNAPSHOT;
it doesn't have an associated file or directory.
[WARNING] Cannot include project artifact: org.apache.activemq:apache-activemq:pom:5.4-SNAPSHOT;
it doesn't have an associated file or directory.
[WARNING] Cannot include project artifact: org.apache.activemq:apache-activemq:pom:5.4-SNAPSHOT;
it doesn't have an associated file or directory.
[WARNING] Cannot include project artifact: org.apache.activemq:apache-activemq:pom:5.4-SNAPSHOT;
it doesn't have an associated file or directory.
[WARNING] Cannot include project artifact: org.apache.activemq:apache-activemq:pom:5.4-SNAPSHOT;
it doesn't have an associated file or directory.
[WARNING] Cannot include project artifact: org.apache.activemq:apache-activemq:pom:5.4-SNAPSHOT;
it doesn't have an associated file or directory.
[INFO] apache-activemq-5.4-SNAPSHOT/webapps/admin/WEB-INF already added, skipping
[INFO] Building zip: <http://hudson.zones.apache.org/hudson/job/ActiveMQ/ws/trunk/assembly/target/apache-activemq-5.4-SNAPSHOT-bin.zip>
[INFO] apache-activemq-5.4-SNAPSHOT/webapps/admin/WEB-INF already added, skipping
[INFO] [ianal:verify-legal-files {execution: default}]
[INFO] Checking legal files in: apache-activemq-5.4-SNAPSHOT-bin.zip
[INFO] [install:install]
[INFO] Installing <http://hudson.zones.apache.org/hudson/job/ActiveMQ/ws/trunk/assembly/pom.xml>
to <http://hudson.zones.apache.org/hudson/job/ActiveMQ/ws/.repository/org/apache/activemq/apache-activemq/5.4-SNAPSHOT/apache-activemq-5.4-SNAPSHOT.pom>
[INFO] Installing <http://hudson.zones.apache.org/hudson/job/ActiveMQ/ws/trunk/assembly/target/apache-activemq-5.4-SNAPSHOT-bin.tar.gz>
to <http://hudson.zones.apache.org/hudson/job/ActiveMQ/ws/.repository/org/apache/activemq/apache-activemq/5.4-SNAPSHOT/apache-activemq-5.4-SNAPSHOT-bin.tar.gz>
[INFO] Installing <http://hudson.zones.apache.org/hudson/job/ActiveMQ/ws/trunk/assembly/target/apache-activemq-5.4-SNAPSHOT-bin.zip>
to <http://hudson.zones.apache.org/hudson/job/ActiveMQ/ws/.repository/org/apache/activemq/apache-activemq/5.4-SNAPSHOT/apache-activemq-5.4-SNAPSHOT-bin.zip>
[INFO] Preparing source:jar
[HUDSON] Archiving <http://hudson.zones.apache.org/hudson/job/ActiveMQ/ws/trunk/assembly/pom.xml>
to /export/home/hudson/hudson/jobs/ActiveMQ/modules/org.apache.activemq$apache-activemq/builds/2010-07-25_02-07-20/archive/org.apache.activemq/apache-activemq/5.4-SNAPSHOT/pom.xml
[HUDSON] Archiving <http://hudson.zones.apache.org/hudson/job/ActiveMQ/ws/trunk/assembly/target/apache-activemq-5.4-SNAPSHOT-bin.tar.gz>
to /export/home/hudson/hudson/jobs/ActiveMQ/modules/org.apache.activemq$apache-activemq/builds/2010-07-25_02-07-20/archive/org.apache.activemq/apache-activemq/5.4-SNAPSHOT/apache-activemq-5.4-SNAPSHOT-bin.tar.gz
[HUDSON] Archiving <http://hudson.zones.apache.org/hudson/job/ActiveMQ/ws/trunk/assembly/target/apache-activemq-5.4-SNAPSHOT-bin.zip>
to /export/home/hudson/hudson/jobs/ActiveMQ/modules/org.apache.activemq$apache-activemq/builds/2010-07-25_02-07-20/archive/org.apache.activemq/apache-activemq/5.4-SNAPSHOT/apache-activemq-5.4-SNAPSHOT-bin.zip
[INFO] [enforcer:enforce {execution: default}]
[INFO] [bundle:cleanVersions {execution: cleanVersions}]
[INFO] [source:jar]
[INFO] 
[INFO] 
[INFO] ------------------------------------------------------------------------
[INFO] Reactor Summary:
[INFO] ------------------------------------------------------------------------
[INFO] ActiveMQ .............................................. SUCCESS [9:42.150s]
[INFO] ActiveMQ :: KahaDB .................................... SUCCESS [1:49.868s]
[INFO] ActiveMQ :: JAAS ...................................... SUCCESS [1:22.968s]
[INFO] Openwire Generator .................................... SUCCESS [25.288s]
[INFO] ActiveMQ :: jmdns 1.0 ................................. SUCCESS [3.055s]
[INFO] ActiveMQ :: Core ...................................... SUCCESS [2:51:10.616s]
[INFO] ActiveMQ :: RA ........................................ SUCCESS [1:26.153s]
[INFO] ActiveMQ :: Pool ...................................... SUCCESS [32.223s]
[INFO] ActiveMQ :: Camel ..................................... SUCCESS [2:10.437s]
[INFO] ActiveMQ :: Console ................................... SUCCESS [10.402s]
[INFO] ActiveMQ :: Optional .................................. SUCCESS [5:17.086s]
[INFO] ActiveMQ :: Jar Bundle ................................ SUCCESS [27.764s]
[INFO] ActiveMQ :: File Server ............................... SUCCESS [30.433s]
[INFO] ActiveMQ :: Blueprint ................................. SUCCESS [25.498s]
[INFO] ActiveMQ :: Apache Karaf .............................. FAILED [11.639s]
[INFO] ActiveMQ :: RAR ....................................... SUCCESS [40.110s]
[INFO] ActiveMQ :: Run Jar ................................... SUCCESS [3.339s]
[INFO] ActiveMQ :: Spring .................................... SUCCESS [49.701s]
[INFO] ActiveMQ Tooling ...................................... SUCCESS [1.147s]
[INFO] ActiveMQ :: Memory Usage Test Plugin .................. SUCCESS [43.964s]
[INFO] ActiveMQ :: Performance Test Plugin ................... SUCCESS [6.514s]
[INFO] ActiveMQ :: StartUp Plugin ............................ SUCCESS [11.398s]
[INFO] ActiveMQ :: Web ....................................... SUCCESS [14.281s]
[INFO] ActiveMQ :: Web Demo .................................. SUCCESS [1:07.399s]
[INFO] ActiveMQ :: XMPP ...................................... SUCCESS [1:07.545s]
[INFO] ActiveMQ :: Web Console ............................... SUCCESS [1:30.309s]
[INFO] ActiveMQ :: Assembly .................................. SUCCESS [8:27.718s]
[INFO] ------------------------------------------------------------------------
[INFO] Error for project: ActiveMQ :: Apache Karaf (during source:jar)
[INFO] ------------------------------------------------------------------------
[INFO] Failed to resolve artifact.

Missing:
----------
1) org.apache.aries:org.apache.aries.util:jar:0.1-r964701

  Try downloading the file manually from the project website.

  Then, install it using the command: 
      mvn install:install-file -DgroupId=org.apache.aries -DartifactId=org.apache.aries.util
-Dversion=0.1-r964701 -Dpackaging=jar -Dfile=/path/to/file

  Alternatively, if you host your own repository you can deploy the file there: 
      mvn deploy:deploy-file -DgroupId=org.apache.aries -DartifactId=org.apache.aries.util
-Dversion=0.1-r964701 -Dpackaging=jar -Dfile=/path/to/file -Durl=[url] -DrepositoryId=[id]

  Path to dependency: 
  	1) org.apache.activemq:activemq-karaf:bundle:5.4-SNAPSHOT
  	2) org.apache.karaf.shell:org.apache.karaf.shell.console:jar:1.99.0-SNAPSHOT
  	3) org.apache.aries.blueprint:org.apache.aries.blueprint:jar:0.1-r964701
  	4) org.apache.aries:org.apache.aries.util:jar:0.1-r964701

----------
1 required artifact is missing.

for artifact: 
  org.apache.activemq:activemq-karaf:bundle:5.4-SNAPSHOT

from the specified remote repositories:
  central (http://repo1.maven.org/maven2),
  com.springsource.repository.bundles.external (http://repository.springsource.com/maven/bundles/external),
  Nexus (http://repository.apache.org/snapshots)



[INFO] ------------------------------------------------------------------------
[INFO] Trace
org.apache.maven.lifecycle.LifecycleExecutionException: Missing:
----------
1) org.apache.aries:org.apache.aries.util:jar:0.1-r964701

  Try downloading the file manually from the project website.

  Then, install it using the command: 
      mvn install:install-file -DgroupId=org.apache.aries -DartifactId=org.apache.aries.util
-Dversion=0.1-r964701 -Dpackaging=jar -Dfile=/path/to/file

  Alternatively, if you host your own repository you can deploy the file there: 
      mvn deploy:deploy-file -DgroupId=org.apache.aries -DartifactId=org.apache.aries.util
-Dversion=0.1-r964701 -Dpackaging=jar -Dfile=/path/to/file -Durl=[url] -DrepositoryId=[id]

  Path to dependency: 
  	1) org.apache.activemq:activemq-karaf:bundle:5.4-SNAPSHOT
  	2) org.apache.karaf.shell:org.apache.karaf.shell.console:jar:1.99.0-SNAPSHOT
  	3) org.apache.aries.blueprint:org.apache.aries.blueprint:jar:0.1-r964701
  	4) org.apache.aries:org.apache.aries.util:jar:0.1-r964701

----------
1 required artifact is missing.

for artifact: 
  org.apache.activemq:activemq-karaf:bundle:5.4-SNAPSHOT

from the specified remote repositories:
  central (http://repo1.maven.org/maven2),
  com.springsource.repository.bundles.external (http://repository.springsource.com/maven/bundles/external),
  Nexus (http://repository.apache.org/snapshots)


	at org.apache.maven.lifecycle.DefaultLifecycleExecutor.executeGoals(DefaultLifecycleExecutor.java:576)
	at org.apache.maven.lifecycle.DefaultLifecycleExecutor.executeGoalWithLifecycle(DefaultLifecycleExecutor.java:500)
	at org.apache.maven.lifecycle.DefaultLifecycleExecutor.forkProjectLifecycle(DefaultLifecycleExecutor.java:925)
	at org.apache.maven.lifecycle.DefaultLifecycleExecutor.forkLifecycle(DefaultLifecycleExecutor.java:768)
	at org.apache.maven.lifecycle.DefaultLifecycleExecutor.executeGoals(DefaultLifecycleExecutor.java:530)
	at org.apache.maven.lifecycle.DefaultLifecycleExecutor.executeStandaloneGoal(DefaultLifecycleExecutor.java:513)
	at org.apache.maven.lifecycle.DefaultLifecycleExecutor.executeGoal(DefaultLifecycleExecutor.java:483)
	at org.apache.maven.lifecycle.DefaultLifecycleExecutor.executeGoalAndHandleFailures(DefaultLifecycleExecutor.java:331)
	at org.apache.maven.lifecycle.DefaultLifecycleExecutor.executeTaskSegments(DefaultLifecycleExecutor.java:292)
	at org.apache.maven.lifecycle.DefaultLifecycleExecutor.execute(DefaultLifecycleExecutor.java:142)
	at org.apache.maven.lifecycle.LifecycleExecutorInterceptor.execute(LifecycleExecutorInterceptor.java:65)
	at org.apache.maven.DefaultMaven.doExecute(DefaultMaven.java:336)
	at org.apache.maven.DefaultMaven.execute(DefaultMaven.java:129)
	at org.apache.maven.cli.MavenCli.main(MavenCli.java:301)
	at sun.reflect.NativeMethodAccessorImpl.invoke0(Native Method)
	at sun.reflect.NativeMethodAccessorImpl.invoke(NativeMethodAccessorImpl.java:39)
	at sun.reflect.DelegatingMethodAccessorImpl.invoke(DelegatingMethodAccessorImpl.java:25)
	at java.lang.reflect.Method.invoke(Method.java:592)
	at org.codehaus.classworlds.Launcher.launchEnhanced(Launcher.java:315)
	at org.codehaus.classworlds.Launcher.launch(Launcher.java:255)
	at hudson.maven.agent.Main.launch(Main.java:165)
	at hudson.maven.MavenBuilder.call(MavenBuilder.java:165)
	at hudson.maven.MavenModuleSetBuild$Builder.call(MavenModuleSetBuild.java:696)
	at hudson.maven.MavenModuleSetBuild$Builder.call(MavenModuleSetBuild.java:640)
	at hudson.remoting.UserRequest.perform(UserRequest.java:114)
	at hudson.remoting.UserRequest.perform(UserRequest.java:48)
	at hudson.remoting.Request$2.run(Request.java:270)
	at java.util.concurrent.Executors$RunnableAdapter.call(Executors.java:417)
	at java.util.concurrent.FutureTask$Sync.innerRun(FutureTask.java:269)
	at java.util.concurrent.FutureTask.run(FutureTask.java:123)
	at java.util.concurrent.ThreadPoolExecutor$Worker.runTask(ThreadPoolExecutor.java:651)
	at java.util.concurrent.ThreadPoolExecutor$Worker.run(ThreadPoolExecutor.java:676)
	at java.lang.Thread.run(Thread.java:595)
Caused by: org.apache.maven.artifact.resolver.MultipleArtifactsNotFoundException: Missing:
----------
1) org.apache.aries:org.apache.aries.util:jar:0.1-r964701

  Try downloading the file manually from the project website.

  Then, install it using the command: 
      mvn install:install-file -DgroupId=org.apache.aries -DartifactId=org.apache.aries.util
-Dversion=0.1-r964701 -Dpackaging=jar -Dfile=/path/to/file

  Alternatively, if you host your own repository you can deploy the file there: 
      mvn deploy:deploy-file -DgroupId=org.apache.aries -DartifactId=org.apache.aries.util
-Dversion=0.1-r964701 -Dpackaging=jar -Dfile=/path/to/file -Durl=[url] -DrepositoryId=[id]

  Path to dependency: 
  	1) org.apache.activemq:activemq-karaf:bundle:5.4-SNAPSHOT
  	2) org.apache.karaf.shell:org.apache.karaf.shell.console:jar:1.99.0-SNAPSHOT
  	3) org.apache.aries.blueprint:org.apache.aries.blueprint:jar:0.1-r964701
  	4) org.apache.aries:org.apache.aries.util:jar:0.1-r964701

----------
1 required artifact is missing.

for artifact: 
  org.apache.activemq:activemq-karaf:bundle:5.4-SNAPSHOT

from the specified remote repositories:
  central (http://repo1.maven.org/maven2),
  com.springsource.repository.bundles.external (http://repository.springsource.com/maven/bundles/external),
  Nexus (http://repository.apache.org/snapshots)


	at org.apache.maven.artifact.resolver.DefaultArtifactResolver.resolveTransitively(DefaultArtifactResolver.java:324)
	at org.apache.maven.artifact.resolver.DefaultArtifactResolver.resolveTransitively(DefaultArtifactResolver.java:288)
	at org.apache.maven.plugin.DefaultPluginManager.resolveTransitiveDependencies(DefaultPluginManager.java:1417)
	at org.apache.maven.plugin.DefaultPluginManager.executeMojo(DefaultPluginManager.java:407)
	at hudson.maven.agent.PluginManagerInterceptor.executeMojo(PluginManagerInterceptor.java:182)
	at org.apache.maven.lifecycle.DefaultLifecycleExecutor.executeGoals(DefaultLifecycleExecutor.java:559)
	... 32 more
[INFO] ------------------------------------------------------------------------
[INFO] BUILD ERRORS
[INFO] ------------------------------------------------------------------------
[INFO] Total time: 212 minutes 12 seconds
[INFO] Finished at: Sun Jul 25 05:39:39 UTC 2010
[INFO] Final Memory: 84M/1989M
[INFO] ------------------------------------------------------------------------
Waiting for Hudson to finish collecting data
Sending e-mails to: dev@activemq.apache.org
Sending e-mails to: dev@activemq.apache.org
Sending e-mails to: dev@activemq.apache.org
channel stopped
[locks-and-latches] Releasing all the locks
[locks-and-latches] All the locks released


Mime
View raw message