activemq-dev mailing list archives

Site index · List index
Message view « Date » · « Thread »
Top « Date » · « Thread »
From Apache Hudson Server <hud...@hudson.zones.apache.org>
Subject Build failed in Hudson: ActiveMQ-Trunk-Deploy #107
Date Fri, 30 Jul 2010 04:09:00 GMT
See <http://hudson.zones.apache.org/hudson/job/ActiveMQ-Trunk-Deploy/107/changes>

Changes:

[gtully] resolve issue with kahaDB based variant of AMQ2149Test - revert http://svn.apache.org/viewvc?rev=958330&view=rev

[rajdavies] changes for https://issues.apache.org/activemq/browse/AMQ-2789 - message priority

[gtully] ensure no broker is auto created

------------------------------------------
[...truncated 19464 lines...]
[WARNING] Cannot include project artifact: org.apache.activemq:apache-activemq:pom:5.4-SNAPSHOT;
it doesn't have an associated file or directory.
[INFO] apache-activemq-5.4-SNAPSHOT/webapps/admin/WEB-INF already added, skipping
[INFO] Building tar : <http://hudson.zones.apache.org/hudson/job/ActiveMQ-Trunk-Deploy/ws/trunk/assembly/target/apache-activemq-5.4-SNAPSHOT-bin.tar.gz>
[INFO] apache-activemq-5.4-SNAPSHOT/webapps/admin/WEB-INF already added, skipping
[INFO] [assembly:attached {execution: windows-bin}]
[INFO] Reading assembly descriptor: src/main/descriptors/windows-bin.xml
Downloading: http://repository.apache.org/snapshots/org/apache/activemq/protobuf/activemq-protobuf/1.1-SNAPSHOT/activemq-protobuf-1.1-SNAPSHOT.jar
Downloading: http://repository.apache.org/snapshots/org/apache/activemq/activemq-camel/5.4-SNAPSHOT/activemq-camel-5.4-SNAPSHOT.jar
Downloading: http://repository.apache.org/snapshots/org/apache/activemq/activemq-core/5.4-SNAPSHOT/activemq-core-5.4-SNAPSHOT.jar
Downloading: http://repository.apache.org/snapshots/org/apache/activemq/kahadb/5.4-SNAPSHOT/kahadb-5.4-SNAPSHOT.jar
Downloading: http://repository.apache.org/snapshots/org/apache/activemq/activemq-pool/5.4-SNAPSHOT/activemq-pool-5.4-SNAPSHOT.jar
Downloading: http://repository.apache.org/snapshots/org/apache/activemq/activemq-web/5.4-SNAPSHOT/activemq-web-5.4-SNAPSHOT.jar
Downloading: http://repository.apache.org/snapshots/org/apache/activemq/activemq-spring/5.4-SNAPSHOT/activemq-spring-5.4-SNAPSHOT.jar
[WARNING] Cannot include project artifact: org.apache.activemq:apache-activemq:pom:5.4-SNAPSHOT;
it doesn't have an associated file or directory.
Downloading: http://repository.apache.org/snapshots/org/apache/activemq/protobuf/activemq-protobuf/1.1-SNAPSHOT/activemq-protobuf-1.1-SNAPSHOT.jar
Downloading: http://repository.apache.org/snapshots/org/apache/activemq/activemq-camel/5.4-SNAPSHOT/activemq-camel-5.4-SNAPSHOT.jar
Downloading: http://repository.apache.org/snapshots/org/apache/activemq/activemq-core/5.4-SNAPSHOT/activemq-core-5.4-SNAPSHOT.jar
Downloading: http://repository.apache.org/snapshots/org/apache/activemq/kahadb/5.4-SNAPSHOT/kahadb-5.4-SNAPSHOT.jar
Downloading: http://repository.apache.org/snapshots/org/apache/activemq/activemq-pool/5.4-SNAPSHOT/activemq-pool-5.4-SNAPSHOT.jar
Downloading: http://repository.apache.org/snapshots/org/apache/activemq/activemq-web/5.4-SNAPSHOT/activemq-web-5.4-SNAPSHOT.jar
Downloading: http://repository.apache.org/snapshots/org/apache/activemq/activemq-spring/5.4-SNAPSHOT/activemq-spring-5.4-SNAPSHOT.jar
[WARNING] Cannot include project artifact: org.apache.activemq:apache-activemq:pom:5.4-SNAPSHOT;
it doesn't have an associated file or directory.
Downloading: http://repository.apache.org/snapshots/org/apache/activemq/activemq-camel/5.4-SNAPSHOT/activemq-camel-5.4-SNAPSHOT.jar
Downloading: http://repository.apache.org/snapshots/org/apache/activemq/protobuf/activemq-protobuf/1.1-SNAPSHOT/activemq-protobuf-1.1-SNAPSHOT.jar
Downloading: http://repository.apache.org/snapshots/org/apache/activemq/activemq-core/5.4-SNAPSHOT/activemq-core-5.4-SNAPSHOT.jar
Downloading: http://repository.apache.org/snapshots/org/apache/activemq/kahadb/5.4-SNAPSHOT/kahadb-5.4-SNAPSHOT.jar
Downloading: http://repository.apache.org/snapshots/org/apache/activemq/activemq-pool/5.4-SNAPSHOT/activemq-pool-5.4-SNAPSHOT.jar
Downloading: http://repository.apache.org/snapshots/org/apache/activemq/activemq-web/5.4-SNAPSHOT/activemq-web-5.4-SNAPSHOT.jar
Downloading: http://repository.apache.org/snapshots/org/apache/activemq/activemq-spring/5.4-SNAPSHOT/activemq-spring-5.4-SNAPSHOT.jar
[WARNING] Cannot include project artifact: org.apache.activemq:apache-activemq:pom:5.4-SNAPSHOT;
it doesn't have an associated file or directory.
Downloading: http://repository.apache.org/snapshots/org/apache/activemq/protobuf/activemq-protobuf/1.1-SNAPSHOT/activemq-protobuf-1.1-SNAPSHOT.jar
Downloading: http://repository.apache.org/snapshots/org/apache/activemq/activemq-camel/5.4-SNAPSHOT/activemq-camel-5.4-SNAPSHOT.jar
Downloading: http://repository.apache.org/snapshots/org/apache/activemq/activemq-core/5.4-SNAPSHOT/activemq-core-5.4-SNAPSHOT.jar
Downloading: http://repository.apache.org/snapshots/org/apache/activemq/kahadb/5.4-SNAPSHOT/kahadb-5.4-SNAPSHOT.jar
Downloading: http://repository.apache.org/snapshots/org/apache/activemq/activemq-pool/5.4-SNAPSHOT/activemq-pool-5.4-SNAPSHOT.jar
Downloading: http://repository.apache.org/snapshots/org/apache/activemq/activemq-web/5.4-SNAPSHOT/activemq-web-5.4-SNAPSHOT.jar
Downloading: http://repository.apache.org/snapshots/org/apache/activemq/activemq-spring/5.4-SNAPSHOT/activemq-spring-5.4-SNAPSHOT.jar
[WARNING] Cannot include project artifact: org.apache.activemq:apache-activemq:pom:5.4-SNAPSHOT;
it doesn't have an associated file or directory.
Downloading: http://repository.apache.org/snapshots/org/apache/activemq/protobuf/activemq-protobuf/1.1-SNAPSHOT/activemq-protobuf-1.1-SNAPSHOT.jar
Downloading: http://repository.apache.org/snapshots/org/apache/activemq/activemq-camel/5.4-SNAPSHOT/activemq-camel-5.4-SNAPSHOT.jar
Downloading: http://repository.apache.org/snapshots/org/apache/activemq/activemq-core/5.4-SNAPSHOT/activemq-core-5.4-SNAPSHOT.jar
Downloading: http://repository.apache.org/snapshots/org/apache/activemq/kahadb/5.4-SNAPSHOT/kahadb-5.4-SNAPSHOT.jar
Downloading: http://repository.apache.org/snapshots/org/apache/activemq/activemq-pool/5.4-SNAPSHOT/activemq-pool-5.4-SNAPSHOT.jar
Downloading: http://repository.apache.org/snapshots/org/apache/activemq/activemq-web/5.4-SNAPSHOT/activemq-web-5.4-SNAPSHOT.jar
Downloading: http://repository.apache.org/snapshots/org/apache/activemq/activemq-spring/5.4-SNAPSHOT/activemq-spring-5.4-SNAPSHOT.jar
[WARNING] Cannot include project artifact: org.apache.activemq:apache-activemq:pom:5.4-SNAPSHOT;
it doesn't have an associated file or directory.
Downloading: http://repository.apache.org/snapshots/org/apache/activemq/protobuf/activemq-protobuf/1.1-SNAPSHOT/activemq-protobuf-1.1-SNAPSHOT.jar
Downloading: http://repository.apache.org/snapshots/org/apache/activemq/activemq-camel/5.4-SNAPSHOT/activemq-camel-5.4-SNAPSHOT.jar
Downloading: http://repository.apache.org/snapshots/org/apache/activemq/activemq-core/5.4-SNAPSHOT/activemq-core-5.4-SNAPSHOT.jar
Downloading: http://repository.apache.org/snapshots/org/apache/activemq/kahadb/5.4-SNAPSHOT/kahadb-5.4-SNAPSHOT.jar
Downloading: http://repository.apache.org/snapshots/org/apache/activemq/activemq-pool/5.4-SNAPSHOT/activemq-pool-5.4-SNAPSHOT.jar
Downloading: http://repository.apache.org/snapshots/org/apache/activemq/activemq-web/5.4-SNAPSHOT/activemq-web-5.4-SNAPSHOT.jar
Downloading: http://repository.apache.org/snapshots/org/apache/activemq/activemq-spring/5.4-SNAPSHOT/activemq-spring-5.4-SNAPSHOT.jar
[WARNING] Cannot include project artifact: org.apache.activemq:apache-activemq:pom:5.4-SNAPSHOT;
it doesn't have an associated file or directory.
[INFO] apache-activemq-5.4-SNAPSHOT/webapps/admin/WEB-INF already added, skipping
[INFO] Building zip: <http://hudson.zones.apache.org/hudson/job/ActiveMQ-Trunk-Deploy/ws/trunk/assembly/target/apache-activemq-5.4-SNAPSHOT-bin.zip>
[INFO] apache-activemq-5.4-SNAPSHOT/webapps/admin/WEB-INF already added, skipping
[INFO] [ianal:verify-legal-files {execution: default}]
[INFO] Checking legal files in: apache-activemq-5.4-SNAPSHOT-bin.zip
[INFO] [install:install {execution: default-install}]
[INFO] Installing <http://hudson.zones.apache.org/hudson/job/ActiveMQ-Trunk-Deploy/ws/trunk/assembly/pom.xml>
to <http://hudson.zones.apache.org/hudson/job/ActiveMQ-Trunk-Deploy/ws/.repository/org/apache/activemq/apache-activemq/5.4-SNAPSHOT/apache-activemq-5.4-SNAPSHOT.pom>
[INFO] Installing <http://hudson.zones.apache.org/hudson/job/ActiveMQ-Trunk-Deploy/ws/trunk/assembly/target/apache-activemq-5.4-SNAPSHOT-bin.tar.gz>
to <http://hudson.zones.apache.org/hudson/job/ActiveMQ-Trunk-Deploy/ws/.repository/org/apache/activemq/apache-activemq/5.4-SNAPSHOT/apache-activemq-5.4-SNAPSHOT-bin.tar.gz>
[INFO] Installing <http://hudson.zones.apache.org/hudson/job/ActiveMQ-Trunk-Deploy/ws/trunk/assembly/target/apache-activemq-5.4-SNAPSHOT-bin.zip>
to <http://hudson.zones.apache.org/hudson/job/ActiveMQ-Trunk-Deploy/ws/.repository/org/apache/activemq/apache-activemq/5.4-SNAPSHOT/apache-activemq-5.4-SNAPSHOT-bin.zip>
[INFO] [deploy:deploy {execution: default-deploy}]
[INFO] Retrieving previous build number from apache.snapshots.https
Uploading: https://repository.apache.org/content/repositories/snapshots/org/apache/activemq/apache-activemq/5.4-SNAPSHOT/apache-activemq-5.4-SNAPSHOT.pom
14K uploaded  (apache-activemq-5.4-SNAPSHOT.pom)
[INFO] Retrieving previous metadata from apache.snapshots.https
[INFO] Uploading repository metadata for: 'snapshot org.apache.activemq:apache-activemq:5.4-SNAPSHOT'
[INFO] Retrieving previous metadata from apache.snapshots.https
[INFO] Uploading repository metadata for: 'artifact org.apache.activemq:apache-activemq'
[INFO] Retrieving previous build number from apache.snapshots.https
Uploading: https://repository.apache.org/content/repositories/snapshots/org/apache/activemq/apache-activemq/5.4-SNAPSHOT/apache-activemq-5.4-SNAPSHOT-bin.tar.gz
33777K uploaded  (apache-activemq-5.4-SNAPSHOT-bin.tar.gz)
[INFO] Retrieving previous build number from apache.snapshots.https
Uploading: https://repository.apache.org/content/repositories/snapshots/org/apache/activemq/apache-activemq/5.4-SNAPSHOT/apache-activemq-5.4-SNAPSHOT-bin.zip
33960K uploaded  (apache-activemq-5.4-SNAPSHOT-bin.zip)
[HUDSON] Archiving <http://hudson.zones.apache.org/hudson/job/ActiveMQ-Trunk-Deploy/ws/.repository/org/apache/activemq/apache-activemq/5.4-SNAPSHOT/apache-activemq-5.4-SNAPSHOT.pom>
to /export/home/hudson/hudson/jobs/ActiveMQ-Trunk-Deploy/modules/org.apache.activemq$apache-activemq/builds/2010-07-30_03-10-33/archive/org.apache.activemq/apache-activemq/5.4-SNAPSHOT/apache-activemq-5.4-SNAPSHOT.pom
[HUDSON] Archiving <http://hudson.zones.apache.org/hudson/job/ActiveMQ-Trunk-Deploy/ws/trunk/assembly/target/apache-activemq-5.4-SNAPSHOT-bin.tar.gz>
to /export/home/hudson/hudson/jobs/ActiveMQ-Trunk-Deploy/modules/org.apache.activemq$apache-activemq/builds/2010-07-30_03-10-33/archive/org.apache.activemq/apache-activemq/5.4-SNAPSHOT/apache-activemq-5.4-SNAPSHOT-bin.tar.gz
[HUDSON] Archiving <http://hudson.zones.apache.org/hudson/job/ActiveMQ-Trunk-Deploy/ws/trunk/assembly/target/apache-activemq-5.4-SNAPSHOT-bin.zip>
to /export/home/hudson/hudson/jobs/ActiveMQ-Trunk-Deploy/modules/org.apache.activemq$apache-activemq/builds/2010-07-30_03-10-33/archive/org.apache.activemq/apache-activemq/5.4-SNAPSHOT/apache-activemq-5.4-SNAPSHOT-bin.zip
[INFO] 
[INFO] 
[INFO] ------------------------------------------------------------------------
[INFO] Reactor Summary:
[INFO] ------------------------------------------------------------------------
[INFO] ActiveMQ .............................................. SUCCESS [6:11.757s]
[INFO] ActiveMQ :: KahaDB .................................... SUCCESS [1:11.789s]
[INFO] ActiveMQ :: JAAS ...................................... SUCCESS [1:36.749s]
[INFO] Openwire Generator .................................... SUCCESS [39.144s]
[INFO] ActiveMQ :: jmdns 1.0 ................................. SUCCESS [21.355s]
[INFO] ActiveMQ :: Core ...................................... SUCCESS [5:26.042s]
[INFO] ActiveMQ :: RA ........................................ SUCCESS [46.958s]
[INFO] ActiveMQ :: Pool ...................................... SUCCESS [36.819s]
[INFO] ActiveMQ :: Camel ..................................... SUCCESS [49.268s]
[INFO] ActiveMQ :: Console ................................... SUCCESS [29.902s]
[INFO] ActiveMQ :: Optional .................................. SUCCESS [1:19.112s]
[INFO] ActiveMQ :: Jar Bundle ................................ SUCCESS [34.181s]
[INFO] ActiveMQ :: File Server ............................... SUCCESS [37.530s]
[INFO] ActiveMQ :: Blueprint ................................. SUCCESS [32.996s]
[INFO] ActiveMQ :: Apache Karaf .............................. FAILED [1.698s]
[INFO] ActiveMQ :: RAR ....................................... SUCCESS [1:43.084s]
[INFO] ActiveMQ :: Run Jar ................................... SUCCESS [14.955s]
[INFO] ActiveMQ :: Spring .................................... SUCCESS [28.664s]
[INFO] ActiveMQ Tooling ...................................... SUCCESS [5.308s]
[INFO] ActiveMQ :: Memory Usage Test Plugin .................. SUCCESS [54.666s]
[INFO] ActiveMQ :: Performance Test Plugin ................... SUCCESS [29.665s]
[INFO] ActiveMQ :: StartUp Plugin ............................ SUCCESS [28.914s]
[INFO] ActiveMQ :: Web ....................................... SUCCESS [36.639s]
[INFO] ActiveMQ :: Web Demo .................................. SUCCESS [3:21.142s]
[INFO] ActiveMQ :: XMPP ...................................... SUCCESS [1:01.355s]
[INFO] ActiveMQ :: Web Console ............................... SUCCESS [3:32.806s]
[INFO] ActiveMQ :: Assembly .................................. SUCCESS [6:07.872s]
[INFO] ------------------------------------------------------------------------
[INFO] Error for project: ActiveMQ :: Apache Karaf (during deploy)
[INFO] ------------------------------------------------------------------------
[INFO] Failed to resolve artifact.

Missing:
----------
1) org.apache.karaf.shell:org.apache.karaf.shell.console:jar:1.99.0-SNAPSHOT

  Try downloading the file manually from the project website.

  Then, install it using the command: 
      mvn install:install-file -DgroupId=org.apache.karaf.shell -DartifactId=org.apache.karaf.shell.console
-Dversion=1.99.0-20100719.140414-4 -Dpackaging=jar -Dfile=/path/to/file

  Alternatively, if you host your own repository you can deploy the file there: 
      mvn deploy:deploy-file -DgroupId=org.apache.karaf.shell -DartifactId=org.apache.karaf.shell.console
-Dversion=1.99.0-20100719.140414-4 -Dpackaging=jar -Dfile=/path/to/file -Durl=[url] -DrepositoryId=[id]

  Path to dependency: 
  	1) org.apache.activemq:activemq-karaf:bundle:5.4-SNAPSHOT
  	2) org.apache.karaf.shell:org.apache.karaf.shell.console:jar:1.99.0-SNAPSHOT

----------
1 required artifact is missing.

for artifact: 
  org.apache.activemq:activemq-karaf:bundle:5.4-SNAPSHOT

from the specified remote repositories:
  central (http://repo1.maven.org/maven2),
  com.springsource.repository.bundles.external (http://repository.springsource.com/maven/bundles/external),
  Nexus (http://repository.apache.org/snapshots)



[INFO] ------------------------------------------------------------------------
[INFO] Trace
org.apache.maven.lifecycle.LifecycleExecutionException: Missing:
----------
1) org.apache.karaf.shell:org.apache.karaf.shell.console:jar:1.99.0-SNAPSHOT

  Try downloading the file manually from the project website.

  Then, install it using the command: 
      mvn install:install-file -DgroupId=org.apache.karaf.shell -DartifactId=org.apache.karaf.shell.console
-Dversion=1.99.0-20100719.140414-4 -Dpackaging=jar -Dfile=/path/to/file

  Alternatively, if you host your own repository you can deploy the file there: 
      mvn deploy:deploy-file -DgroupId=org.apache.karaf.shell -DartifactId=org.apache.karaf.shell.console
-Dversion=1.99.0-20100719.140414-4 -Dpackaging=jar -Dfile=/path/to/file -Durl=[url] -DrepositoryId=[id]

  Path to dependency: 
  	1) org.apache.activemq:activemq-karaf:bundle:5.4-SNAPSHOT
  	2) org.apache.karaf.shell:org.apache.karaf.shell.console:jar:1.99.0-SNAPSHOT

----------
1 required artifact is missing.

for artifact: 
  org.apache.activemq:activemq-karaf:bundle:5.4-SNAPSHOT

from the specified remote repositories:
  central (http://repo1.maven.org/maven2),
  com.springsource.repository.bundles.external (http://repository.springsource.com/maven/bundles/external),
  Nexus (http://repository.apache.org/snapshots)


	at org.apache.maven.lifecycle.DefaultLifecycleExecutor.executeGoals(DefaultLifecycleExecutor.java:711)
	at org.apache.maven.lifecycle.DefaultLifecycleExecutor.executeGoalWithLifecycle(DefaultLifecycleExecutor.java:556)
	at org.apache.maven.lifecycle.DefaultLifecycleExecutor.executeGoal(DefaultLifecycleExecutor.java:535)
	at org.apache.maven.lifecycle.DefaultLifecycleExecutor.executeGoalAndHandleFailures(DefaultLifecycleExecutor.java:387)
	at org.apache.maven.lifecycle.DefaultLifecycleExecutor.executeTaskSegments(DefaultLifecycleExecutor.java:348)
	at org.apache.maven.lifecycle.DefaultLifecycleExecutor.execute(DefaultLifecycleExecutor.java:180)
	at org.apache.maven.lifecycle.LifecycleExecutorInterceptor.execute(LifecycleExecutorInterceptor.java:65)
	at org.apache.maven.DefaultMaven.doExecute(DefaultMaven.java:328)
	at org.apache.maven.DefaultMaven.execute(DefaultMaven.java:138)
	at org.apache.maven.cli.MavenCli.main(MavenCli.java:362)
	at sun.reflect.NativeMethodAccessorImpl.invoke0(Native Method)
	at sun.reflect.NativeMethodAccessorImpl.invoke(NativeMethodAccessorImpl.java:39)
	at sun.reflect.DelegatingMethodAccessorImpl.invoke(DelegatingMethodAccessorImpl.java:25)
	at java.lang.reflect.Method.invoke(Method.java:592)
	at org.codehaus.classworlds.Launcher.launchEnhanced(Launcher.java:315)
	at org.codehaus.classworlds.Launcher.launch(Launcher.java:255)
	at hudson.maven.agent.Main.launch(Main.java:165)
	at hudson.maven.MavenBuilder.call(MavenBuilder.java:165)
	at hudson.maven.MavenModuleSetBuild$Builder.call(MavenModuleSetBuild.java:696)
	at hudson.maven.MavenModuleSetBuild$Builder.call(MavenModuleSetBuild.java:640)
	at hudson.remoting.UserRequest.perform(UserRequest.java:114)
	at hudson.remoting.UserRequest.perform(UserRequest.java:48)
	at hudson.remoting.Request$2.run(Request.java:270)
	at java.util.concurrent.Executors$RunnableAdapter.call(Executors.java:417)
	at java.util.concurrent.FutureTask$Sync.innerRun(FutureTask.java:269)
	at java.util.concurrent.FutureTask.run(FutureTask.java:123)
	at java.util.concurrent.ThreadPoolExecutor$Worker.runTask(ThreadPoolExecutor.java:651)
	at java.util.concurrent.ThreadPoolExecutor$Worker.run(ThreadPoolExecutor.java:676)
	at java.lang.Thread.run(Thread.java:595)
Caused by: org.apache.maven.artifact.resolver.MultipleArtifactsNotFoundException: Missing:
----------
1) org.apache.karaf.shell:org.apache.karaf.shell.console:jar:1.99.0-SNAPSHOT

  Try downloading the file manually from the project website.

  Then, install it using the command: 
      mvn install:install-file -DgroupId=org.apache.karaf.shell -DartifactId=org.apache.karaf.shell.console
-Dversion=1.99.0-20100719.140414-4 -Dpackaging=jar -Dfile=/path/to/file

  Alternatively, if you host your own repository you can deploy the file there: 
      mvn deploy:deploy-file -DgroupId=org.apache.karaf.shell -DartifactId=org.apache.karaf.shell.console
-Dversion=1.99.0-20100719.140414-4 -Dpackaging=jar -Dfile=/path/to/file -Durl=[url] -DrepositoryId=[id]

  Path to dependency: 
  	1) org.apache.activemq:activemq-karaf:bundle:5.4-SNAPSHOT
  	2) org.apache.karaf.shell:org.apache.karaf.shell.console:jar:1.99.0-SNAPSHOT

----------
1 required artifact is missing.

for artifact: 
  org.apache.activemq:activemq-karaf:bundle:5.4-SNAPSHOT

from the specified remote repositories:
  central (http://repo1.maven.org/maven2),
  com.springsource.repository.bundles.external (http://repository.springsource.com/maven/bundles/external),
  Nexus (http://repository.apache.org/snapshots)


	at org.apache.maven.artifact.resolver.DefaultArtifactResolver.resolveTransitively(DefaultArtifactResolver.java:360)
	at org.apache.maven.artifact.resolver.DefaultArtifactResolver.resolveTransitively(DefaultArtifactResolver.java:304)
	at org.apache.maven.plugin.DefaultPluginManager.resolveTransitiveDependencies(DefaultPluginManager.java:1499)
	at org.apache.maven.plugin.DefaultPluginManager.executeMojo(DefaultPluginManager.java:442)
	at hudson.maven.agent.PluginManagerInterceptor.executeMojo(PluginManagerInterceptor.java:182)
	at org.apache.maven.lifecycle.DefaultLifecycleExecutor.executeGoals(DefaultLifecycleExecutor.java:694)
	... 28 more
[INFO] ------------------------------------------------------------------------
[INFO] BUILD ERRORS
[INFO] ------------------------------------------------------------------------
[INFO] Total time: 57 minutes 58 seconds
[INFO] Finished at: Fri Jul 30 04:10:40 UTC 2010
[INFO] Final Memory: 96M/1977M
[INFO] ------------------------------------------------------------------------
Waiting for Hudson to finish collecting data
channel stopped


Mime
View raw message