activemq-dev mailing list archives

Site index · List index
Message view « Date » · « Thread »
Top « Date » · « Thread »
From Apache Hudson Server <hud...@hudson.zones.apache.org>
Subject Build failed in Hudson: ActiveMQ-Trunk-Deploy #103
Date Tue, 27 Jul 2010 03:46:45 GMT
See <http://hudson.zones.apache.org/hudson/job/ActiveMQ-Trunk-Deploy/103/changes>

Changes:

[gtully] resolve: https://issues.apache.org/activemq/browse/AMQ-2842 - patch applied with
thanks

[gtully] resolve: https://issues.apache.org/activemq/browse/AMQ-2849 - patch applied with
thanks

[rajdavies] updated copy() method to copy directories

------------------------------------------
[...truncated 16238 lines...]
Downloading: http://repository.apache.org/snapshots/org/codehaus/plexus/plexus-interpolation/1.7/plexus-interpolation-1.7.pom
Downloading: http://repo1.maven.org/maven2/org/codehaus/plexus/plexus-interpolation/1.7/plexus-interpolation-1.7.pom
Downloading: http://repository.apache.org/snapshots/org/codehaus/plexus/plexus-active-collections/1.0-beta-2/plexus-active-collections-1.0-beta-2.pom
Downloading: http://repo1.maven.org/maven2/org/codehaus/plexus/plexus-active-collections/1.0-beta-2/plexus-active-collections-1.0-beta-2.pom
Downloading: http://repository.apache.org/snapshots/org/codehaus/plexus/plexus-container-default/1.0-alpha-22/plexus-container-default-1.0-alpha-22.pom
Downloading: http://download.java.net/maven/2/org/codehaus/plexus/plexus-container-default/1.0-alpha-22/plexus-container-default-1.0-alpha-22.pom
Downloading: http://repository.springsource.com/maven/bundles/external/org/codehaus/plexus/plexus-container-default/1.0-alpha-22/plexus-container-default-1.0-alpha-22.pom
Downloading: http://repo1.maven.org/maven2/org/codehaus/plexus/plexus-container-default/1.0-alpha-22/plexus-container-default-1.0-alpha-22.pom
Downloading: http://repository.apache.org/snapshots/org/codehaus/plexus/plexus-containers/1.0-alpha-22/plexus-containers-1.0-alpha-22.pom
Downloading: http://download.java.net/maven/2/org/codehaus/plexus/plexus-containers/1.0-alpha-22/plexus-containers-1.0-alpha-22.pom
Downloading: http://repository.springsource.com/maven/bundles/external/org/codehaus/plexus/plexus-containers/1.0-alpha-22/plexus-containers-1.0-alpha-22.pom
Downloading: http://repo1.maven.org/maven2/org/codehaus/plexus/plexus-containers/1.0-alpha-22/plexus-containers-1.0-alpha-22.pom
Downloading: http://repository.apache.org/snapshots/org/apache/maven/shared/maven-repository-builder/1.0-alpha-2/maven-repository-builder-1.0-alpha-2.pom
Downloading: http://repo1.maven.org/maven2/org/apache/maven/shared/maven-repository-builder/1.0-alpha-2/maven-repository-builder-1.0-alpha-2.pom
Downloading: http://repository.apache.org/snapshots/org/apache/maven/shared/maven-common-artifact-filters/1.0-alpha-1/maven-common-artifact-filters-1.0-alpha-1.pom
Downloading: http://download.java.net/maven/2/org/apache/maven/shared/maven-common-artifact-filters/1.0-alpha-1/maven-common-artifact-filters-1.0-alpha-1.pom
Downloading: http://repository.springsource.com/maven/bundles/external/org/apache/maven/shared/maven-common-artifact-filters/1.0-alpha-1/maven-common-artifact-filters-1.0-alpha-1.pom
Downloading: http://repo1.maven.org/maven2/org/apache/maven/shared/maven-common-artifact-filters/1.0-alpha-1/maven-common-artifact-filters-1.0-alpha-1.pom
Downloading: http://repository.apache.org/snapshots/org/apache/maven/shared/maven-shared-components/6/maven-shared-components-6.pom
Downloading: http://download.java.net/maven/2/org/apache/maven/shared/maven-shared-components/6/maven-shared-components-6.pom
Downloading: http://repository.springsource.com/maven/bundles/external/org/apache/maven/shared/maven-shared-components/6/maven-shared-components-6.pom
Downloading: http://repo1.maven.org/maven2/org/apache/maven/shared/maven-shared-components/6/maven-shared-components-6.pom
Downloading: http://repository.apache.org/snapshots/org/apache/maven/shared/maven-common-artifact-filters/1.1/maven-common-artifact-filters-1.1.jar
Downloading: http://repo1.maven.org/maven2/org/apache/maven/shared/maven-common-artifact-filters/1.1/maven-common-artifact-filters-1.1.jar
Downloading: http://repository.apache.org/snapshots/org/codehaus/plexus/plexus-interpolation/1.7/plexus-interpolation-1.7.jar
Downloading: http://repo1.maven.org/maven2/org/codehaus/plexus/plexus-interpolation/1.7/plexus-interpolation-1.7.jar
Downloading: http://repository.apache.org/snapshots/org/codehaus/plexus/plexus-active-collections/1.0-beta-2/plexus-active-collections-1.0-beta-2.jar
Downloading: http://repo1.maven.org/maven2/org/codehaus/plexus/plexus-active-collections/1.0-beta-2/plexus-active-collections-1.0-beta-2.jar
Downloading: http://repository.apache.org/snapshots/org/apache/maven/shared/maven-repository-builder/1.0-alpha-2/maven-repository-builder-1.0-alpha-2.jar
Downloading: http://repo1.maven.org/maven2/org/apache/maven/shared/maven-repository-builder/1.0-alpha-2/maven-repository-builder-1.0-alpha-2.jar
[INFO] [assembly:attached {execution: unix-bin}]
[INFO] Reading assembly descriptor: src/main/descriptors/unix-bin.xml
[WARNING] Cannot include project artifact: org.apache.activemq:apache-activemq:pom:5.4-SNAPSHOT;
it doesn't have an associated file or directory.
[WARNING] Cannot include project artifact: org.apache.activemq:apache-activemq:pom:5.4-SNAPSHOT;
it doesn't have an associated file or directory.
[WARNING] Cannot include project artifact: org.apache.activemq:apache-activemq:pom:5.4-SNAPSHOT;
it doesn't have an associated file or directory.
[WARNING] Cannot include project artifact: org.apache.activemq:apache-activemq:pom:5.4-SNAPSHOT;
it doesn't have an associated file or directory.
[WARNING] Cannot include project artifact: org.apache.activemq:apache-activemq:pom:5.4-SNAPSHOT;
it doesn't have an associated file or directory.
[WARNING] Cannot include project artifact: org.apache.activemq:apache-activemq:pom:5.4-SNAPSHOT;
it doesn't have an associated file or directory.
[INFO] apache-activemq-5.4-SNAPSHOT/webapps/admin/WEB-INF already added, skipping
[INFO] Building tar : <http://hudson.zones.apache.org/hudson/job/ActiveMQ-Trunk-Deploy/ws/trunk/assembly/target/apache-activemq-5.4-SNAPSHOT-bin.tar.gz>
[INFO] apache-activemq-5.4-SNAPSHOT/webapps/admin/WEB-INF already added, skipping
[INFO] [assembly:attached {execution: windows-bin}]
[INFO] Reading assembly descriptor: src/main/descriptors/windows-bin.xml
[WARNING] Cannot include project artifact: org.apache.activemq:apache-activemq:pom:5.4-SNAPSHOT;
it doesn't have an associated file or directory.
[WARNING] Cannot include project artifact: org.apache.activemq:apache-activemq:pom:5.4-SNAPSHOT;
it doesn't have an associated file or directory.
[WARNING] Cannot include project artifact: org.apache.activemq:apache-activemq:pom:5.4-SNAPSHOT;
it doesn't have an associated file or directory.
[WARNING] Cannot include project artifact: org.apache.activemq:apache-activemq:pom:5.4-SNAPSHOT;
it doesn't have an associated file or directory.
[WARNING] Cannot include project artifact: org.apache.activemq:apache-activemq:pom:5.4-SNAPSHOT;
it doesn't have an associated file or directory.
[WARNING] Cannot include project artifact: org.apache.activemq:apache-activemq:pom:5.4-SNAPSHOT;
it doesn't have an associated file or directory.
[INFO] apache-activemq-5.4-SNAPSHOT/webapps/admin/WEB-INF already added, skipping
[INFO] Building zip: <http://hudson.zones.apache.org/hudson/job/ActiveMQ-Trunk-Deploy/ws/trunk/assembly/target/apache-activemq-5.4-SNAPSHOT-bin.zip>
[INFO] apache-activemq-5.4-SNAPSHOT/webapps/admin/WEB-INF already added, skipping
[INFO] [ianal:verify-legal-files {execution: default}]
[INFO] Checking legal files in: apache-activemq-5.4-SNAPSHOT-bin.zip
[INFO] [install:install]
[INFO] Installing <http://hudson.zones.apache.org/hudson/job/ActiveMQ-Trunk-Deploy/ws/trunk/assembly/pom.xml>
to <http://hudson.zones.apache.org/hudson/job/ActiveMQ-Trunk-Deploy/ws/.repository/org/apache/activemq/apache-activemq/5.4-SNAPSHOT/apache-activemq-5.4-SNAPSHOT.pom>
[INFO] Installing <http://hudson.zones.apache.org/hudson/job/ActiveMQ-Trunk-Deploy/ws/trunk/assembly/target/apache-activemq-5.4-SNAPSHOT-bin.tar.gz>
to <http://hudson.zones.apache.org/hudson/job/ActiveMQ-Trunk-Deploy/ws/.repository/org/apache/activemq/apache-activemq/5.4-SNAPSHOT/apache-activemq-5.4-SNAPSHOT-bin.tar.gz>
[INFO] Installing <http://hudson.zones.apache.org/hudson/job/ActiveMQ-Trunk-Deploy/ws/trunk/assembly/target/apache-activemq-5.4-SNAPSHOT-bin.zip>
to <http://hudson.zones.apache.org/hudson/job/ActiveMQ-Trunk-Deploy/ws/.repository/org/apache/activemq/apache-activemq/5.4-SNAPSHOT/apache-activemq-5.4-SNAPSHOT-bin.zip>
[INFO] [deploy:deploy]
[INFO] Retrieving previous build number from apache.snapshots.https
Uploading: https://repository.apache.org/content/repositories/snapshots/org/apache/activemq/apache-activemq/5.4-SNAPSHOT/apache-activemq-5.4-SNAPSHOT.pom
14K uploaded
[INFO] Retrieving previous metadata from apache.snapshots.https
[INFO] Uploading repository metadata for: 'snapshot org.apache.activemq:apache-activemq:5.4-SNAPSHOT'
[INFO] Retrieving previous metadata from apache.snapshots.https
[INFO] Uploading repository metadata for: 'artifact org.apache.activemq:apache-activemq'
[INFO] Retrieving previous build number from apache.snapshots.https
Uploading: https://repository.apache.org/content/repositories/snapshots/org/apache/activemq/apache-activemq/5.4-SNAPSHOT/apache-activemq-5.4-SNAPSHOT-bin.tar.gz
33753K uploaded
[INFO] Retrieving previous build number from apache.snapshots.https
Uploading: https://repository.apache.org/content/repositories/snapshots/org/apache/activemq/apache-activemq/5.4-SNAPSHOT/apache-activemq-5.4-SNAPSHOT-bin.zip
33937K uploaded
[HUDSON] Archiving <http://hudson.zones.apache.org/hudson/job/ActiveMQ-Trunk-Deploy/ws/trunk/assembly/target/apache-activemq-5.4-SNAPSHOT-bin.tar.gz>
to /export/home/hudson/hudson/jobs/ActiveMQ-Trunk-Deploy/modules/org.apache.activemq$apache-activemq/builds/2010-07-27_03-02-41/archive/org.apache.activemq/apache-activemq/5.4-SNAPSHOT/apache-activemq-5.4-SNAPSHOT-bin.tar.gz
[HUDSON] Archiving <http://hudson.zones.apache.org/hudson/job/ActiveMQ-Trunk-Deploy/ws/trunk/assembly/target/apache-activemq-5.4-SNAPSHOT-bin.zip>
to /export/home/hudson/hudson/jobs/ActiveMQ-Trunk-Deploy/modules/org.apache.activemq$apache-activemq/builds/2010-07-27_03-02-41/archive/org.apache.activemq/apache-activemq/5.4-SNAPSHOT/apache-activemq-5.4-SNAPSHOT-bin.zip
[INFO] 
[INFO] 
[INFO] ------------------------------------------------------------------------
[INFO] Reactor Summary:
[INFO] ------------------------------------------------------------------------
[INFO] ActiveMQ .............................................. SUCCESS [7:17.998s]
[INFO] ActiveMQ :: KahaDB .................................... SUCCESS [1:41.121s]
[INFO] ActiveMQ :: JAAS ...................................... SUCCESS [2:21.753s]
[INFO] Openwire Generator .................................... SUCCESS [55.402s]
[INFO] ActiveMQ :: jmdns 1.0 ................................. SUCCESS [20.140s]
[INFO] ActiveMQ :: Core ...................................... SUCCESS [5:15.054s]
[INFO] ActiveMQ :: RA ........................................ SUCCESS [39.447s]
[INFO] ActiveMQ :: Pool ...................................... SUCCESS [30.451s]
[INFO] ActiveMQ :: Camel ..................................... SUCCESS [47.135s]
[INFO] ActiveMQ :: Console ................................... SUCCESS [21.398s]
[INFO] ActiveMQ :: Optional .................................. SUCCESS [1:35.724s]
[INFO] ActiveMQ :: Jar Bundle ................................ SUCCESS [23.146s]
[INFO] ActiveMQ :: File Server ............................... SUCCESS [34.461s]
[INFO] ActiveMQ :: Blueprint ................................. SUCCESS [35.378s]
[INFO] ActiveMQ :: Apache Karaf .............................. FAILED [10.930s]
[INFO] ActiveMQ :: RAR ....................................... SUCCESS [54.091s]
[INFO] ActiveMQ :: Run Jar ................................... SUCCESS [13.856s]
[INFO] ActiveMQ :: Spring .................................... SUCCESS [20.277s]
[INFO] ActiveMQ Tooling ...................................... SUCCESS [4.360s]
[INFO] ActiveMQ :: Memory Usage Test Plugin .................. SUCCESS [46.480s]
[INFO] ActiveMQ :: Performance Test Plugin ................... SUCCESS [22.304s]
[INFO] ActiveMQ :: StartUp Plugin ............................ SUCCESS [26.831s]
[INFO] ActiveMQ :: Web ....................................... SUCCESS [27.195s]
[INFO] ActiveMQ :: Web Demo .................................. SUCCESS [1:22.367s]
[INFO] ActiveMQ :: XMPP ...................................... SUCCESS [1:00.270s]
[INFO] ActiveMQ :: Web Console ............................... SUCCESS [1:58.526s]
[INFO] ActiveMQ :: Assembly .................................. SUCCESS [5:30.932s]
[INFO] ------------------------------------------------------------------------
[INFO] Error for project: ActiveMQ :: Apache Karaf (during deploy)
[INFO] ------------------------------------------------------------------------
[INFO] Failed to resolve artifact.

Missing:
----------
1) org.apache.aries:org.apache.aries.util:jar:0.1-r964701

  Try downloading the file manually from the project website.

  Then, install it using the command: 
      mvn install:install-file -DgroupId=org.apache.aries -DartifactId=org.apache.aries.util
-Dversion=0.1-r964701 -Dpackaging=jar -Dfile=/path/to/file

  Alternatively, if you host your own repository you can deploy the file there: 
      mvn deploy:deploy-file -DgroupId=org.apache.aries -DartifactId=org.apache.aries.util
-Dversion=0.1-r964701 -Dpackaging=jar -Dfile=/path/to/file -Durl=[url] -DrepositoryId=[id]

  Path to dependency: 
  	1) org.apache.activemq:activemq-karaf:bundle:5.4-SNAPSHOT
  	2) org.apache.karaf.shell:org.apache.karaf.shell.console:jar:1.99.0-SNAPSHOT
  	3) org.apache.aries.blueprint:org.apache.aries.blueprint:jar:0.1-r964701
  	4) org.apache.aries:org.apache.aries.util:jar:0.1-r964701

----------
1 required artifact is missing.

for artifact: 
  org.apache.activemq:activemq-karaf:bundle:5.4-SNAPSHOT

from the specified remote repositories:
  central (http://repo1.maven.org/maven2),
  com.springsource.repository.bundles.external (http://repository.springsource.com/maven/bundles/external),
  Nexus (http://repository.apache.org/snapshots)



[INFO] ------------------------------------------------------------------------
[INFO] Trace
org.apache.maven.lifecycle.LifecycleExecutionException: Missing:
----------
1) org.apache.aries:org.apache.aries.util:jar:0.1-r964701

  Try downloading the file manually from the project website.

  Then, install it using the command: 
      mvn install:install-file -DgroupId=org.apache.aries -DartifactId=org.apache.aries.util
-Dversion=0.1-r964701 -Dpackaging=jar -Dfile=/path/to/file

  Alternatively, if you host your own repository you can deploy the file there: 
      mvn deploy:deploy-file -DgroupId=org.apache.aries -DartifactId=org.apache.aries.util
-Dversion=0.1-r964701 -Dpackaging=jar -Dfile=/path/to/file -Durl=[url] -DrepositoryId=[id]

  Path to dependency: 
  	1) org.apache.activemq:activemq-karaf:bundle:5.4-SNAPSHOT
  	2) org.apache.karaf.shell:org.apache.karaf.shell.console:jar:1.99.0-SNAPSHOT
  	3) org.apache.aries.blueprint:org.apache.aries.blueprint:jar:0.1-r964701
  	4) org.apache.aries:org.apache.aries.util:jar:0.1-r964701

----------
1 required artifact is missing.

for artifact: 
  org.apache.activemq:activemq-karaf:bundle:5.4-SNAPSHOT

from the specified remote repositories:
  central (http://repo1.maven.org/maven2),
  com.springsource.repository.bundles.external (http://repository.springsource.com/maven/bundles/external),
  Nexus (http://repository.apache.org/snapshots)


	at org.apache.maven.lifecycle.DefaultLifecycleExecutor.executeGoals(DefaultLifecycleExecutor.java:576)
	at org.apache.maven.lifecycle.DefaultLifecycleExecutor.executeGoalWithLifecycle(DefaultLifecycleExecutor.java:500)
	at org.apache.maven.lifecycle.DefaultLifecycleExecutor.executeGoal(DefaultLifecycleExecutor.java:479)
	at org.apache.maven.lifecycle.DefaultLifecycleExecutor.executeGoalAndHandleFailures(DefaultLifecycleExecutor.java:331)
	at org.apache.maven.lifecycle.DefaultLifecycleExecutor.executeTaskSegments(DefaultLifecycleExecutor.java:292)
	at org.apache.maven.lifecycle.DefaultLifecycleExecutor.execute(DefaultLifecycleExecutor.java:142)
	at org.apache.maven.lifecycle.LifecycleExecutorInterceptor.execute(LifecycleExecutorInterceptor.java:65)
	at org.apache.maven.DefaultMaven.doExecute(DefaultMaven.java:336)
	at org.apache.maven.DefaultMaven.execute(DefaultMaven.java:129)
	at org.apache.maven.cli.MavenCli.main(MavenCli.java:301)
	at sun.reflect.NativeMethodAccessorImpl.invoke0(Native Method)
	at sun.reflect.NativeMethodAccessorImpl.invoke(NativeMethodAccessorImpl.java:39)
	at sun.reflect.DelegatingMethodAccessorImpl.invoke(DelegatingMethodAccessorImpl.java:25)
	at java.lang.reflect.Method.invoke(Method.java:592)
	at org.codehaus.classworlds.Launcher.launchEnhanced(Launcher.java:315)
	at org.codehaus.classworlds.Launcher.launch(Launcher.java:255)
	at hudson.maven.agent.Main.launch(Main.java:165)
	at hudson.maven.MavenBuilder.call(MavenBuilder.java:165)
	at hudson.maven.MavenModuleSetBuild$Builder.call(MavenModuleSetBuild.java:696)
	at hudson.maven.MavenModuleSetBuild$Builder.call(MavenModuleSetBuild.java:640)
	at hudson.remoting.UserRequest.perform(UserRequest.java:114)
	at hudson.remoting.UserRequest.perform(UserRequest.java:48)
	at hudson.remoting.Request$2.run(Request.java:270)
	at java.util.concurrent.Executors$RunnableAdapter.call(Executors.java:417)
	at java.util.concurrent.FutureTask$Sync.innerRun(FutureTask.java:269)
	at java.util.concurrent.FutureTask.run(FutureTask.java:123)
	at java.util.concurrent.ThreadPoolExecutor$Worker.runTask(ThreadPoolExecutor.java:651)
	at java.util.concurrent.ThreadPoolExecutor$Worker.run(ThreadPoolExecutor.java:676)
	at java.lang.Thread.run(Thread.java:595)
Caused by: org.apache.maven.artifact.resolver.MultipleArtifactsNotFoundException: Missing:
----------
1) org.apache.aries:org.apache.aries.util:jar:0.1-r964701

  Try downloading the file manually from the project website.

  Then, install it using the command: 
      mvn install:install-file -DgroupId=org.apache.aries -DartifactId=org.apache.aries.util
-Dversion=0.1-r964701 -Dpackaging=jar -Dfile=/path/to/file

  Alternatively, if you host your own repository you can deploy the file there: 
      mvn deploy:deploy-file -DgroupId=org.apache.aries -DartifactId=org.apache.aries.util
-Dversion=0.1-r964701 -Dpackaging=jar -Dfile=/path/to/file -Durl=[url] -DrepositoryId=[id]

  Path to dependency: 
  	1) org.apache.activemq:activemq-karaf:bundle:5.4-SNAPSHOT
  	2) org.apache.karaf.shell:org.apache.karaf.shell.console:jar:1.99.0-SNAPSHOT
  	3) org.apache.aries.blueprint:org.apache.aries.blueprint:jar:0.1-r964701
  	4) org.apache.aries:org.apache.aries.util:jar:0.1-r964701

----------
1 required artifact is missing.

for artifact: 
  org.apache.activemq:activemq-karaf:bundle:5.4-SNAPSHOT

from the specified remote repositories:
  central (http://repo1.maven.org/maven2),
  com.springsource.repository.bundles.external (http://repository.springsource.com/maven/bundles/external),
  Nexus (http://repository.apache.org/snapshots)


	at org.apache.maven.artifact.resolver.DefaultArtifactResolver.resolveTransitively(DefaultArtifactResolver.java:324)
	at org.apache.maven.artifact.resolver.DefaultArtifactResolver.resolveTransitively(DefaultArtifactResolver.java:288)
	at org.apache.maven.plugin.DefaultPluginManager.resolveTransitiveDependencies(DefaultPluginManager.java:1417)
	at org.apache.maven.plugin.DefaultPluginManager.executeMojo(DefaultPluginManager.java:407)
	at hudson.maven.agent.PluginManagerInterceptor.executeMojo(PluginManagerInterceptor.java:182)
	at org.apache.maven.lifecycle.DefaultLifecycleExecutor.executeGoals(DefaultLifecycleExecutor.java:559)
	... 28 more
[INFO] ------------------------------------------------------------------------
[INFO] BUILD ERRORS
[INFO] ------------------------------------------------------------------------
[INFO] Total time: 43 minutes 50 seconds
[INFO] Finished at: Tue Jul 27 03:46:39 UTC 2010
[INFO] Final Memory: 93M/1958M
[INFO] ------------------------------------------------------------------------
Waiting for Hudson to finish collecting data
channel stopped


Mime
View raw message