activemq-dev mailing list archives

Site index · List index
Message view « Date » · « Thread »
Top « Date » · « Thread »
From Apache Hudson Server <hud...@hudson.zones.apache.org>
Subject Build failed in Hudson: ActiveMQ-Trunk-Deploy #101
Date Fri, 23 Jul 2010 04:43:02 GMT
See <http://hudson.zones.apache.org/hudson/job/ActiveMQ-Trunk-Deploy/101/changes>

Changes:

[dejanb] https://issues.apache.org/activemq/browse/AMQ-2843 - first stab at supporting priority
for durable subs

[rajdavies] updated to Apache Camel 2.4.0

------------------------------------------
[...truncated 14982 lines...]
[INFO] Uploading repository metadata for: 'artifact org.apache.activemq:activemq-xmpp'
[INFO] Uploading project information for activemq-xmpp 5.4-SNAPSHOT
[INFO] Retrieving previous build number from apache.snapshots.https
Uploading: https://repository.apache.org/content/repositories/snapshots/org/apache/activemq/activemq-xmpp/5.4-SNAPSHOT/activemq-xmpp-5.4-SNAPSHOT-sources.jar
191K uploaded
[INFO] Retrieving previous build number from apache.snapshots.https
Uploading: https://repository.apache.org/content/repositories/snapshots/org/apache/activemq/activemq-xmpp/5.4-SNAPSHOT/activemq-xmpp-5.4-SNAPSHOT-javadoc.jar
1111K uploaded
[HUDSON] Archiving <http://hudson.zones.apache.org/hudson/job/ActiveMQ-Trunk-Deploy/ws/trunk/activemq-xmpp/target/activemq-xmpp-5.4-SNAPSHOT-sources.jar>
to /export/home/hudson/hudson/jobs/ActiveMQ-Trunk-Deploy/modules/org.apache.activemq$activemq-xmpp/builds/2010-07-23_03-43-30/archive/org.apache.activemq/activemq-xmpp/5.4-SNAPSHOT/activemq-xmpp-5.4-SNAPSHOT-sources.jar
[HUDSON] Archiving <http://hudson.zones.apache.org/hudson/job/ActiveMQ-Trunk-Deploy/ws/trunk/activemq-xmpp/target/activemq-xmpp-5.4-SNAPSHOT-javadoc.jar>
to /export/home/hudson/hudson/jobs/ActiveMQ-Trunk-Deploy/modules/org.apache.activemq$activemq-xmpp/builds/2010-07-23_03-43-30/archive/org.apache.activemq/activemq-xmpp/5.4-SNAPSHOT/activemq-xmpp-5.4-SNAPSHOT-javadoc.jar
[INFO] ------------------------------------------------------------------------
[INFO] SKIPPING ActiveMQ :: Web Console
[INFO]    task-segment: [clean, deploy]
[INFO] This project has been banned from further executions due to previous failures.
[INFO] ------------------------------------------------------------------------
[INFO] ------------------------------------------------------------------------
[INFO] SKIPPING ActiveMQ :: Assembly
[INFO]    task-segment: [clean, deploy]
[INFO] This project has been banned from further executions due to previous failures.
[INFO] ------------------------------------------------------------------------
[INFO] 
[INFO] 
[INFO] ------------------------------------------------------------------------
[INFO] Reactor Summary:
[INFO] ------------------------------------------------------------------------
[INFO] ActiveMQ .............................................. SUCCESS [10:03.486s]
[INFO] ActiveMQ :: KahaDB .................................... SUCCESS [58.105s]
[INFO] ActiveMQ :: JAAS ...................................... SUCCESS [2:25.281s]
[INFO] Openwire Generator .................................... SUCCESS [1:18.979s]
[INFO] ActiveMQ :: jmdns 1.0 ................................. SUCCESS [1:50.977s]
[INFO] ActiveMQ :: Core ...................................... SUCCESS [10:20.251s]
[INFO] ActiveMQ :: RA ........................................ SUCCESS [1:01.483s]
[INFO] ActiveMQ :: Pool ...................................... SUCCESS [38.377s]
[INFO] ActiveMQ :: Camel ..................................... FAILED [25.213s]
[INFO] ActiveMQ :: Console ................................... SUCCESS [42.753s]
[INFO] ActiveMQ :: Optional .................................. SUCCESS [2:03.270s]
[INFO] ActiveMQ :: Jar Bundle ................................ SKIPPED (dependency build failed
or was skipped)
[INFO] ActiveMQ :: File Server ............................... SUCCESS [52.991s]
[INFO] ActiveMQ :: Blueprint ................................. SUCCESS [1:00.642s]
[INFO] ActiveMQ :: Apache Karaf .............................. FAILED [11.525s]
[INFO] ActiveMQ :: RAR ....................................... SUCCESS [2:57.517s]
[INFO] ActiveMQ :: Run Jar ................................... SUCCESS [42.622s]
[INFO] ActiveMQ :: Spring .................................... SUCCESS [52.271s]
[INFO] ActiveMQ Tooling ...................................... SUCCESS [24.664s]
[INFO] ActiveMQ :: Memory Usage Test Plugin .................. SUCCESS [1:45.379s]
[INFO] ActiveMQ :: Performance Test Plugin ................... SUCCESS [58.374s]
[INFO] ActiveMQ :: StartUp Plugin ............................ SUCCESS [1:08.514s]
[INFO] ActiveMQ :: Web ....................................... SKIPPED (dependency build failed
or was skipped)
[INFO] ActiveMQ :: Web Demo .................................. SKIPPED (dependency build failed
or was skipped)
[INFO] ActiveMQ :: XMPP ...................................... SUCCESS [1:51.566s]
[INFO] ActiveMQ :: Web Console ............................... SKIPPED (dependency build failed
or was skipped)
[INFO] ActiveMQ :: Assembly .................................. SKIPPED (dependency build failed
or was skipped)
[INFO] ------------------------------------------------------------------------
[INFO] Error for project: ActiveMQ :: Camel (during deploy)
[INFO] ------------------------------------------------------------------------
[INFO] Compilation failure

<http://hudson.zones.apache.org/hudson/job/ActiveMQ-Trunk-Deploy/ws/trunk/activemq-camel/src/main/java/org/apache/activemq/camel/component/CamelEndpointLoader.java>:[190,20]
cannot find symbol
symbol  : method removeEndpoints(java.lang.String)
location: interface org.apache.camel.CamelContext

<http://hudson.zones.apache.org/hudson/job/ActiveMQ-Trunk-Deploy/ws/trunk/activemq-camel/src/main/java/org/apache/activemq/camel/component/CamelEndpointLoader.java>:[206,20]
cannot find symbol
symbol  : method removeEndpoints(java.lang.String)
location: interface org.apache.camel.CamelContext


[INFO] ------------------------------------------------------------------------
[INFO] Trace
org.apache.maven.BuildFailureException: Compilation failure
	at org.apache.maven.lifecycle.DefaultLifecycleExecutor.executeGoals(DefaultLifecycleExecutor.java:580)
	at org.apache.maven.lifecycle.DefaultLifecycleExecutor.executeGoalWithLifecycle(DefaultLifecycleExecutor.java:500)
	at org.apache.maven.lifecycle.DefaultLifecycleExecutor.executeGoal(DefaultLifecycleExecutor.java:479)
	at org.apache.maven.lifecycle.DefaultLifecycleExecutor.executeGoalAndHandleFailures(DefaultLifecycleExecutor.java:331)
	at org.apache.maven.lifecycle.DefaultLifecycleExecutor.executeTaskSegments(DefaultLifecycleExecutor.java:292)
	at org.apache.maven.lifecycle.DefaultLifecycleExecutor.execute(DefaultLifecycleExecutor.java:142)
	at org.apache.maven.lifecycle.LifecycleExecutorInterceptor.execute(LifecycleExecutorInterceptor.java:65)
	at org.apache.maven.DefaultMaven.doExecute(DefaultMaven.java:336)
	at org.apache.maven.DefaultMaven.execute(DefaultMaven.java:129)
	at org.apache.maven.cli.MavenCli.main(MavenCli.java:301)
	at sun.reflect.NativeMethodAccessorImpl.invoke0(Native Method)
	at sun.reflect.NativeMethodAccessorImpl.invoke(NativeMethodAccessorImpl.java:39)
	at sun.reflect.DelegatingMethodAccessorImpl.invoke(DelegatingMethodAccessorImpl.java:25)
	at java.lang.reflect.Method.invoke(Method.java:592)
	at org.codehaus.classworlds.Launcher.launchEnhanced(Launcher.java:315)
	at org.codehaus.classworlds.Launcher.launch(Launcher.java:255)
	at hudson.maven.agent.Main.launch(Main.java:165)
	at hudson.maven.MavenBuilder.call(MavenBuilder.java:165)
	at hudson.maven.MavenModuleSetBuild$Builder.call(MavenModuleSetBuild.java:696)
	at hudson.maven.MavenModuleSetBuild$Builder.call(MavenModuleSetBuild.java:640)
	at hudson.remoting.UserRequest.perform(UserRequest.java:114)
	at hudson.remoting.UserRequest.perform(UserRequest.java:48)
	at hudson.remoting.Request$2.run(Request.java:270)
	at java.util.concurrent.Executors$RunnableAdapter.call(Executors.java:417)
	at java.util.concurrent.FutureTask$Sync.innerRun(FutureTask.java:269)
	at java.util.concurrent.FutureTask.run(FutureTask.java:123)
	at java.util.concurrent.ThreadPoolExecutor$Worker.runTask(ThreadPoolExecutor.java:651)
	at java.util.concurrent.ThreadPoolExecutor$Worker.run(ThreadPoolExecutor.java:676)
	at java.lang.Thread.run(Thread.java:595)
Caused by: org.apache.maven.plugin.CompilationFailureException: Compilation failure
	at org.apache.maven.plugin.AbstractCompilerMojo.execute(AbstractCompilerMojo.java:516)
	at org.apache.maven.plugin.CompilerMojo.execute(CompilerMojo.java:114)
	at org.apache.maven.plugin.DefaultPluginManager.executeMojo(DefaultPluginManager.java:453)
	at hudson.maven.agent.PluginManagerInterceptor.executeMojo(PluginManagerInterceptor.java:182)
	at org.apache.maven.lifecycle.DefaultLifecycleExecutor.executeGoals(DefaultLifecycleExecutor.java:559)
	... 28 more
[INFO] ------------------------------------------------------------------------
[INFO] Error for project: ActiveMQ :: Apache Karaf (during deploy)
[INFO] ------------------------------------------------------------------------
[INFO] Failed to resolve artifact.

Missing:
----------
1) org.apache.aries:org.apache.aries.util:jar:0.1-r964701

  Try downloading the file manually from the project website.

  Then, install it using the command: 
      mvn install:install-file -DgroupId=org.apache.aries -DartifactId=org.apache.aries.util
-Dversion=0.1-r964701 -Dpackaging=jar -Dfile=/path/to/file

  Alternatively, if you host your own repository you can deploy the file there: 
      mvn deploy:deploy-file -DgroupId=org.apache.aries -DartifactId=org.apache.aries.util
-Dversion=0.1-r964701 -Dpackaging=jar -Dfile=/path/to/file -Durl=[url] -DrepositoryId=[id]

  Path to dependency: 
  	1) org.apache.activemq:activemq-karaf:bundle:5.4-SNAPSHOT
  	2) org.apache.karaf.shell:org.apache.karaf.shell.console:jar:1.99.0-SNAPSHOT
  	3) org.apache.aries.blueprint:org.apache.aries.blueprint:jar:0.1-r964701
  	4) org.apache.aries:org.apache.aries.util:jar:0.1-r964701

----------
1 required artifact is missing.

for artifact: 
  org.apache.activemq:activemq-karaf:bundle:5.4-SNAPSHOT

from the specified remote repositories:
  central (http://repo1.maven.org/maven2),
  com.springsource.repository.bundles.external (http://repository.springsource.com/maven/bundles/external),
  Nexus (http://repository.apache.org/snapshots)



[INFO] ------------------------------------------------------------------------
[INFO] Trace
org.apache.maven.lifecycle.LifecycleExecutionException: Missing:
----------
1) org.apache.aries:org.apache.aries.util:jar:0.1-r964701

  Try downloading the file manually from the project website.

  Then, install it using the command: 
      mvn install:install-file -DgroupId=org.apache.aries -DartifactId=org.apache.aries.util
-Dversion=0.1-r964701 -Dpackaging=jar -Dfile=/path/to/file

  Alternatively, if you host your own repository you can deploy the file there: 
      mvn deploy:deploy-file -DgroupId=org.apache.aries -DartifactId=org.apache.aries.util
-Dversion=0.1-r964701 -Dpackaging=jar -Dfile=/path/to/file -Durl=[url] -DrepositoryId=[id]

  Path to dependency: 
  	1) org.apache.activemq:activemq-karaf:bundle:5.4-SNAPSHOT
  	2) org.apache.karaf.shell:org.apache.karaf.shell.console:jar:1.99.0-SNAPSHOT
  	3) org.apache.aries.blueprint:org.apache.aries.blueprint:jar:0.1-r964701
  	4) org.apache.aries:org.apache.aries.util:jar:0.1-r964701

----------
1 required artifact is missing.

for artifact: 
  org.apache.activemq:activemq-karaf:bundle:5.4-SNAPSHOT

from the specified remote repositories:
  central (http://repo1.maven.org/maven2),
  com.springsource.repository.bundles.external (http://repository.springsource.com/maven/bundles/external),
  Nexus (http://repository.apache.org/snapshots)


	at org.apache.maven.lifecycle.DefaultLifecycleExecutor.executeGoals(DefaultLifecycleExecutor.java:576)
	at org.apache.maven.lifecycle.DefaultLifecycleExecutor.executeGoalWithLifecycle(DefaultLifecycleExecutor.java:500)
	at org.apache.maven.lifecycle.DefaultLifecycleExecutor.executeGoal(DefaultLifecycleExecutor.java:479)
	at org.apache.maven.lifecycle.DefaultLifecycleExecutor.executeGoalAndHandleFailures(DefaultLifecycleExecutor.java:331)
	at org.apache.maven.lifecycle.DefaultLifecycleExecutor.executeTaskSegments(DefaultLifecycleExecutor.java:292)
	at org.apache.maven.lifecycle.DefaultLifecycleExecutor.execute(DefaultLifecycleExecutor.java:142)
	at org.apache.maven.lifecycle.LifecycleExecutorInterceptor.execute(LifecycleExecutorInterceptor.java:65)
	at org.apache.maven.DefaultMaven.doExecute(DefaultMaven.java:336)
	at org.apache.maven.DefaultMaven.execute(DefaultMaven.java:129)
	at org.apache.maven.cli.MavenCli.main(MavenCli.java:301)
	at sun.reflect.NativeMethodAccessorImpl.invoke0(Native Method)
	at sun.reflect.NativeMethodAccessorImpl.invoke(NativeMethodAccessorImpl.java:39)
	at sun.reflect.DelegatingMethodAccessorImpl.invoke(DelegatingMethodAccessorImpl.java:25)
	at java.lang.reflect.Method.invoke(Method.java:592)
	at org.codehaus.classworlds.Launcher.launchEnhanced(Launcher.java:315)
	at org.codehaus.classworlds.Launcher.launch(Launcher.java:255)
	at hudson.maven.agent.Main.launch(Main.java:165)
	at hudson.maven.MavenBuilder.call(MavenBuilder.java:165)
	at hudson.maven.MavenModuleSetBuild$Builder.call(MavenModuleSetBuild.java:696)
	at hudson.maven.MavenModuleSetBuild$Builder.call(MavenModuleSetBuild.java:640)
	at hudson.remoting.UserRequest.perform(UserRequest.java:114)
	at hudson.remoting.UserRequest.perform(UserRequest.java:48)
	at hudson.remoting.Request$2.run(Request.java:270)
	at java.util.concurrent.Executors$RunnableAdapter.call(Executors.java:417)
	at java.util.concurrent.FutureTask$Sync.innerRun(FutureTask.java:269)
	at java.util.concurrent.FutureTask.run(FutureTask.java:123)
	at java.util.concurrent.ThreadPoolExecutor$Worker.runTask(ThreadPoolExecutor.java:651)
	at java.util.concurrent.ThreadPoolExecutor$Worker.run(ThreadPoolExecutor.java:676)
	at java.lang.Thread.run(Thread.java:595)
Caused by: org.apache.maven.artifact.resolver.MultipleArtifactsNotFoundException: Missing:
----------
1) org.apache.aries:org.apache.aries.util:jar:0.1-r964701

  Try downloading the file manually from the project website.

  Then, install it using the command: 
      mvn install:install-file -DgroupId=org.apache.aries -DartifactId=org.apache.aries.util
-Dversion=0.1-r964701 -Dpackaging=jar -Dfile=/path/to/file

  Alternatively, if you host your own repository you can deploy the file there: 
      mvn deploy:deploy-file -DgroupId=org.apache.aries -DartifactId=org.apache.aries.util
-Dversion=0.1-r964701 -Dpackaging=jar -Dfile=/path/to/file -Durl=[url] -DrepositoryId=[id]

  Path to dependency: 
  	1) org.apache.activemq:activemq-karaf:bundle:5.4-SNAPSHOT
  	2) org.apache.karaf.shell:org.apache.karaf.shell.console:jar:1.99.0-SNAPSHOT
  	3) org.apache.aries.blueprint:org.apache.aries.blueprint:jar:0.1-r964701
  	4) org.apache.aries:org.apache.aries.util:jar:0.1-r964701

----------
1 required artifact is missing.

for artifact: 
  org.apache.activemq:activemq-karaf:bundle:5.4-SNAPSHOT

from the specified remote repositories:
  central (http://repo1.maven.org/maven2),
  com.springsource.repository.bundles.external (http://repository.springsource.com/maven/bundles/external),
  Nexus (http://repository.apache.org/snapshots)


	at org.apache.maven.artifact.resolver.DefaultArtifactResolver.resolveTransitively(DefaultArtifactResolver.java:324)
	at org.apache.maven.artifact.resolver.DefaultArtifactResolver.resolveTransitively(DefaultArtifactResolver.java:288)
	at org.apache.maven.plugin.DefaultPluginManager.resolveTransitiveDependencies(DefaultPluginManager.java:1417)
	at org.apache.maven.plugin.DefaultPluginManager.executeMojo(DefaultPluginManager.java:407)
	at hudson.maven.agent.PluginManagerInterceptor.executeMojo(PluginManagerInterceptor.java:182)
	at org.apache.maven.lifecycle.DefaultLifecycleExecutor.executeGoals(DefaultLifecycleExecutor.java:559)
	... 28 more
[INFO] ------------------------------------------------------------------------
[INFO] BUILD ERRORS
[INFO] ------------------------------------------------------------------------
[INFO] Total time: 58 minutes 13 seconds
[INFO] Finished at: Fri Jul 23 04:41:51 UTC 2010
[INFO] Final Memory: 89M/1057M
[INFO] ------------------------------------------------------------------------
Waiting for Hudson to finish collecting data
Sending e-mails to: dev@activemq.apache.org
channel stopped


Mime
View raw message