activemq-dev mailing list archives

Site index · List index
Message view « Date » · « Thread »
Top « Date » · « Thread »
From Apache Hudson Server <hud...@hudson.zones.apache.org>
Subject Build failed in Hudson: ActiveMQ #414
Date Fri, 30 Jul 2010 05:18:23 GMT
See <http://hudson.zones.apache.org/hudson/job/ActiveMQ/414/changes>

Changes:

[gtully] resolve issue with kahaDB based variant of AMQ2149Test - revert http://svn.apache.org/viewvc?rev=958330&view=rev

[rajdavies] changes for https://issues.apache.org/activemq/browse/AMQ-2789 - message priority

------------------------------------------
[...truncated 12806 lines...]
[INFO] Unable to find resource 'org.apache.maven.shared:maven-shared-components:pom:6' in
repository apache.snapshots (https://repository.apache.org/content/repositories/snapshots/)
Downloading: http://download.java.net/maven/2/org/apache/maven/shared/maven-shared-components/6/maven-shared-components-6.pom
[INFO] Unable to find resource 'org.apache.maven.shared:maven-shared-components:pom:6' in
repository java.net.maven2 (http://download.java.net/maven/2)
Downloading: http://repository.springsource.com/maven/bundles/external/org/apache/maven/shared/maven-shared-components/6/maven-shared-components-6.pom
[INFO] Unable to find resource 'org.apache.maven.shared:maven-shared-components:pom:6' in
repository com.springsource.repository.bundles.external (http://repository.springsource.com/maven/bundles/external)
Downloading: http://repo1.maven.org/maven2/org/apache/maven/shared/maven-shared-components/6/maven-shared-components-6.pom

Downloading: http://repository.apache.org/snapshots/org/apache/maven/shared/maven-common-artifact-filters/1.1/maven-common-artifact-filters-1.1.jar
Downloading: http://repository.apache.org/snapshots/org/codehaus/plexus/plexus-interpolation/1.7/plexus-interpolation-1.7.jar
[INFO] Unable to find resource 'org.apache.maven.shared:maven-common-artifact-filters:jar:1.1'
in repository apache.snapshots (https://repository.apache.org/content/repositories/snapshots/)
[INFO] Unable to find resource 'org.codehaus.plexus:plexus-interpolation:jar:1.7' in repository
apache.snapshots (https://repository.apache.org/content/repositories/snapshots/)
Downloading: http://repo1.maven.org/maven2/org/apache/maven/shared/maven-common-artifact-filters/1.1/maven-common-artifact-filters-1.1.jar
Downloading: http://repo1.maven.org/maven2/org/codehaus/plexus/plexus-interpolation/1.7/plexus-interpolation-1.7.jar


Downloading: http://repository.apache.org/snapshots/org/codehaus/plexus/plexus-active-collections/1.0-beta-2/plexus-active-collections-1.0-beta-2.jar
[INFO] Unable to find resource 'org.codehaus.plexus:plexus-active-collections:jar:1.0-beta-2'
in repository apache.snapshots (https://repository.apache.org/content/repositories/snapshots/)
Downloading: http://repo1.maven.org/maven2/org/codehaus/plexus/plexus-active-collections/1.0-beta-2/plexus-active-collections-1.0-beta-2.jar

Downloading: http://repository.apache.org/snapshots/org/apache/maven/shared/maven-repository-builder/1.0-alpha-2/maven-repository-builder-1.0-alpha-2.jar
[INFO] Unable to find resource 'org.apache.maven.shared:maven-repository-builder:jar:1.0-alpha-2'
in repository apache.snapshots (https://repository.apache.org/content/repositories/snapshots/)
Downloading: http://repo1.maven.org/maven2/org/apache/maven/shared/maven-repository-builder/1.0-alpha-2/maven-repository-builder-1.0-alpha-2.jar

[INFO] [assembly:attached {execution: unix-bin}]
[INFO] Reading assembly descriptor: src/main/descriptors/unix-bin.xml
Downloading: http://repository.apache.org/snapshots/org/apache/activemq/protobuf/activemq-protobuf/1.1-SNAPSHOT/activemq-protobuf-1.1-SNAPSHOT.jar
[WARNING] Cannot include project artifact: org.apache.activemq:apache-activemq:pom:5.4-SNAPSHOT;
it doesn't have an associated file or directory.
Downloading: http://repository.apache.org/snapshots/org/apache/activemq/protobuf/activemq-protobuf/1.1-SNAPSHOT/activemq-protobuf-1.1-SNAPSHOT.jar
[WARNING] Cannot include project artifact: org.apache.activemq:apache-activemq:pom:5.4-SNAPSHOT;
it doesn't have an associated file or directory.
Downloading: http://repository.apache.org/snapshots/org/apache/activemq/protobuf/activemq-protobuf/1.1-SNAPSHOT/activemq-protobuf-1.1-SNAPSHOT.jar
[WARNING] Cannot include project artifact: org.apache.activemq:apache-activemq:pom:5.4-SNAPSHOT;
it doesn't have an associated file or directory.
Downloading: http://repository.apache.org/snapshots/org/apache/activemq/protobuf/activemq-protobuf/1.1-SNAPSHOT/activemq-protobuf-1.1-SNAPSHOT.jar
[WARNING] Cannot include project artifact: org.apache.activemq:apache-activemq:pom:5.4-SNAPSHOT;
it doesn't have an associated file or directory.
Downloading: http://repository.apache.org/snapshots/org/apache/activemq/protobuf/activemq-protobuf/1.1-SNAPSHOT/activemq-protobuf-1.1-SNAPSHOT.jar
[WARNING] Cannot include project artifact: org.apache.activemq:apache-activemq:pom:5.4-SNAPSHOT;
it doesn't have an associated file or directory.
Downloading: http://repository.apache.org/snapshots/org/apache/activemq/protobuf/activemq-protobuf/1.1-SNAPSHOT/activemq-protobuf-1.1-SNAPSHOT.jar
[WARNING] Cannot include project artifact: org.apache.activemq:apache-activemq:pom:5.4-SNAPSHOT;
it doesn't have an associated file or directory.
[INFO] apache-activemq-5.4-SNAPSHOT/webapps/admin/WEB-INF already added, skipping
[INFO] Building tar : <http://hudson.zones.apache.org/hudson/job/ActiveMQ/ws/trunk/assembly/target/apache-activemq-5.4-SNAPSHOT-bin.tar.gz>
[INFO] apache-activemq-5.4-SNAPSHOT/webapps/admin/WEB-INF already added, skipping
[INFO] [assembly:attached {execution: windows-bin}]
[INFO] Reading assembly descriptor: src/main/descriptors/windows-bin.xml
Downloading: http://repository.apache.org/snapshots/org/apache/activemq/protobuf/activemq-protobuf/1.1-SNAPSHOT/activemq-protobuf-1.1-SNAPSHOT.jar
[WARNING] Cannot include project artifact: org.apache.activemq:apache-activemq:pom:5.4-SNAPSHOT;
it doesn't have an associated file or directory.
Downloading: http://repository.apache.org/snapshots/org/apache/activemq/protobuf/activemq-protobuf/1.1-SNAPSHOT/activemq-protobuf-1.1-SNAPSHOT.jar
[WARNING] Cannot include project artifact: org.apache.activemq:apache-activemq:pom:5.4-SNAPSHOT;
it doesn't have an associated file or directory.
Downloading: http://repository.apache.org/snapshots/org/apache/activemq/protobuf/activemq-protobuf/1.1-SNAPSHOT/activemq-protobuf-1.1-SNAPSHOT.jar
[WARNING] Cannot include project artifact: org.apache.activemq:apache-activemq:pom:5.4-SNAPSHOT;
it doesn't have an associated file or directory.
Downloading: http://repository.apache.org/snapshots/org/apache/activemq/protobuf/activemq-protobuf/1.1-SNAPSHOT/activemq-protobuf-1.1-SNAPSHOT.jar
[WARNING] Cannot include project artifact: org.apache.activemq:apache-activemq:pom:5.4-SNAPSHOT;
it doesn't have an associated file or directory.
Downloading: http://repository.apache.org/snapshots/org/apache/activemq/protobuf/activemq-protobuf/1.1-SNAPSHOT/activemq-protobuf-1.1-SNAPSHOT.jar
[WARNING] Cannot include project artifact: org.apache.activemq:apache-activemq:pom:5.4-SNAPSHOT;
it doesn't have an associated file or directory.
Downloading: http://repository.apache.org/snapshots/org/apache/activemq/protobuf/activemq-protobuf/1.1-SNAPSHOT/activemq-protobuf-1.1-SNAPSHOT.jar
[WARNING] Cannot include project artifact: org.apache.activemq:apache-activemq:pom:5.4-SNAPSHOT;
it doesn't have an associated file or directory.
[INFO] apache-activemq-5.4-SNAPSHOT/webapps/admin/WEB-INF already added, skipping
[INFO] Building zip: <http://hudson.zones.apache.org/hudson/job/ActiveMQ/ws/trunk/assembly/target/apache-activemq-5.4-SNAPSHOT-bin.zip>
[INFO] apache-activemq-5.4-SNAPSHOT/webapps/admin/WEB-INF already added, skipping
[INFO] [ianal:verify-legal-files {execution: default}]
[INFO] Checking legal files in: apache-activemq-5.4-SNAPSHOT-bin.zip
[INFO] [install:install {execution: default-install}]
[INFO] Installing <http://hudson.zones.apache.org/hudson/job/ActiveMQ/ws/trunk/assembly/pom.xml>
to <http://hudson.zones.apache.org/hudson/job/ActiveMQ/ws/.repository/org/apache/activemq/apache-activemq/5.4-SNAPSHOT/apache-activemq-5.4-SNAPSHOT.pom>
[INFO] Installing <http://hudson.zones.apache.org/hudson/job/ActiveMQ/ws/trunk/assembly/target/apache-activemq-5.4-SNAPSHOT-bin.tar.gz>
to <http://hudson.zones.apache.org/hudson/job/ActiveMQ/ws/.repository/org/apache/activemq/apache-activemq/5.4-SNAPSHOT/apache-activemq-5.4-SNAPSHOT-bin.tar.gz>
[INFO] Installing <http://hudson.zones.apache.org/hudson/job/ActiveMQ/ws/trunk/assembly/target/apache-activemq-5.4-SNAPSHOT-bin.zip>
to <http://hudson.zones.apache.org/hudson/job/ActiveMQ/ws/.repository/org/apache/activemq/apache-activemq/5.4-SNAPSHOT/apache-activemq-5.4-SNAPSHOT-bin.zip>
[INFO] Preparing source:jar
Downloading: http://repository.apache.org/snapshots/org/apache/activemq/protobuf/activemq-protobuf/1.1-SNAPSHOT/activemq-protobuf-1.1-SNAPSHOT.jar
[HUDSON] Archiving <http://hudson.zones.apache.org/hudson/job/ActiveMQ/ws/trunk/assembly/pom.xml>
to /export/home/hudson/hudson/jobs/ActiveMQ/modules/org.apache.activemq$apache-activemq/builds/2010-07-30_00-45-21/archive/org.apache.activemq/apache-activemq/5.4-SNAPSHOT/pom.xml
[HUDSON] Archiving <http://hudson.zones.apache.org/hudson/job/ActiveMQ/ws/.repository/org/apache/activemq/apache-activemq/5.4-SNAPSHOT/apache-activemq-5.4-SNAPSHOT.pom>
to /export/home/hudson/hudson/jobs/ActiveMQ/modules/org.apache.activemq$apache-activemq/builds/2010-07-30_00-45-21/archive/org.apache.activemq/apache-activemq/5.4-SNAPSHOT/apache-activemq-5.4-SNAPSHOT.pom
[HUDSON] Archiving <http://hudson.zones.apache.org/hudson/job/ActiveMQ/ws/trunk/assembly/target/apache-activemq-5.4-SNAPSHOT-bin.tar.gz>
to /export/home/hudson/hudson/jobs/ActiveMQ/modules/org.apache.activemq$apache-activemq/builds/2010-07-30_00-45-21/archive/org.apache.activemq/apache-activemq/5.4-SNAPSHOT/apache-activemq-5.4-SNAPSHOT-bin.tar.gz
[HUDSON] Archiving <http://hudson.zones.apache.org/hudson/job/ActiveMQ/ws/trunk/assembly/target/apache-activemq-5.4-SNAPSHOT-bin.zip>
to /export/home/hudson/hudson/jobs/ActiveMQ/modules/org.apache.activemq$apache-activemq/builds/2010-07-30_00-45-21/archive/org.apache.activemq/apache-activemq/5.4-SNAPSHOT/apache-activemq-5.4-SNAPSHOT-bin.zip
[INFO] [enforcer:enforce {execution: default}]
[INFO] [bundle:cleanVersions {execution: cleanVersions}]
[INFO] [source:jar {execution: default-cli}]
[INFO] 
[INFO] 
[INFO] ------------------------------------------------------------------------
[INFO] Reactor Summary:
[INFO] ------------------------------------------------------------------------
[INFO] ActiveMQ .............................................. SUCCESS [4:53.274s]
[INFO] ActiveMQ :: KahaDB .................................... SUCCESS [1:00.561s]
[INFO] ActiveMQ :: JAAS ...................................... SUCCESS [1:23.813s]
[INFO] Openwire Generator .................................... SUCCESS [20.569s]
[INFO] ActiveMQ :: jmdns 1.0 ................................. SUCCESS [5.032s]
[INFO] ActiveMQ :: Core ...................................... SUCCESS [3:43:40.039s]
[INFO] ActiveMQ :: RA ........................................ SUCCESS [2:00.894s]
[INFO] ActiveMQ :: Pool ...................................... SUCCESS [40.643s]
[INFO] ActiveMQ :: Camel ..................................... SUCCESS [2:18.412s]
[INFO] ActiveMQ :: Console ................................... SUCCESS [18.531s]
[INFO] ActiveMQ :: Optional .................................. SUCCESS [5:05.001s]
[INFO] ActiveMQ :: Jar Bundle ................................ SUCCESS [49.805s]
[INFO] ActiveMQ :: File Server ............................... SUCCESS [31.040s]
[INFO] ActiveMQ :: Blueprint ................................. SUCCESS [28.136s]
[INFO] ActiveMQ :: Apache Karaf .............................. FAILED [2.358s]
[INFO] ActiveMQ :: RAR ....................................... SUCCESS [1:30.376s]
[INFO] ActiveMQ :: Run Jar ................................... SUCCESS [6.994s]
[INFO] ActiveMQ :: Spring .................................... SUCCESS [1:04.187s]
[INFO] ActiveMQ Tooling ...................................... SUCCESS [3.268s]
[INFO] ActiveMQ :: Memory Usage Test Plugin .................. SUCCESS [36.948s]
[INFO] ActiveMQ :: Performance Test Plugin ................... SUCCESS [10.410s]
[INFO] ActiveMQ :: StartUp Plugin ............................ SUCCESS [12.209s]
[INFO] ActiveMQ :: Web ....................................... SUCCESS [16.700s]
[INFO] ActiveMQ :: Web Demo .................................. SUCCESS [2:21.986s]
[INFO] ActiveMQ :: XMPP ...................................... SUCCESS [1:10.375s]
[INFO] ActiveMQ :: Web Console ............................... SUCCESS [3:07.642s]
[INFO] ActiveMQ :: Assembly .................................. SUCCESS [14:42.227s]
[INFO] ------------------------------------------------------------------------
[INFO] Error for project: ActiveMQ :: Apache Karaf (during source:jar)
[INFO] ------------------------------------------------------------------------
[INFO] Failed to resolve artifact.

Missing:
----------
1) org.apache.karaf.shell:org.apache.karaf.shell.console:jar:1.99.0-SNAPSHOT

  Try downloading the file manually from the project website.

  Then, install it using the command: 
      mvn install:install-file -DgroupId=org.apache.karaf.shell -DartifactId=org.apache.karaf.shell.console
-Dversion=1.99.0-20100719.140414-4 -Dpackaging=jar -Dfile=/path/to/file

  Alternatively, if you host your own repository you can deploy the file there: 
      mvn deploy:deploy-file -DgroupId=org.apache.karaf.shell -DartifactId=org.apache.karaf.shell.console
-Dversion=1.99.0-20100719.140414-4 -Dpackaging=jar -Dfile=/path/to/file -Durl=[url] -DrepositoryId=[id]

  Path to dependency: 
  	1) org.apache.activemq:activemq-karaf:bundle:5.4-SNAPSHOT
  	2) org.apache.karaf.shell:org.apache.karaf.shell.console:jar:1.99.0-SNAPSHOT

----------
1 required artifact is missing.

for artifact: 
  org.apache.activemq:activemq-karaf:bundle:5.4-SNAPSHOT

from the specified remote repositories:
  central (http://repo1.maven.org/maven2),
  com.springsource.repository.bundles.external (http://repository.springsource.com/maven/bundles/external),
  Nexus (http://repository.apache.org/snapshots)



[INFO] ------------------------------------------------------------------------
[INFO] Trace
org.apache.maven.lifecycle.LifecycleExecutionException: Missing:
----------
1) org.apache.karaf.shell:org.apache.karaf.shell.console:jar:1.99.0-SNAPSHOT

  Try downloading the file manually from the project website.

  Then, install it using the command: 
      mvn install:install-file -DgroupId=org.apache.karaf.shell -DartifactId=org.apache.karaf.shell.console
-Dversion=1.99.0-20100719.140414-4 -Dpackaging=jar -Dfile=/path/to/file

  Alternatively, if you host your own repository you can deploy the file there: 
      mvn deploy:deploy-file -DgroupId=org.apache.karaf.shell -DartifactId=org.apache.karaf.shell.console
-Dversion=1.99.0-20100719.140414-4 -Dpackaging=jar -Dfile=/path/to/file -Durl=[url] -DrepositoryId=[id]

  Path to dependency: 
  	1) org.apache.activemq:activemq-karaf:bundle:5.4-SNAPSHOT
  	2) org.apache.karaf.shell:org.apache.karaf.shell.console:jar:1.99.0-SNAPSHOT

----------
1 required artifact is missing.

for artifact: 
  org.apache.activemq:activemq-karaf:bundle:5.4-SNAPSHOT

from the specified remote repositories:
  central (http://repo1.maven.org/maven2),
  com.springsource.repository.bundles.external (http://repository.springsource.com/maven/bundles/external),
  Nexus (http://repository.apache.org/snapshots)


	at org.apache.maven.lifecycle.DefaultLifecycleExecutor.executeGoals(DefaultLifecycleExecutor.java:711)
	at org.apache.maven.lifecycle.DefaultLifecycleExecutor.executeGoalWithLifecycle(DefaultLifecycleExecutor.java:556)
	at org.apache.maven.lifecycle.DefaultLifecycleExecutor.forkProjectLifecycle(DefaultLifecycleExecutor.java:1205)
	at org.apache.maven.lifecycle.DefaultLifecycleExecutor.forkLifecycle(DefaultLifecycleExecutor.java:1038)
	at org.apache.maven.lifecycle.DefaultLifecycleExecutor.executeGoals(DefaultLifecycleExecutor.java:643)
	at org.apache.maven.lifecycle.DefaultLifecycleExecutor.executeStandaloneGoal(DefaultLifecycleExecutor.java:569)
	at org.apache.maven.lifecycle.DefaultLifecycleExecutor.executeGoal(DefaultLifecycleExecutor.java:539)
	at org.apache.maven.lifecycle.DefaultLifecycleExecutor.executeGoalAndHandleFailures(DefaultLifecycleExecutor.java:387)
	at org.apache.maven.lifecycle.DefaultLifecycleExecutor.executeTaskSegments(DefaultLifecycleExecutor.java:348)
	at org.apache.maven.lifecycle.DefaultLifecycleExecutor.execute(DefaultLifecycleExecutor.java:180)
	at org.apache.maven.lifecycle.LifecycleExecutorInterceptor.execute(LifecycleExecutorInterceptor.java:65)
	at org.apache.maven.DefaultMaven.doExecute(DefaultMaven.java:328)
	at org.apache.maven.DefaultMaven.execute(DefaultMaven.java:138)
	at org.apache.maven.cli.MavenCli.main(MavenCli.java:362)
	at sun.reflect.NativeMethodAccessorImpl.invoke0(Native Method)
	at sun.reflect.NativeMethodAccessorImpl.invoke(NativeMethodAccessorImpl.java:39)
	at sun.reflect.DelegatingMethodAccessorImpl.invoke(DelegatingMethodAccessorImpl.java:25)
	at java.lang.reflect.Method.invoke(Method.java:592)
	at org.codehaus.classworlds.Launcher.launchEnhanced(Launcher.java:315)
	at org.codehaus.classworlds.Launcher.launch(Launcher.java:255)
	at hudson.maven.agent.Main.launch(Main.java:165)
	at hudson.maven.MavenBuilder.call(MavenBuilder.java:165)
	at hudson.maven.MavenModuleSetBuild$Builder.call(MavenModuleSetBuild.java:696)
	at hudson.maven.MavenModuleSetBuild$Builder.call(MavenModuleSetBuild.java:640)
	at hudson.remoting.UserRequest.perform(UserRequest.java:114)
	at hudson.remoting.UserRequest.perform(UserRequest.java:48)
	at hudson.remoting.Request$2.run(Request.java:270)
	at java.util.concurrent.Executors$RunnableAdapter.call(Executors.java:417)
	at java.util.concurrent.FutureTask$Sync.innerRun(FutureTask.java:269)
	at java.util.concurrent.FutureTask.run(FutureTask.java:123)
	at java.util.concurrent.ThreadPoolExecutor$Worker.runTask(ThreadPoolExecutor.java:651)
	at java.util.concurrent.ThreadPoolExecutor$Worker.run(ThreadPoolExecutor.java:676)
	at java.lang.Thread.run(Thread.java:595)
Caused by: org.apache.maven.artifact.resolver.MultipleArtifactsNotFoundException: Missing:
----------
1) org.apache.karaf.shell:org.apache.karaf.shell.console:jar:1.99.0-SNAPSHOT

  Try downloading the file manually from the project website.

  Then, install it using the command: 
      mvn install:install-file -DgroupId=org.apache.karaf.shell -DartifactId=org.apache.karaf.shell.console
-Dversion=1.99.0-20100719.140414-4 -Dpackaging=jar -Dfile=/path/to/file

  Alternatively, if you host your own repository you can deploy the file there: 
      mvn deploy:deploy-file -DgroupId=org.apache.karaf.shell -DartifactId=org.apache.karaf.shell.console
-Dversion=1.99.0-20100719.140414-4 -Dpackaging=jar -Dfile=/path/to/file -Durl=[url] -DrepositoryId=[id]

  Path to dependency: 
  	1) org.apache.activemq:activemq-karaf:bundle:5.4-SNAPSHOT
  	2) org.apache.karaf.shell:org.apache.karaf.shell.console:jar:1.99.0-SNAPSHOT

----------
1 required artifact is missing.

for artifact: 
  org.apache.activemq:activemq-karaf:bundle:5.4-SNAPSHOT

from the specified remote repositories:
  central (http://repo1.maven.org/maven2),
  com.springsource.repository.bundles.external (http://repository.springsource.com/maven/bundles/external),
  Nexus (http://repository.apache.org/snapshots)


	at org.apache.maven.artifact.resolver.DefaultArtifactResolver.resolveTransitively(DefaultArtifactResolver.java:360)
	at org.apache.maven.artifact.resolver.DefaultArtifactResolver.resolveTransitively(DefaultArtifactResolver.java:304)
	at org.apache.maven.plugin.DefaultPluginManager.resolveTransitiveDependencies(DefaultPluginManager.java:1499)
	at org.apache.maven.plugin.DefaultPluginManager.executeMojo(DefaultPluginManager.java:442)
	at hudson.maven.agent.PluginManagerInterceptor.executeMojo(PluginManagerInterceptor.java:182)
	at org.apache.maven.lifecycle.DefaultLifecycleExecutor.executeGoals(DefaultLifecycleExecutor.java:694)
	... 32 more
[INFO] ------------------------------------------------------------------------
[INFO] BUILD ERRORS
[INFO] ------------------------------------------------------------------------
[INFO] Total time: 272 minutes 37 seconds
[INFO] Finished at: Fri Jul 30 05:18:14 UTC 2010
[INFO] Final Memory: 87M/1909M
[INFO] ------------------------------------------------------------------------
Sending e-mails to: dev@activemq.apache.org
Sending e-mails to: dev@activemq.apache.org
Sending e-mails to: dev@activemq.apache.org
channel stopped
[locks-and-latches] Releasing all the locks
[locks-and-latches] All the locks released


Mime
View raw message