activemq-dev mailing list archives

Site index · List index
Message view « Date » · « Thread »
Top « Date » · « Thread »
From Apache Hudson Server <hud...@hudson.zones.apache.org>
Subject Build failed in Hudson: ActiveMQ #399
Date Tue, 06 Jul 2010 06:05:43 GMT
See <http://hudson.zones.apache.org/hudson/job/ActiveMQ/399/changes>

Changes:

[rajdavies] synchronization around creation of preparedTransactions

[rajdavies] updated doc

[dejanb] https://issues.apache.org/activemq/browse/AMQ-2570 - osgifying web console

[rajdavies] remove unnecessary started flag

------------------------------------------
[...truncated 6130 lines...]
Tests run: 7, Failures: 0, Errors: 0, Skipped: 0, Time elapsed: 1.117 sec
Running org.apache.activemq.PerDestinationStoreLimitTest
Tests run: 2, Failures: 2, Errors: 0, Skipped: 0, Time elapsed: 43.478 sec <<< FAILURE!
Running org.apache.activemq.command.ActiveMQMessageTest
Tests run: 49, Failures: 0, Errors: 0, Skipped: 0, Time elapsed: 0.223 sec
Running org.apache.activemq.thread.PooledTaskRunnerTest
Tests run: 3, Failures: 0, Errors: 0, Skipped: 0, Time elapsed: 0.202 sec
Running org.apache.activemq.ActiveMQInputStreamTest
Tests run: 1, Failures: 0, Errors: 0, Skipped: 0, Time elapsed: 2.459 sec
Running org.apache.activemq.JmsQueueSendReceiveUsingTwoSessionsTest
Tests run: 1, Failures: 0, Errors: 0, Skipped: 0, Time elapsed: 1.722 sec
Running org.apache.activemq.transport.fanout.FanoutTransportBrokerTest
Tests run: 6, Failures: 0, Errors: 0, Skipped: 0, Time elapsed: 28.774 sec
Running org.apache.activemq.openwire.v2.ControlCommandTest
Tests run: 1, Failures: 0, Errors: 0, Skipped: 0, Time elapsed: 0.178 sec
Running org.apache.activemq.bugs.AMQ2413Test
Tests run: 8, Failures: 0, Errors: 0, Skipped: 0, Time elapsed: 168.798 sec
Running org.apache.activemq.transport.failover.FailoverUriTest
Tests run: 13, Failures: 0, Errors: 0, Skipped: 0, Time elapsed: 26.849 sec
Running org.apache.activemq.JmsRedeliveredTest
Tests run: 18, Failures: 0, Errors: 0, Skipped: 0, Time elapsed: 2.543 sec
Running org.apache.activemq.spring.Spring2XmlNamespacesWithoutRemoteSchemaTest
Tests run: 1, Failures: 0, Errors: 0, Skipped: 0, Time elapsed: 5.184 sec
Running org.apache.activemq.openwire.v2.ActiveMQMessageTest
Tests run: 1, Failures: 0, Errors: 0, Skipped: 0, Time elapsed: 0.213 sec
Running org.apache.activemq.broker.virtual.FilteredQueueTest
Tests run: 1, Failures: 0, Errors: 0, Skipped: 0, Time elapsed: 3.385 sec
Running org.apache.activemq.bugs.AMQ2571Test
Tests run: 1, Failures: 0, Errors: 0, Skipped: 0, Time elapsed: 1.589 sec
Running org.apache.activemq.transport.vm.VMTransportWaitForTest
Tests run: 1, Failures: 0, Errors: 0, Skipped: 0, Time elapsed: 4.52 sec
Running org.apache.activemq.usecases.MessageReroutingTest
Tests run: 2, Failures: 0, Errors: 0, Skipped: 0, Time elapsed: 18.333 sec
Running org.apache.activemq.openwire.v1.FlushCommandTest
Tests run: 1, Failures: 0, Errors: 0, Skipped: 0, Time elapsed: 0.165 sec
Running org.apache.activemq.openwire.v1.DataArrayResponseTest
Tests run: 1, Failures: 0, Errors: 0, Skipped: 0, Time elapsed: 0.196 sec
Running org.apache.activemq.openwire.v6.ConsumerControlTest
Tests run: 1, Failures: 0, Errors: 0, Skipped: 0, Time elapsed: 0.2 sec
Running org.apache.activemq.openwire.v3.XATransactionIdTest
Tests run: 1, Failures: 0, Errors: 0, Skipped: 0, Time elapsed: 0.178 sec
Running org.apache.activemq.openwire.v3.MessagePullTest
Tests run: 1, Failures: 0, Errors: 0, Skipped: 0, Time elapsed: 0.195 sec
Running org.apache.activemq.blob.FTPBlobDownloadStrategyTest
Tests run: 3, Failures: 0, Errors: 0, Skipped: 0, Time elapsed: 1.934 sec
Running org.apache.activemq.usecases.PublishOnTemporaryQueueConsumedMessageTest
Tests run: 1, Failures: 0, Errors: 0, Skipped: 0, Time elapsed: 1.779 sec
Running org.apache.activemq.transport.reliable.ReliableTransportTest
Tests run: 7, Failures: 0, Errors: 0, Skipped: 0, Time elapsed: 0.131 sec
Running org.apache.activemq.openwire.v5.ConnectionControlTest
Tests run: 1, Failures: 0, Errors: 0, Skipped: 0, Time elapsed: 0.175 sec
Running org.apache.activemq.openwire.v3.MessageDispatchNotificationTest
Tests run: 1, Failures: 0, Errors: 0, Skipped: 0, Time elapsed: 0.192 sec
Running org.apache.activemq.broker.message.security.MessageAuthenticationTest
Tests run: 1, Failures: 0, Errors: 0, Skipped: 0, Time elapsed: 0.68 sec
Running org.apache.activemq.network.NetworkRemovesSubscriptionsTest
Tests run: 5, Failures: 0, Errors: 0, Skipped: 0, Time elapsed: 28.775 sec
Running org.apache.activemq.xbean.ApplicationContextAwareTest
Tests run: 3, Failures: 0, Errors: 0, Skipped: 0, Time elapsed: 9.353 sec
Running org.apache.activemq.usecases.DurableSubscriptionReactivationTest
Tests run: 2, Failures: 0, Errors: 0, Skipped: 0, Time elapsed: 0.8 sec
Running org.apache.activemq.broker.ft.MasterSlaveSlaveDieTest
Tests run: 1, Failures: 0, Errors: 0, Skipped: 0, Time elapsed: 2.408 sec
Running org.apache.activemq.network.NetworkBrokerDetachTest
Tests run: 2, Failures: 0, Errors: 0, Skipped: 0, Time elapsed: 19.317 sec
Running org.apache.activemq.openwire.v2.JournalTopicAckTest
Tests run: 1, Failures: 0, Errors: 0, Skipped: 0, Time elapsed: 0.186 sec
Running org.apache.activemq.openwire.v1.ProducerInfoTest
Tests run: 1, Failures: 0, Errors: 0, Skipped: 0, Time elapsed: 0.189 sec
Running org.apache.activemq.transport.stomp.StompTest
Tests run: 47, Failures: 0, Errors: 0, Skipped: 0, Time elapsed: 126.629 sec
Running org.apache.activemq.test.TemporaryDestinationToFromNameTest
Tests run: 2, Failures: 0, Errors: 0, Skipped: 0, Time elapsed: 0.698 sec
Running org.apache.activemq.openwire.v3.ExceptionResponseTest
Tests run: 1, Failures: 0, Errors: 0, Skipped: 0, Time elapsed: 0.18 sec
Running org.apache.activemq.ExclusiveConsumerTest
Tests run: 6, Failures: 0, Errors: 0, Skipped: 0, Time elapsed: 2.743 sec
Running org.apache.activemq.store.kahadb.KahaDBTest
Tests run: 4, Failures: 0, Errors: 0, Skipped: 0, Time elapsed: 11.522 sec
Running org.apache.activemq.broker.region.group.MessageGroupMapTest
Tests run: 2, Failures: 0, Errors: 0, Skipped: 0, Time elapsed: 0.048 sec
Running org.apache.activemq.transport.tcp.SslTransportFactoryTest
Tests run: 2, Failures: 0, Errors: 0, Skipped: 0, Time elapsed: 0.768 sec
Running org.apache.activemq.store.jdbc.JDBCNegativeQueueTest
Tests run: 7, Failures: 0, Errors: 0, Skipped: 0, Time elapsed: 298.322 sec
Running org.apache.activemq.JMSQueueRedeliverTest
Tests run: 1, Failures: 0, Errors: 0, Skipped: 0, Time elapsed: 0.684 sec
Running org.apache.activemq.filter.BadDummyPolicyConfigTest
Tests run: 3, Failures: 0, Errors: 0, Skipped: 0, Time elapsed: 0.123 sec
Running org.apache.activemq.store.jdbc.JDBCPersistenceAdapterTest
Tests run: 2, Failures: 0, Errors: 0, Skipped: 0, Time elapsed: 3.148 sec
Running org.apache.activemq.bugs.MessageExpirationReaperTest
Tests run: 1, Failures: 0, Errors: 0, Skipped: 0, Time elapsed: 7.001 sec
Running org.apache.activemq.openwire.v1.ActiveMQStreamMessageTest
Tests run: 1, Failures: 0, Errors: 0, Skipped: 0, Time elapsed: 0.233 sec
Running org.apache.activemq.security.AuthorizationMapTest
Tests run: 2, Failures: 0, Errors: 0, Skipped: 0, Time elapsed: 0.065 sec
Running org.apache.activemq.openwire.v5.ConnectionIdTest
Tests run: 1, Failures: 0, Errors: 0, Skipped: 0, Time elapsed: 0.165 sec
Running org.apache.activemq.broker.SpringTest
Tests run: 1, Failures: 0, Errors: 0, Skipped: 0, Time elapsed: 2.071 sec
Running org.apache.activemq.openwire.v2.ActiveMQTempQueueTest
Tests run: 1, Failures: 0, Errors: 0, Skipped: 0, Time elapsed: 0.184 sec
Running org.apache.activemq.CreateConsumerButDontStartConnectionWarningTest
Tests run: 1, Failures: 0, Errors: 0, Skipped: 0, Time elapsed: 2.716 sec
Running org.apache.activemq.broker.CreateDestinationsOnStartupViaXBeanTest
Tests run: 1, Failures: 0, Errors: 0, Skipped: 0, Time elapsed: 2.683 sec
Running org.apache.activemq.usecases.NoDuplicateOnTopicNetworkTest
Tests run: 4, Failures: 0, Errors: 0, Skipped: 0, Time elapsed: 67.44 sec
Running org.apache.activemq.usecases.JDBCDurableSubscriptionTest
Tests run: 9, Failures: 0, Errors: 0, Skipped: 0, Time elapsed: 20.002 sec
Running org.apache.activemq.usecases.CompositePublishTest
Tests run: 1, Failures: 0, Errors: 0, Skipped: 0, Time elapsed: 63.154 sec
Running org.apache.activemq.openwire.v1.ActiveMQTempQueueTest
Tests run: 1, Failures: 0, Errors: 0, Skipped: 0, Time elapsed: 0.175 sec
Running org.apache.activemq.command.MessageTest
Tests run: 6, Failures: 0, Errors: 0, Skipped: 0, Time elapsed: 0.242 sec
Running org.apache.activemq.usage.MemoryUsageTest
Tests run: 2, Failures: 0, Errors: 0, Skipped: 0, Time elapsed: 0.149 sec
Running org.apache.activemq.test.rollback.CloseRollbackRedeliveryQueueTest
Tests run: 3, Failures: 0, Errors: 0, Skipped: 0, Time elapsed: 1.004 sec
Running org.apache.activemq.transport.tcp.SslBrokerServiceTest
Tests run: 131, Failures: 0, Errors: 0, Skipped: 0, Time elapsed: 649.263 sec
Running org.apache.activemq.openwire.v2.ConnectionErrorTest
Tests run: 1, Failures: 0, Errors: 0, Skipped: 0, Time elapsed: 0.177 sec
Running org.apache.activemq.usecases.StartAndStopClientAndBrokerDoesNotLeaveThreadsRunningTest
Tests run: 1, Failures: 0, Errors: 0, Skipped: 0, Time elapsed: 2.682 sec
Running org.apache.activemq.openwire.v2.ResponseTest
Tests run: 1, Failures: 0, Errors: 0, Skipped: 0, Time elapsed: 0.176 sec
Running org.apache.activemq.broker.region.cursors.StoreQueueCursorKahaDBNoDuplicateTest
Tests run: 1, Failures: 0, Errors: 0, Skipped: 0, Time elapsed: 0.81 sec
Running org.apache.activemq.test.message.NestedMapAndListPropertyTest
Tests run: 1, Failures: 0, Errors: 0, Skipped: 0, Time elapsed: 3.996 sec
Running org.apache.activemq.OnePrefetchAsyncConsumerTest
Tests run: 1, Failures: 0, Errors: 0, Skipped: 0, Time elapsed: 6.58 sec
Running org.apache.activemq.network.DemandForwardingBridgeTest
Tests run: 6, Failures: 0, Errors: 0, Skipped: 0, Time elapsed: 4.507 sec
Running org.apache.activemq.broker.scheduler.JobSchedulerStoreTest
Tests run: 1, Failures: 0, Errors: 0, Skipped: 0, Time elapsed: 1.897 sec
Running org.apache.activemq.command.MessageSendTest
Tests run: 2, Failures: 0, Errors: 0, Skipped: 0, Time elapsed: 0.196 sec
Running org.apache.activemq.openwire.v5.RemoveSubscriptionInfoTest
Tests run: 1, Failures: 0, Errors: 0, Skipped: 0, Time elapsed: 0.177 sec
Running org.apache.activemq.JmsClientAckListenerTest
Tests run: 2, Failures: 0, Errors: 0, Skipped: 0, Time elapsed: 21.779 sec
Running org.apache.activemq.bugs.AMQ2314Test
Tests run: 2, Failures: 0, Errors: 0, Skipped: 0, Time elapsed: 47.323 sec
Running org.apache.activemq.broker.DoubleSubscriptionTest
Tests run: 1, Failures: 0, Errors: 0, Skipped: 0, Time elapsed: 2.507 sec
Running org.apache.activemq.thread.TaskRunnerTest
Tests run: 2, Failures: 0, Errors: 0, Skipped: 0, Time elapsed: 0.589 sec
Running org.apache.activemq.openwire.v6.JournalQueueAckTest
Tests run: 1, Failures: 0, Errors: 0, Skipped: 0, Time elapsed: 0.188 sec
Running org.apache.activemq.JmsQueueCompositeSendReceiveTest
Tests run: 2, Failures: 0, Errors: 0, Skipped: 0, Time elapsed: 2.102 sec
Running org.apache.activemq.memory.buffer.SizeBasedMessageBufferTest
Tests run: 1, Failures: 0, Errors: 0, Skipped: 0, Time elapsed: 0.125 sec
Running org.apache.activemq.openwire.v2.ProducerInfoTest
Tests run: 1, Failures: 0, Errors: 0, Skipped: 0, Time elapsed: 0.192 sec
Running org.apache.activemq.openwire.v3.ConsumerControlTest
Tests run: 1, Failures: 0, Errors: 0, Skipped: 0, Time elapsed: 0.184 sec
Running org.apache.activemq.advisory.TempQueueMemoryTest
Tests run: 2, Failures: 0, Errors: 0, Skipped: 0, Time elapsed: 35.278 sec
Running org.apache.activemq.openwire.v3.JournalQueueAckTest
Tests run: 1, Failures: 0, Errors: 0, Skipped: 0, Time elapsed: 0.21 sec
Running org.apache.activemq.test.message.NestedMapMessageTest
Tests run: 1, Failures: 0, Errors: 0, Skipped: 0, Time elapsed: 3.784 sec
Running org.apache.activemq.openwire.v4.MessageDispatchTest
Tests run: 1, Failures: 0, Errors: 0, Skipped: 0, Time elapsed: 0.228 sec
Running org.apache.activemq.broker.policy.DestinationCursorConfigTest
Tests run: 2, Failures: 0, Errors: 0, Skipped: 0, Time elapsed: 1.502 sec
Running org.apache.activemq.transport.tcp.InactivityMonitorTest
Tests run: 3, Failures: 0, Errors: 0, Skipped: 0, Time elapsed: 14.276 sec
Running org.apache.activemq.ActiveMQConnectionFactoryTest
Tests run: 12, Failures: 0, Errors: 0, Skipped: 0, Time elapsed: 8.236 sec
Running org.apache.activemq.openwire.v1.ShutdownInfoTest
Tests run: 1, Failures: 0, Errors: 0, Skipped: 0, Time elapsed: 0.191 sec
Running org.apache.activemq.openwire.v2.MessageDispatchTest
Tests run: 1, Failures: 0, Errors: 0, Skipped: 0, Time elapsed: 0.259 sec
Running org.apache.activemq.usecases.StartAndStopBrokerTest
Tests run: 1, Failures: 0, Errors: 0, Skipped: 0, Time elapsed: 6.334 sec
Running org.apache.activemq.openwire.v3.MessageAckTest
Tests run: 1, Failures: 0, Errors: 0, Skipped: 0, Time elapsed: 0.192 sec
Running org.apache.activemq.store.kahadb.KahaDBStoreOrderTest
Tests run: 1, Failures: 0, Errors: 0, Skipped: 0, Time elapsed: 2.12 sec
Running org.apache.activemq.filter.DestinationFilterTest
Tests run: 3, Failures: 0, Errors: 0, Skipped: 0, Time elapsed: 0.056 sec
Running org.apache.activemq.broker.ft.JDBCQueueMasterSlaveTest
Tests run: 1, Failures: 0, Errors: 0, Skipped: 0, Time elapsed: 21.269 sec
Running org.apache.activemq.openwire.v1.RemoveInfoTest
Tests run: 1, Failures: 0, Errors: 0, Skipped: 0, Time elapsed: 0.183 sec
Running org.apache.activemq.openwire.v3.TransactionInfoTest
Tests run: 1, Failures: 0, Errors: 0, Skipped: 0, Time elapsed: 0.181 sec
Running org.apache.activemq.transport.failover.FailoverUpdateURIsTest
Tests run: 1, Failures: 0, Errors: 0, Skipped: 0, Time elapsed: 4.662 sec
Running org.apache.activemq.usecases.ThreeBrokerQueueNetworkTest
Tests run: 13, Failures: 0, Errors: 0, Skipped: 0, Time elapsed: 180.807 sec
Running org.apache.activemq.bugs.ConnectionPerMessageTest
Tests run: 1, Failures: 0, Errors: 0, Skipped: 0, Time elapsed: 18.651 sec
Running org.apache.activemq.command.ActiveMQStreamMessageTest
Tests run: 18, Failures: 0, Errors: 0, Skipped: 0, Time elapsed: 0.44 sec
Running org.apache.activemq.openwire.v5.RemoveInfoTest
Tests run: 1, Failures: 0, Errors: 0, Skipped: 0, Time elapsed: 0.182 sec
Running org.apache.activemq.usecases.TwoMulticastDiscoveryBrokerTopicSendReceiveTest
Tests run: 1, Failures: 0, Errors: 0, Skipped: 0, Time elapsed: 20.004 sec
Running org.apache.activemq.broker.policy.StrictOrderDispatchPolicyTest
Tests run: 8, Failures: 0, Errors: 0, Skipped: 0, Time elapsed: 7.843 sec
Running org.apache.activemq.broker.virtual.VirtualTopicPubSubUsingXBeanTest
Tests run: 2, Failures: 0, Errors: 0, Skipped: 0, Time elapsed: 1.054 sec
Running org.apache.activemq.openwire.v3.DiscoveryEventTest
Tests run: 1, Failures: 0, Errors: 0, Skipped: 0, Time elapsed: 0.173 sec
Running org.apache.activemq.openwire.v3.DataResponseTest
Tests run: 1, Failures: 0, Errors: 0, Skipped: 0, Time elapsed: 0.185 sec
Running org.apache.activemq.broker.region.QueuePurgeTest
Build timed out. Aborting
[locks-and-latches] Releasing all the locks
[locks-and-latches] All the locks released
ERROR: Failed to parse POMs
hudson.remoting.ChannelClosedException: channel is already closed
	at hudson.remoting.Channel.send(Channel.java:412)
	at hudson.remoting.ProxyOutputStream.write(ProxyOutputStream.java:112)
	at hudson.remoting.ProxyOutputStream.write(ProxyOutputStream.java:100)
	at hudson.remoting.RemoteOutputStream.write(RemoteOutputStream.java:110)
	at java.io.BufferedOutputStream.flushBuffer(BufferedOutputStream.java:65)
	at java.io.BufferedOutputStream.flush(BufferedOutputStream.java:123)
	at java.io.BufferedOutputStream.flush(BufferedOutputStream.java:124)
	at java.io.ObjectOutputStream$BlockDataOutputStream.flush(ObjectOutputStream.java:1784)
	at java.io.ObjectOutputStream.flush(ObjectOutputStream.java:691)
	at hudson.remoting.Channel.send(Channel.java:418)
	at hudson.remoting.Request.call(Request.java:149)
	at hudson.remoting.Channel.call(Channel.java:555)
	at hudson.maven.ProcessCache$MavenProcess.call(ProcessCache.java:156)
	at hudson.maven.MavenModuleSetBuild$RunnerImpl.doRun(MavenModuleSetBuild.java:483)
	at hudson.model.AbstractBuild$AbstractRunner.run(AbstractBuild.java:416)
	at hudson.model.Run.run(Run.java:1257)
	at hudson.maven.MavenModuleSetBuild.run(MavenModuleSetBuild.java:306)
	at hudson.model.ResourceController.execute(ResourceController.java:88)
	at hudson.model.Executor.run(Executor.java:127)
FATAL: channel is already closed
hudson.remoting.ChannelClosedException: channel is already closed
	at hudson.remoting.Channel.send(Channel.java:412)
	at hudson.remoting.Request.call(Request.java:105)
	at hudson.remoting.Channel.call(Channel.java:555)
	at hudson.Launcher$RemoteLauncher.kill(Launcher.java:744)
	at hudson.model.AbstractBuild$AbstractRunner.run(AbstractBuild.java:421)
	at hudson.model.Run.run(Run.java:1257)
	at hudson.maven.MavenModuleSetBuild.run(MavenModuleSetBuild.java:306)
	at hudson.model.ResourceController.execute(ResourceController.java:88)
	at hudson.model.Executor.run(Executor.java:127)


Mime
View raw message