activemq-dev mailing list archives

Site index · List index
Message view « Date » · « Thread »
Top « Date » · « Thread »
From Apache Hudson Server <hud...@hudson.zones.apache.org>
Subject Build failed in Hudson: ActiveMQ-Trunk-Deploy #74
Date Wed, 16 Jun 2010 03:18:16 GMT
See <http://hudson.zones.apache.org/hudson/job/ActiveMQ-Trunk-Deploy/74/changes>

Changes:

[rajdavies] Transactions dispatch and commit to the store asynchronously, though the commit
only returns to the producer when they both complete for KahaDB

[gtully] resolve https://issues.apache.org/activemq/browse/AMQ-2765 - rework fix for https://issues.apache.org/activemq/browse/AMQ-2772
- each consumer needs to indicate when interuption processing is complete. till there is a
need to do other wise, the connection consumers (used by the RA managed connection) immediatly
allow redelivery

[dejanb] https://issues.apache.org/activemq/browse/AMQ-2770 - durable subscription mbean

------------------------------------------
[...truncated 6511 lines...]
[INFO] [resources:resources]
[INFO] Using 'UTF-8' encoding to copy filtered resources.
[INFO] Copying 1 resource
[INFO] Copying 3 resources
[INFO] [compiler:compile]
[INFO] No sources to compile
[INFO] [resources:testResources]
[INFO] Using 'UTF-8' encoding to copy filtered resources.
[INFO] skip non existing resourceDirectory <http://hudson.zones.apache.org/hudson/job/ActiveMQ-Trunk-Deploy/ws/trunk/activemq-karaf/src/test/resources>
[INFO] Copying 3 resources
[INFO] [compiler:testCompile]
[INFO] No sources to compile
[INFO] [surefire:test]
[INFO] Surefire report directory: <http://hudson.zones.apache.org/hudson/job/ActiveMQ-Trunk-Deploy/ws/trunk/activemq-karaf/target/surefire-reports>

-------------------------------------------------------
 T E S T S
-------------------------------------------------------
There are no tests to run.

Results :

Tests run: 0, Failures: 0, Errors: 0, Skipped: 0

[HUDSON] Recording test results
[INFO] [jar:jar]
[INFO] Building jar: <http://hudson.zones.apache.org/hudson/job/ActiveMQ-Trunk-Deploy/ws/trunk/activemq-karaf/target/activemq-karaf-5.4-SNAPSHOT.jar>
[INFO] Preparing source:jar
[WARNING] Removing: jar from forked lifecycle, to prevent recursive invocation.
[HUDSON] Archiving <http://hudson.zones.apache.org/hudson/job/ActiveMQ-Trunk-Deploy/ws/trunk/activemq-karaf/pom.xml>
to /export/home/hudson/hudson/jobs/ActiveMQ-Trunk-Deploy/modules/org.apache.activemq$activemq-karaf/builds/2010-06-16_03-01-51/archive/org.apache.activemq/activemq-karaf/5.4-SNAPSHOT/pom.xml
[HUDSON] Archiving <http://hudson.zones.apache.org/hudson/job/ActiveMQ-Trunk-Deploy/ws/trunk/activemq-karaf/target/activemq-karaf-5.4-SNAPSHOT.jar>
to /export/home/hudson/hudson/jobs/ActiveMQ-Trunk-Deploy/modules/org.apache.activemq$activemq-karaf/builds/2010-06-16_03-01-51/archive/org.apache.activemq/activemq-karaf/5.4-SNAPSHOT/activemq-karaf-5.4-SNAPSHOT.jar
[INFO] [enforcer:enforce {execution: default}]
[INFO] [bundle:cleanVersions {execution: cleanVersions}]
[INFO] [source:jar {execution: attach-sources}]
[INFO] Building jar: <http://hudson.zones.apache.org/hudson/job/ActiveMQ-Trunk-Deploy/ws/trunk/activemq-karaf/target/activemq-karaf-5.4-SNAPSHOT-sources.jar>
[INFO] [javadoc:jar {execution: attach-javadocs}]
Downloading: https://repository.apache.org/content/repositories/snapshots//org/apache/maven/maven-project/2.0.2/maven-project-2.0.2.pom
Downloading: http://repo1.maven.org/maven2/org/apache/maven/maven-project/2.0.2/maven-project-2.0.2.pom
Downloading: https://repository.apache.org/content/repositories/snapshots//org/apache/maven/maven-profile/2.0.2/maven-profile-2.0.2.pom
Downloading: http://repository.springsource.com/maven/bundles/external/org/apache/maven/maven-profile/2.0.2/maven-profile-2.0.2.pom
Downloading: http://repo1.maven.org/maven2/org/apache/maven/maven-profile/2.0.2/maven-profile-2.0.2.pom
Downloading: https://repository.apache.org/content/repositories/snapshots//org/apache/maven/maven-model/2.0.2/maven-model-2.0.2.pom
Downloading: http://repository.springsource.com/maven/bundles/external/org/apache/maven/maven-model/2.0.2/maven-model-2.0.2.pom
Downloading: http://repo1.maven.org/maven2/org/apache/maven/maven-model/2.0.2/maven-model-2.0.2.pom
Downloading: https://repository.apache.org/content/repositories/snapshots//org/apache/maven/maven-repository-metadata/2.0.2/maven-repository-metadata-2.0.2.pom
Downloading: http://repository.springsource.com/maven/bundles/external/org/apache/maven/maven-repository-metadata/2.0.2/maven-repository-metadata-2.0.2.pom
Downloading: http://repo1.maven.org/maven2/org/apache/maven/maven-repository-metadata/2.0.2/maven-repository-metadata-2.0.2.pom
[INFO] [build-helper:attach-artifact {execution: attach-artifacts}]
[INFO] [ianal:verify-legal-files {execution: default}]
[INFO] Checking legal files in: activemq-karaf-5.4-SNAPSHOT.jar
[INFO] Checking legal files in: activemq-karaf-5.4-SNAPSHOT-sources.jar
[INFO] [install:install]
[INFO] Installing <http://hudson.zones.apache.org/hudson/job/ActiveMQ-Trunk-Deploy/ws/trunk/activemq-karaf/target/activemq-karaf-5.4-SNAPSHOT.jar>
to <http://hudson.zones.apache.org/hudson/job/ActiveMQ-Trunk-Deploy/ws/.repository/org/apache/activemq/activemq-karaf/5.4-SNAPSHOT/activemq-karaf-5.4-SNAPSHOT.jar>
[INFO] Installing <http://hudson.zones.apache.org/hudson/job/ActiveMQ-Trunk-Deploy/ws/trunk/activemq-karaf/target/activemq-karaf-5.4-SNAPSHOT-sources.jar>
to <http://hudson.zones.apache.org/hudson/job/ActiveMQ-Trunk-Deploy/ws/.repository/org/apache/activemq/activemq-karaf/5.4-SNAPSHOT/activemq-karaf-5.4-SNAPSHOT-sources.jar>
[INFO] Installing <http://hudson.zones.apache.org/hudson/job/ActiveMQ-Trunk-Deploy/ws/trunk/activemq-karaf/target/classes/features.xml>
to <http://hudson.zones.apache.org/hudson/job/ActiveMQ-Trunk-Deploy/ws/.repository/org/apache/activemq/activemq-karaf/5.4-SNAPSHOT/activemq-karaf-5.4-SNAPSHOT-features.xml>
[INFO] [deploy:deploy]
[INFO] Retrieving previous build number from apache.snapshots.https
Uploading: https://repository.apache.org/content/repositories/snapshots/org/apache/activemq/activemq-karaf/5.4-SNAPSHOT/activemq-karaf-5.4-SNAPSHOT.jar
7K uploaded
[INFO] Retrieving previous metadata from apache.snapshots.https
[INFO] Uploading repository metadata for: 'artifact org.apache.activemq:activemq-karaf'
[INFO] Retrieving previous metadata from apache.snapshots.https
[INFO] Uploading repository metadata for: 'snapshot org.apache.activemq:activemq-karaf:5.4-SNAPSHOT'
[INFO] Uploading project information for activemq-karaf 5.4-SNAPSHOT
[INFO] Retrieving previous build number from apache.snapshots.https
Uploading: https://repository.apache.org/content/repositories/snapshots/org/apache/activemq/activemq-karaf/5.4-SNAPSHOT/activemq-karaf-5.4-SNAPSHOT-sources.jar
5K uploaded
[INFO] Retrieving previous build number from apache.snapshots.https
Uploading: https://repository.apache.org/content/repositories/snapshots/org/apache/activemq/activemq-karaf/5.4-SNAPSHOT/activemq-karaf-5.4-SNAPSHOT-features.xml
3K uploaded
[HUDSON] Archiving <http://hudson.zones.apache.org/hudson/job/ActiveMQ-Trunk-Deploy/ws/trunk/activemq-karaf/target/activemq-karaf-5.4-SNAPSHOT-sources.jar>
to /export/home/hudson/hudson/jobs/ActiveMQ-Trunk-Deploy/modules/org.apache.activemq$activemq-karaf/builds/2010-06-16_03-01-51/archive/org.apache.activemq/activemq-karaf/5.4-SNAPSHOT/activemq-karaf-5.4-SNAPSHOT-sources.jar
[HUDSON] Archiving <http://hudson.zones.apache.org/hudson/job/ActiveMQ-Trunk-Deploy/ws/trunk/activemq-karaf/target/classes/features.xml>
to /export/home/hudson/hudson/jobs/ActiveMQ-Trunk-Deploy/modules/org.apache.activemq$activemq-karaf/builds/2010-06-16_03-01-51/archive/org.apache.activemq/activemq-karaf/5.4-SNAPSHOT/features.xml
[INFO] ------------------------------------------------------------------------
[INFO] SKIPPING ActiveMQ :: RAR
[INFO]    task-segment: [clean, deploy]
[INFO] This project has been banned from further executions due to previous failures.
[INFO] ------------------------------------------------------------------------
[INFO] ------------------------------------------------------------------------
[INFO] SKIPPING ActiveMQ :: Run Jar
[INFO]    task-segment: [clean, deploy]
[INFO] This project has been banned from further executions due to previous failures.
[INFO] ------------------------------------------------------------------------
[INFO] ------------------------------------------------------------------------
[INFO] SKIPPING ActiveMQ :: Spring
[INFO]    task-segment: [clean, deploy]
[INFO] This project has been banned from further executions due to previous failures.
[INFO] ------------------------------------------------------------------------
[INFO] ------------------------------------------------------------------------
[INFO] Building ActiveMQ Tooling
[INFO]    task-segment: [clean, deploy]
[INFO] ------------------------------------------------------------------------
[INFO] [clean:clean]
[INFO] [enforcer:enforce {execution: default}]
[INFO] [bundle:cleanVersions {execution: cleanVersions}]
[INFO] [remote-resources:process {execution: default}]
[INFO] [site:attach-descriptor]
[INFO] Preparing source:jar
[WARNING] Removing: jar from forked lifecycle, to prevent recursive invocation.
[HUDSON] Archiving <http://hudson.zones.apache.org/hudson/job/ActiveMQ-Trunk-Deploy/ws/trunk/activemq-tooling/pom.xml>
to /export/home/hudson/hudson/jobs/ActiveMQ-Trunk-Deploy/modules/org.apache.activemq.tooling$activemq-tooling/builds/2010-06-16_03-01-52/archive/org.apache.activemq.tooling/activemq-tooling/5.4-SNAPSHOT/pom.xml
[INFO] [enforcer:enforce {execution: default}]
[INFO] [bundle:cleanVersions {execution: cleanVersions}]
[INFO] [source:jar {execution: attach-sources}]
[INFO] [javadoc:jar {execution: attach-javadocs}]
[INFO] Not executing Javadoc as the project is not a Java classpath-capable package
[INFO] [ianal:verify-legal-files {execution: default}]
[INFO] [install:install]
[INFO] Installing <http://hudson.zones.apache.org/hudson/job/ActiveMQ-Trunk-Deploy/ws/trunk/activemq-tooling/pom.xml>
to <http://hudson.zones.apache.org/hudson/job/ActiveMQ-Trunk-Deploy/ws/.repository/org/apache/activemq/tooling/activemq-tooling/5.4-SNAPSHOT/activemq-tooling-5.4-SNAPSHOT.pom>
[INFO] [deploy:deploy]
[INFO] Retrieving previous build number from apache.snapshots.https
Uploading: https://repository.apache.org/content/repositories/snapshots/org/apache/activemq/tooling/activemq-tooling/5.4-SNAPSHOT/activemq-tooling-5.4-SNAPSHOT.pom
1K uploaded
[INFO] Retrieving previous metadata from apache.snapshots.https
[INFO] Uploading repository metadata for: 'artifact org.apache.activemq.tooling:activemq-tooling'
[INFO] Retrieving previous metadata from apache.snapshots.https
[INFO] Uploading repository metadata for: 'snapshot org.apache.activemq.tooling:activemq-tooling:5.4-SNAPSHOT'
[INFO] ------------------------------------------------------------------------
[INFO] SKIPPING ActiveMQ :: Memory Usage Test Plugin
[INFO]    task-segment: [clean, deploy]
[INFO] This project has been banned from further executions due to previous failures.
[INFO] ------------------------------------------------------------------------
[INFO] ------------------------------------------------------------------------
[INFO] SKIPPING ActiveMQ :: Performance Test Plugin
[INFO]    task-segment: [clean, deploy]
[INFO] This project has been banned from further executions due to previous failures.
[INFO] ------------------------------------------------------------------------
[INFO] ------------------------------------------------------------------------
[INFO] SKIPPING ActiveMQ :: StartUp Plugin
[INFO]    task-segment: [clean, deploy]
[INFO] This project has been banned from further executions due to previous failures.
[INFO] ------------------------------------------------------------------------
[INFO] ------------------------------------------------------------------------
[INFO] SKIPPING ActiveMQ :: Web
[INFO]    task-segment: [clean, deploy]
[INFO] This project has been banned from further executions due to previous failures.
[INFO] ------------------------------------------------------------------------
[INFO] ------------------------------------------------------------------------
[INFO] SKIPPING ActiveMQ :: Web Demo
[INFO]    task-segment: [clean, deploy]
[INFO] This project has been banned from further executions due to previous failures.
[INFO] ------------------------------------------------------------------------
[INFO] ------------------------------------------------------------------------
[INFO] SKIPPING ActiveMQ :: XMPP
[INFO]    task-segment: [clean, deploy]
[INFO] This project has been banned from further executions due to previous failures.
[INFO] ------------------------------------------------------------------------
[INFO] ------------------------------------------------------------------------
[INFO] SKIPPING ActiveMQ :: Web Console
[INFO]    task-segment: [clean, deploy]
[INFO] This project has been banned from further executions due to previous failures.
[INFO] ------------------------------------------------------------------------
[INFO] ------------------------------------------------------------------------
[INFO] SKIPPING ActiveMQ :: Assembly
[INFO]    task-segment: [clean, deploy]
[INFO] This project has been banned from further executions due to previous failures.
[INFO] ------------------------------------------------------------------------
[INFO] 
[INFO] 
[INFO] ------------------------------------------------------------------------
[INFO] Reactor Summary:
[INFO] ------------------------------------------------------------------------
[INFO] ActiveMQ .............................................. SUCCESS [7:01.935s]
[INFO] ActiveMQ :: KahaDB .................................... SUCCESS [2:07.263s]
[INFO] ActiveMQ :: JAAS ...................................... SUCCESS [1:45.825s]
[INFO] Openwire Generator .................................... SUCCESS [46.926s]
[INFO] ActiveMQ :: jmdns 1.0 ................................. SUCCESS [25.981s]
[INFO] ActiveMQ :: Core ...................................... FAILED [2:41.282s]
[INFO] ActiveMQ :: RA ........................................ SKIPPED (dependency build failed
or was skipped)
[INFO] ActiveMQ :: Pool ...................................... SKIPPED (dependency build failed
or was skipped)
[INFO] ActiveMQ :: Camel ..................................... SKIPPED (dependency build failed
or was skipped)
[INFO] ActiveMQ :: Console ................................... SKIPPED (dependency build failed
or was skipped)
[INFO] ActiveMQ :: Optional .................................. SKIPPED (dependency build failed
or was skipped)
[INFO] ActiveMQ :: Jar Bundle ................................ SKIPPED (dependency build failed
or was skipped)
[INFO] ActiveMQ :: File Server ............................... SKIPPED (dependency build failed
or was skipped)
[INFO] ActiveMQ :: Blueprint ................................. SUCCESS [39.335s]
[INFO] ActiveMQ :: Apache Karaf .............................. SUCCESS [16.723s]
[INFO] ActiveMQ :: RAR ....................................... SKIPPED (dependency build failed
or was skipped)
[INFO] ActiveMQ :: Run Jar ................................... SKIPPED (dependency build failed
or was skipped)
[INFO] ActiveMQ :: Spring .................................... SKIPPED (dependency build failed
or was skipped)
[INFO] ActiveMQ Tooling ...................................... SUCCESS [4.471s]
[INFO] ActiveMQ :: Memory Usage Test Plugin .................. SKIPPED (dependency build failed
or was skipped)
[INFO] ActiveMQ :: Performance Test Plugin ................... SKIPPED (dependency build failed
or was skipped)
[INFO] ActiveMQ :: StartUp Plugin ............................ SKIPPED (dependency build failed
or was skipped)
[INFO] ActiveMQ :: Web ....................................... SKIPPED (dependency build failed
or was skipped)
[INFO] ActiveMQ :: Web Demo .................................. SKIPPED (dependency build failed
or was skipped)
[INFO] ActiveMQ :: XMPP ...................................... SKIPPED (dependency build failed
or was skipped)
[INFO] ActiveMQ :: Web Console ............................... SKIPPED (dependency build failed
or was skipped)
[INFO] ActiveMQ :: Assembly .................................. SKIPPED (dependency build failed
or was skipped)
[INFO] ------------------------------------------------------------------------
[INFO] Error for project: ActiveMQ :: Core (during deploy)
[INFO] ------------------------------------------------------------------------
[INFO] Compilation failure

<http://hudson.zones.apache.org/hudson/job/ActiveMQ-Trunk-Deploy/ws/trunk/activemq-core/src/main/java/org/apache/activemq/store/kahadb/KahaDBTransactionStore.java>:[237,69]
cannot find symbol
symbol  : constructor IOException(java.lang.InterruptedException)
location: class java.io.IOException

<http://hudson.zones.apache.org/hudson/job/ActiveMQ-Trunk-Deploy/ws/trunk/activemq-core/src/main/java/org/apache/activemq/store/kahadb/KahaDBTransactionStore.java>:[239,69]
cannot find symbol
symbol  : constructor IOException(java.util.concurrent.ExecutionException)
location: class java.io.IOException


[INFO] ------------------------------------------------------------------------
[INFO] Trace
org.apache.maven.BuildFailureException: Compilation failure
	at org.apache.maven.lifecycle.DefaultLifecycleExecutor.executeGoals(DefaultLifecycleExecutor.java:580)
	at org.apache.maven.lifecycle.DefaultLifecycleExecutor.executeGoalWithLifecycle(DefaultLifecycleExecutor.java:500)
	at org.apache.maven.lifecycle.DefaultLifecycleExecutor.executeGoal(DefaultLifecycleExecutor.java:479)
	at org.apache.maven.lifecycle.DefaultLifecycleExecutor.executeGoalAndHandleFailures(DefaultLifecycleExecutor.java:331)
	at org.apache.maven.lifecycle.DefaultLifecycleExecutor.executeTaskSegments(DefaultLifecycleExecutor.java:292)
	at org.apache.maven.lifecycle.DefaultLifecycleExecutor.execute(DefaultLifecycleExecutor.java:142)
	at org.apache.maven.lifecycle.LifecycleExecutorInterceptor.execute(LifecycleExecutorInterceptor.java:65)
	at org.apache.maven.DefaultMaven.doExecute(DefaultMaven.java:336)
	at org.apache.maven.DefaultMaven.execute(DefaultMaven.java:129)
	at org.apache.maven.cli.MavenCli.main(MavenCli.java:301)
	at sun.reflect.NativeMethodAccessorImpl.invoke0(Native Method)
	at sun.reflect.NativeMethodAccessorImpl.invoke(NativeMethodAccessorImpl.java:39)
	at sun.reflect.DelegatingMethodAccessorImpl.invoke(DelegatingMethodAccessorImpl.java:25)
	at java.lang.reflect.Method.invoke(Method.java:592)
	at org.codehaus.classworlds.Launcher.launchEnhanced(Launcher.java:315)
	at org.codehaus.classworlds.Launcher.launch(Launcher.java:255)
	at hudson.maven.agent.Main.launch(Main.java:165)
	at hudson.maven.MavenBuilder.call(MavenBuilder.java:159)
	at hudson.maven.MavenModuleSetBuild$Builder.call(MavenModuleSetBuild.java:688)
	at hudson.maven.MavenModuleSetBuild$Builder.call(MavenModuleSetBuild.java:632)
	at hudson.remoting.UserRequest.perform(UserRequest.java:114)
	at hudson.remoting.UserRequest.perform(UserRequest.java:48)
	at hudson.remoting.Request$2.run(Request.java:270)
	at java.util.concurrent.Executors$RunnableAdapter.call(Executors.java:417)
	at java.util.concurrent.FutureTask$Sync.innerRun(FutureTask.java:269)
	at java.util.concurrent.FutureTask.run(FutureTask.java:123)
	at java.util.concurrent.ThreadPoolExecutor$Worker.runTask(ThreadPoolExecutor.java:651)
	at java.util.concurrent.ThreadPoolExecutor$Worker.run(ThreadPoolExecutor.java:676)
	at java.lang.Thread.run(Thread.java:595)
Caused by: org.apache.maven.plugin.CompilationFailureException: Compilation failure
	at org.apache.maven.plugin.AbstractCompilerMojo.execute(AbstractCompilerMojo.java:516)
	at org.apache.maven.plugin.CompilerMojo.execute(CompilerMojo.java:114)
	at org.apache.maven.plugin.DefaultPluginManager.executeMojo(DefaultPluginManager.java:453)
	at hudson.maven.agent.PluginManagerInterceptor.executeMojo(PluginManagerInterceptor.java:182)
	at org.apache.maven.lifecycle.DefaultLifecycleExecutor.executeGoals(DefaultLifecycleExecutor.java:559)
	... 28 more
[INFO] ------------------------------------------------------------------------
[INFO] BUILD ERRORS
[INFO] ------------------------------------------------------------------------
[INFO] Total time: 16 minutes 12 seconds
[INFO] Finished at: Wed Jun 16 03:18:12 UTC 2010
[INFO] Final Memory: 68M/1112M
[INFO] ------------------------------------------------------------------------
Sending e-mails to: dev@activemq.apache.org
channel stopped


Mime
View raw message