activemq-dev mailing list archives

Site index · List index
Message view « Date » · « Thread »
Top « Date » · « Thread »
From Apache Hudson Server <hud...@hudson.zones.apache.org>
Subject Build failed in Hudson: ActiveMQ #367
Date Sat, 05 Jun 2010 01:15:43 GMT
See <http://hudson.zones.apache.org/hudson/job/ActiveMQ/367/changes>

Changes:

[dejanb] https://issues.apache.org/activemq/browse/AMQ-2744 - turn auth to false by default

------------------------------------------
[...truncated 4818 lines...]
Downloading: http://repository.springsource.com/maven/bundles/external/org/codehaus/groovy/maven/runtime/gmaven-runtime-1.5/1.0-rc-3/gmaven-runtime-1.5-1.0-rc-3.jar
Downloading: http://repo1.maven.org/maven2/org/codehaus/groovy/maven/runtime/gmaven-runtime-1.5/1.0-rc-3/gmaven-runtime-1.5-1.0-rc-3.jar
Downloading: https://repository.apache.org/content/repositories/snapshots//org/codehaus/groovy/maven/feature/gmaven-feature-support/1.0-rc-3/gmaven-feature-support-1.0-rc-3.jar
Downloading: http://repository.springsource.com/maven/bundles/external/org/codehaus/groovy/maven/feature/gmaven-feature-support/1.0-rc-3/gmaven-feature-support-1.0-rc-3.jar
Downloading: http://repo1.maven.org/maven2/org/codehaus/groovy/maven/feature/gmaven-feature-support/1.0-rc-3/gmaven-feature-support-1.0-rc-3.jar
Downloading: https://repository.apache.org/content/repositories/snapshots//org/codehaus/groovy/maven/runtime/gmaven-runtime-support/1.0-rc-3/gmaven-runtime-support-1.0-rc-3.jar
Downloading: http://repository.springsource.com/maven/bundles/external/org/codehaus/groovy/maven/runtime/gmaven-runtime-support/1.0-rc-3/gmaven-runtime-support-1.0-rc-3.jar
Downloading: http://repo1.maven.org/maven2/org/codehaus/groovy/maven/runtime/gmaven-runtime-support/1.0-rc-3/gmaven-runtime-support-1.0-rc-3.jar
Downloading: https://repository.apache.org/content/repositories/snapshots//org/codehaus/groovy/maven/gmaven-common/1.0-rc-3/gmaven-common-1.0-rc-3.jar
Downloading: http://repository.springsource.com/maven/bundles/external/org/codehaus/groovy/maven/gmaven-common/1.0-rc-3/gmaven-common-1.0-rc-3.jar
Downloading: http://repo1.maven.org/maven2/org/codehaus/groovy/maven/gmaven-common/1.0-rc-3/gmaven-common-1.0-rc-3.jar
Downloading: https://repository.apache.org/content/repositories/snapshots//org/codehaus/plexus/plexus-utils/1.1/plexus-utils-1.1.jar
Downloading: http://repo1.maven.org/maven2/org/codehaus/plexus/plexus-utils/1.1/plexus-utils-1.1.jar
Downloading: https://repository.apache.org/content/repositories/snapshots//com/thoughtworks/qdox/qdox/1.6.3/qdox-1.6.3.jar
Downloading: http://repository.springsource.com/maven/bundles/external/com/thoughtworks/qdox/qdox/1.6.3/qdox-1.6.3.jar
Downloading: http://repo1.maven.org/maven2/com/thoughtworks/qdox/qdox/1.6.3/qdox-1.6.3.jar
Downloading: https://repository.apache.org/content/repositories/snapshots//org/codehaus/groovy/groovy-all-minimal/1.5.6/groovy-all-minimal-1.5.6.jar
Downloading: http://repository.springsource.com/maven/bundles/external/org/codehaus/groovy/groovy-all-minimal/1.5.6/groovy-all-minimal-1.5.6.jar
Downloading: http://repo1.maven.org/maven2/org/codehaus/groovy/groovy-all-minimal/1.5.6/groovy-all-minimal-1.5.6.jar
Downloading: https://repository.apache.org/content/repositories/snapshots//org/apache/ant/ant/1.7.1/ant-1.7.1.jar
Downloading: http://repository.springsource.com/maven/bundles/external/org/apache/ant/ant/1.7.1/ant-1.7.1.jar
Downloading: http://repo1.maven.org/maven2/org/apache/ant/ant/1.7.1/ant-1.7.1.jar
Downloading: https://repository.apache.org/content/repositories/snapshots//org/apache/ant/ant-launcher/1.7.1/ant-launcher-1.7.1.jar
Downloading: http://repository.springsource.com/maven/bundles/external/org/apache/ant/ant-launcher/1.7.1/ant-launcher-1.7.1.jar
Downloading: http://repo1.maven.org/maven2/org/apache/ant/ant-launcher/1.7.1/ant-launcher-1.7.1.jar
Downloading: https://repository.apache.org/content/repositories/snapshots//jline/jline/0.9.94/jline-0.9.94.jar
Downloading: http://repository.springsource.com/maven/bundles/external/jline/jline/0.9.94/jline-0.9.94.jar
Downloading: http://repo1.maven.org/maven2/jline/jline/0.9.94/jline-0.9.94.jar
[INFO] [ianal:verify-legal-files {execution: default}]
Downloading: https://repository.apache.org/content/repositories/snapshots//org/codehaus/plexus/plexus-digest/1.0/plexus-digest-1.0.pom
Downloading: http://repo1.maven.org/maven2/org/codehaus/plexus/plexus-digest/1.0/plexus-digest-1.0.pom
Downloading: https://repository.apache.org/content/repositories/snapshots//org/codehaus/plexus/plexus-components/1.1.7/plexus-components-1.1.7.pom
Downloading: http://repo1.maven.org/maven2/org/codehaus/plexus/plexus-components/1.1.7/plexus-components-1.1.7.pom
Downloading: https://repository.apache.org/content/repositories/snapshots//org/codehaus/plexus/plexus-digest/1.0/plexus-digest-1.0.jar
Downloading: http://repo1.maven.org/maven2/org/codehaus/plexus/plexus-digest/1.0/plexus-digest-1.0.jar
[INFO] [install:install]
[INFO] Installing <http://hudson.zones.apache.org/hudson/job/ActiveMQ/ws/trunk/pom.xml>
to <http://hudson.zones.apache.org/hudson/job/ActiveMQ/ws/.repository/org/apache/activemq/activemq-parent/5.4-SNAPSHOT/activemq-parent-5.4-SNAPSHOT.pom>
[INFO] Preparing source:jar
[HUDSON] Archiving <http://hudson.zones.apache.org/hudson/job/ActiveMQ/ws/trunk/pom.xml>
to /export/home/hudson/hudson/jobs/ActiveMQ/modules/org.apache.activemq$activemq-parent/builds/2010-06-05_00-35-04/archive/org.apache.activemq/activemq-parent/5.4-SNAPSHOT/pom.xml
[INFO] [enforcer:enforce {execution: default}]
[INFO] [bundle:cleanVersions {execution: cleanVersions}]
Downloading: https://repository.apache.org/content/repositories/snapshots//org/apache/maven/maven-archiver/2.4/maven-archiver-2.4.pom
Downloading: http://repo1.maven.org/maven2/org/apache/maven/maven-archiver/2.4/maven-archiver-2.4.pom
Downloading: https://repository.apache.org/content/repositories/snapshots//org/apache/maven/maven-model/2.0/maven-model-2.0.pom
Downloading: http://repository.springsource.com/maven/bundles/external/org/apache/maven/maven-model/2.0/maven-model-2.0.pom
Downloading: http://repo1.maven.org/maven2/org/apache/maven/maven-model/2.0/maven-model-2.0.pom
Downloading: https://repository.apache.org/content/repositories/snapshots//org/codehaus/plexus/plexus-archiver/1.0-alpha-11/plexus-archiver-1.0-alpha-11.pom
Downloading: http://repository.springsource.com/maven/bundles/external/org/codehaus/plexus/plexus-archiver/1.0-alpha-11/plexus-archiver-1.0-alpha-11.pom
Downloading: http://repo1.maven.org/maven2/org/codehaus/plexus/plexus-archiver/1.0-alpha-11/plexus-archiver-1.0-alpha-11.pom
Downloading: https://repository.apache.org/content/repositories/snapshots//org/codehaus/plexus/plexus-components/1.1.9/plexus-components-1.1.9.pom
Downloading: http://repository.springsource.com/maven/bundles/external/org/codehaus/plexus/plexus-components/1.1.9/plexus-components-1.1.9.pom
Downloading: http://repo1.maven.org/maven2/org/codehaus/plexus/plexus-components/1.1.9/plexus-components-1.1.9.pom
Downloading: https://repository.apache.org/content/repositories/snapshots//org/codehaus/plexus/plexus-container-default/1.0-alpha-15/plexus-container-default-1.0-alpha-15.pom
Downloading: http://repository.springsource.com/maven/bundles/external/org/codehaus/plexus/plexus-container-default/1.0-alpha-15/plexus-container-default-1.0-alpha-15.pom
Downloading: http://repo1.maven.org/maven2/org/codehaus/plexus/plexus-container-default/1.0-alpha-15/plexus-container-default-1.0-alpha-15.pom
Downloading: https://repository.apache.org/content/repositories/snapshots//org/codehaus/plexus/plexus-containers/1.0-alpha-15/plexus-containers-1.0-alpha-15.pom
Downloading: http://repository.springsource.com/maven/bundles/external/org/codehaus/plexus/plexus-containers/1.0-alpha-15/plexus-containers-1.0-alpha-15.pom
Downloading: http://repo1.maven.org/maven2/org/codehaus/plexus/plexus-containers/1.0-alpha-15/plexus-containers-1.0-alpha-15.pom
Downloading: https://repository.apache.org/content/repositories/snapshots//org/codehaus/plexus/plexus/1.0.9/plexus-1.0.9.pom
Downloading: http://repository.springsource.com/maven/bundles/external/org/codehaus/plexus/plexus/1.0.9/plexus-1.0.9.pom
Downloading: http://repo1.maven.org/maven2/org/codehaus/plexus/plexus/1.0.9/plexus-1.0.9.pom
Downloading: https://repository.apache.org/content/repositories/snapshots//org/codehaus/plexus/plexus-component-api/1.0-alpha-15/plexus-component-api-1.0-alpha-15.pom
Downloading: http://repository.springsource.com/maven/bundles/external/org/codehaus/plexus/plexus-component-api/1.0-alpha-15/plexus-component-api-1.0-alpha-15.pom
Downloading: http://repo1.maven.org/maven2/org/codehaus/plexus/plexus-component-api/1.0-alpha-15/plexus-component-api-1.0-alpha-15.pom
Downloading: https://repository.apache.org/content/repositories/snapshots//org/codehaus/plexus/plexus-classworlds/1.2-alpha-6/plexus-classworlds-1.2-alpha-6.pom
Downloading: http://repository.springsource.com/maven/bundles/external/org/codehaus/plexus/plexus-classworlds/1.2-alpha-6/plexus-classworlds-1.2-alpha-6.pom
Downloading: http://repo1.maven.org/maven2/org/codehaus/plexus/plexus-classworlds/1.2-alpha-6/plexus-classworlds-1.2-alpha-6.pom
Downloading: https://repository.apache.org/content/repositories/snapshots//org/codehaus/plexus/plexus-io/1.0-alpha-3/plexus-io-1.0-alpha-3.pom
Downloading: http://repository.springsource.com/maven/bundles/external/org/codehaus/plexus/plexus-io/1.0-alpha-3/plexus-io-1.0-alpha-3.pom
Downloading: http://repo1.maven.org/maven2/org/codehaus/plexus/plexus-io/1.0-alpha-3/plexus-io-1.0-alpha-3.pom
Downloading: https://repository.apache.org/content/repositories/snapshots//org/codehaus/plexus/plexus-component-api/1.0-alpha-16/plexus-component-api-1.0-alpha-16.pom
Downloading: http://repository.springsource.com/maven/bundles/external/org/codehaus/plexus/plexus-component-api/1.0-alpha-16/plexus-component-api-1.0-alpha-16.pom
Downloading: http://repo1.maven.org/maven2/org/codehaus/plexus/plexus-component-api/1.0-alpha-16/plexus-component-api-1.0-alpha-16.pom
Downloading: https://repository.apache.org/content/repositories/snapshots//org/codehaus/plexus/plexus-containers/1.0-alpha-16/plexus-containers-1.0-alpha-16.pom
Downloading: http://repository.springsource.com/maven/bundles/external/org/codehaus/plexus/plexus-containers/1.0-alpha-16/plexus-containers-1.0-alpha-16.pom
Downloading: http://repo1.maven.org/maven2/org/codehaus/plexus/plexus-containers/1.0-alpha-16/plexus-containers-1.0-alpha-16.pom
Downloading: https://repository.apache.org/content/repositories/snapshots//org/codehaus/plexus/plexus-utils/1.4.9/plexus-utils-1.4.9.pom
Downloading: http://repository.springsource.com/maven/bundles/external/org/codehaus/plexus/plexus-utils/1.4.9/plexus-utils-1.4.9.pom
Downloading: http://repo1.maven.org/maven2/org/codehaus/plexus/plexus-utils/1.4.9/plexus-utils-1.4.9.pom
Downloading: https://repository.apache.org/content/repositories/snapshots//org/codehaus/plexus/plexus-interpolation/1.6/plexus-interpolation-1.6.pom
Downloading: http://repository.springsource.com/maven/bundles/external/org/codehaus/plexus/plexus-interpolation/1.6/plexus-interpolation-1.6.pom
Downloading: http://repo1.maven.org/maven2/org/codehaus/plexus/plexus-interpolation/1.6/plexus-interpolation-1.6.pom
Downloading: https://repository.apache.org/content/repositories/snapshots//org/codehaus/plexus/plexus-archiver/1.0-alpha-9/plexus-archiver-1.0-alpha-9.pom
Downloading: http://repo1.maven.org/maven2/org/codehaus/plexus/plexus-archiver/1.0-alpha-9/plexus-archiver-1.0-alpha-9.pom
Downloading: https://repository.apache.org/content/repositories/snapshots//org/codehaus/plexus/plexus-io/1.0-alpha-1/plexus-io-1.0-alpha-1.pom
Downloading: http://repository.springsource.com/maven/bundles/external/org/codehaus/plexus/plexus-io/1.0-alpha-1/plexus-io-1.0-alpha-1.pom
Downloading: http://repo1.maven.org/maven2/org/codehaus/plexus/plexus-io/1.0-alpha-1/plexus-io-1.0-alpha-1.pom
Downloading: https://repository.apache.org/content/repositories/snapshots//org/apache/maven/maven-archiver/2.4/maven-archiver-2.4.jar
Downloading: http://repo1.maven.org/maven2/org/apache/maven/maven-archiver/2.4/maven-archiver-2.4.jar
Downloading: https://repository.apache.org/content/repositories/snapshots//org/codehaus/plexus/plexus-archiver/1.0-alpha-9/plexus-archiver-1.0-alpha-9.jar
Downloading: http://repo1.maven.org/maven2/org/codehaus/plexus/plexus-archiver/1.0-alpha-9/plexus-archiver-1.0-alpha-9.jar
Downloading: https://repository.apache.org/content/repositories/snapshots//org/codehaus/plexus/plexus-io/1.0-alpha-1/plexus-io-1.0-alpha-1.jar
Downloading: http://repository.springsource.com/maven/bundles/external/org/codehaus/plexus/plexus-io/1.0-alpha-1/plexus-io-1.0-alpha-1.jar
Downloading: http://repo1.maven.org/maven2/org/codehaus/plexus/plexus-io/1.0-alpha-1/plexus-io-1.0-alpha-1.jar
Downloading: https://repository.apache.org/content/repositories/snapshots//org/codehaus/plexus/plexus-interpolation/1.6/plexus-interpolation-1.6.jar
Downloading: http://repository.springsource.com/maven/bundles/external/org/codehaus/plexus/plexus-interpolation/1.6/plexus-interpolation-1.6.jar
Downloading: http://repo1.maven.org/maven2/org/codehaus/plexus/plexus-interpolation/1.6/plexus-interpolation-1.6.jar
[INFO] [source:jar]
[INFO] ------------------------------------------------------------------------
[INFO] Building ActiveMQ :: KahaDB
[INFO]    task-segment: [clean, install, source:jar]
[INFO] ------------------------------------------------------------------------
Downloading: https://repository.apache.org/content/repositories/snapshots//org/apache/maven/plugins/maven-surefire-plugin/2.5/maven-surefire-plugin-2.5.pom
Downloading: http://repo1.maven.org/maven2/org/apache/maven/plugins/maven-surefire-plugin/2.5/maven-surefire-plugin-2.5.pom
Downloading: https://repository.apache.org/content/repositories/snapshots//org/apache/maven/surefire/surefire/2.5/surefire-2.5.pom
Downloading: http://repo1.maven.org/maven2/org/apache/maven/surefire/surefire/2.5/surefire-2.5.pom
Downloading: https://repository.apache.org/content/repositories/snapshots//org/apache/maven/maven-parent/15/maven-parent-15.pom
Downloading: http://repo1.maven.org/maven2/org/apache/maven/maven-parent/15/maven-parent-15.pom
Downloading: https://repository.apache.org/content/repositories/snapshots//org/apache/maven/plugins/maven-surefire-plugin/2.5/maven-surefire-plugin-2.5.jar
Downloading: http://repo1.maven.org/maven2/org/apache/maven/plugins/maven-surefire-plugin/2.5/maven-surefire-plugin-2.5.jar
[INFO] [clean:clean]
Downloading: https://repository.apache.org/content/repositories/snapshots//org/apache/maven/plugins/maven-resources-plugin/2.4/maven-resources-plugin-2.4.pom
Downloading: http://repo1.maven.org/maven2/org/apache/maven/plugins/maven-resources-plugin/2.4/maven-resources-plugin-2.4.pom
Downloading: https://repository.apache.org/content/repositories/snapshots//org/apache/maven/plugins/maven-resources-plugin/2.4/maven-resources-plugin-2.4.jar
Downloading: http://repo1.maven.org/maven2/org/apache/maven/plugins/maven-resources-plugin/2.4/maven-resources-plugin-2.4.jar
Downloading: http://repository.springsource.com/maven/bundles/external/commons-logging/commons-logging/1.1/commons-logging-1.1.pom
Downloading: http://repo1.maven.org/maven2/commons-logging/commons-logging/1.1/commons-logging-1.1.pom
Downloading: http://repository.springsource.com/maven/bundles/external/log4j/log4j/1.2.14/log4j-1.2.14.pom
Downloading: http://repo1.maven.org/maven2/log4j/log4j/1.2.14/log4j-1.2.14.pom
Downloading: http://repository.springsource.com/maven/bundles/external/junit/junit/4.5/junit-4.5.pom
Downloading: http://repo1.maven.org/maven2/junit/junit/4.5/junit-4.5.pom
Downloading: http://repository.springsource.com/maven/bundles/external/commons-logging/commons-logging/1.1/commons-logging-1.1.jar
Downloading: http://repo1.maven.org/maven2/commons-logging/commons-logging/1.1/commons-logging-1.1.jar
Downloading: http://repository.springsource.com/maven/bundles/external/log4j/log4j/1.2.14/log4j-1.2.14.jar
Downloading: http://repo1.maven.org/maven2/log4j/log4j/1.2.14/log4j-1.2.14.jar
Downloading: http://repository.springsource.com/maven/bundles/external/junit/junit/4.5/junit-4.5.jar
Downloading: http://repo1.maven.org/maven2/junit/junit/4.5/junit-4.5.jar
[INFO] [enforcer:enforce {execution: default}]
[INFO] [bundle:cleanVersions {execution: cleanVersions}]
[INFO] [remote-resources:process {execution: default}]
Downloading: https://repository.apache.org/content/repositories/snapshots//org/codehaus/plexus/plexus-utils/1.5.15/plexus-utils-1.5.15.jar
Downloading: http://repo1.maven.org/maven2/org/codehaus/plexus/plexus-utils/1.5.15/plexus-utils-1.5.15.jar
[INFO] [resources:resources]
[INFO] Using 'UTF-8' encoding to copy filtered resources.
[INFO] Copying 2 resources
[INFO] Copying 3 resources
Downloading: https://repository.apache.org/content/repositories/snapshots//org/codehaus/plexus/plexus-compiler-api/1.5.3/plexus-compiler-api-1.5.3.pom
Downloading: http://repo1.maven.org/maven2/org/codehaus/plexus/plexus-compiler-api/1.5.3/plexus-compiler-api-1.5.3.pom
Downloading: https://repository.apache.org/content/repositories/snapshots//org/codehaus/plexus/plexus-compiler/1.5.3/plexus-compiler-1.5.3.pom
Downloading: http://repo1.maven.org/maven2/org/codehaus/plexus/plexus-compiler/1.5.3/plexus-compiler-1.5.3.pom
Downloading: https://repository.apache.org/content/repositories/snapshots//org/codehaus/plexus/plexus-compiler-manager/1.5.3/plexus-compiler-manager-1.5.3.pom
Downloading: http://repo1.maven.org/maven2/org/codehaus/plexus/plexus-compiler-manager/1.5.3/plexus-compiler-manager-1.5.3.pom
Downloading: https://repository.apache.org/content/repositories/snapshots//org/codehaus/plexus/plexus-compiler-javac/1.5.3/plexus-compiler-javac-1.5.3.pom
Downloading: http://repo1.maven.org/maven2/org/codehaus/plexus/plexus-compiler-javac/1.5.3/plexus-compiler-javac-1.5.3.pom
Downloading: https://repository.apache.org/content/repositories/snapshots//org/codehaus/plexus/plexus-compilers/1.5.3/plexus-compilers-1.5.3.pom
Downloading: http://repo1.maven.org/maven2/org/codehaus/plexus/plexus-compilers/1.5.3/plexus-compilers-1.5.3.pom
Downloading: https://repository.apache.org/content/repositories/snapshots//org/codehaus/plexus/plexus-utils/1.0.5/plexus-utils-1.0.5.pom
Downloading: http://repository.springsource.com/maven/bundles/external/org/codehaus/plexus/plexus-utils/1.0.5/plexus-utils-1.0.5.pom
Downloading: http://repo1.maven.org/maven2/org/codehaus/plexus/plexus-utils/1.0.5/plexus-utils-1.0.5.pom
Downloading: https://repository.apache.org/content/repositories/snapshots//org/codehaus/plexus/plexus-utils/1.0.4/plexus-utils-1.0.4.jar
Downloading: http://repo1.maven.org/maven2/org/codehaus/plexus/plexus-utils/1.0.4/plexus-utils-1.0.4.jar
Downloading: https://repository.apache.org/content/repositories/snapshots//org/codehaus/plexus/plexus-compiler-api/1.5.3/plexus-compiler-api-1.5.3.jar
Downloading: http://repo1.maven.org/maven2/org/codehaus/plexus/plexus-compiler-api/1.5.3/plexus-compiler-api-1.5.3.jar
Downloading: https://repository.apache.org/content/repositories/snapshots//org/codehaus/plexus/plexus-compiler-manager/1.5.3/plexus-compiler-manager-1.5.3.jar
Downloading: http://repo1.maven.org/maven2/org/codehaus/plexus/plexus-compiler-manager/1.5.3/plexus-compiler-manager-1.5.3.jar
Downloading: https://repository.apache.org/content/repositories/snapshots//org/codehaus/plexus/plexus-compiler-javac/1.5.3/plexus-compiler-javac-1.5.3.jar
Downloading: http://repo1.maven.org/maven2/org/codehaus/plexus/plexus-compiler-javac/1.5.3/plexus-compiler-javac-1.5.3.jar
[INFO] [compiler:compile]
[INFO] Compiling 44 source files to <http://hudson.zones.apache.org/hudson/job/ActiveMQ/ws/trunk/kahadb/target/classes>
[INFO] [resources:testResources]
[INFO] Using 'UTF-8' encoding to copy filtered resources.
[INFO] Copying 1 resource
[INFO] Copying 3 resources
[INFO] [compiler:testCompile]
[INFO] Compiling 8 source files to <http://hudson.zones.apache.org/hudson/job/ActiveMQ/ws/trunk/kahadb/target/test-classes>
Downloading: https://repository.apache.org/content/repositories/snapshots//org/apache/maven/surefire/surefire-booter/2.5/surefire-booter-2.5.pom
Downloading: http://repo1.maven.org/maven2/org/apache/maven/surefire/surefire-booter/2.5/surefire-booter-2.5.pom
Downloading: https://repository.apache.org/content/repositories/snapshots//org/apache/maven/surefire/surefire-api/2.5/surefire-api-2.5.pom
Downloading: http://repository.springsource.com/maven/bundles/external/org/apache/maven/surefire/surefire-api/2.5/surefire-api-2.5.pom
Downloading: http://repo1.maven.org/maven2/org/apache/maven/surefire/surefire-api/2.5/surefire-api-2.5.pom
Downloading: https://repository.apache.org/content/repositories/snapshots//org/codehaus/plexus/plexus-utils/1.5.9/plexus-utils-1.5.9.pom
Downloading: http://repo1.maven.org/maven2/org/codehaus/plexus/plexus-utils/1.5.9/plexus-utils-1.5.9.pom
Downloading: https://repository.apache.org/content/repositories/snapshots//org/apache/maven/maven-toolchain/2.0.9/maven-toolchain-2.0.9.pom
Downloading: http://repo1.maven.org/maven2/org/apache/maven/maven-toolchain/2.0.9/maven-toolchain-2.0.9.pom
Downloading: https://repository.apache.org/content/repositories/snapshots//org/apache/maven/surefire/surefire-booter/2.5/surefire-booter-2.5.jar
Downloading: http://repo1.maven.org/maven2/org/apache/maven/surefire/surefire-booter/2.5/surefire-booter-2.5.jar
Downloading: https://repository.apache.org/content/repositories/snapshots//org/apache/maven/surefire/surefire-api/2.5/surefire-api-2.5.jar
Downloading: http://repository.springsource.com/maven/bundles/external/org/apache/maven/surefire/surefire-api/2.5/surefire-api-2.5.jar
Downloading: http://repo1.maven.org/maven2/org/apache/maven/surefire/surefire-api/2.5/surefire-api-2.5.jar
Downloading: https://repository.apache.org/content/repositories/snapshots//org/codehaus/plexus/plexus-utils/1.5.9/plexus-utils-1.5.9.jar
Downloading: http://repo1.maven.org/maven2/org/codehaus/plexus/plexus-utils/1.5.9/plexus-utils-1.5.9.jar
[WARNING] DEPRECATED [systemProperties]: Use systemPropertyVariables instead.
[INFO] [surefire:test]
Downloading: https://repository.apache.org/content/repositories/snapshots//org/apache/maven/surefire/surefire-junit4/2.5/surefire-junit4-2.5.pom
Downloading: http://repo1.maven.org/maven2/org/apache/maven/surefire/surefire-junit4/2.5/surefire-junit4-2.5.pom
Downloading: https://repository.apache.org/content/repositories/snapshots//org/apache/maven/surefire/surefire-providers/2.5/surefire-providers-2.5.pom
Downloading: http://repo1.maven.org/maven2/org/apache/maven/surefire/surefire-providers/2.5/surefire-providers-2.5.pom
Downloading: https://repository.apache.org/content/repositories/snapshots//junit/junit/4.0/junit-4.0.pom
Downloading: http://repo1.maven.org/maven2/junit/junit/4.0/junit-4.0.pom
Downloading: https://repository.apache.org/content/repositories/snapshots//org/apache/maven/surefire/surefire-junit4/2.5/surefire-junit4-2.5.jar
Downloading: http://repo1.maven.org/maven2/org/apache/maven/surefire/surefire-junit4/2.5/surefire-junit4-2.5.jar
Downloading: https://repository.apache.org/content/repositories/snapshots//junit/junit/4.0/junit-4.0.jar
Downloading: http://repo1.maven.org/maven2/junit/junit/4.0/junit-4.0.jar
[INFO] Surefire report directory: <http://hudson.zones.apache.org/hudson/job/ActiveMQ/ws/trunk/kahadb/target/surefire-reports>

-------------------------------------------------------
 T E S T S
-------------------------------------------------------
Running org.apache.kahadb.page.PageFileTest
Tests run: 3, Failures: 0, Errors: 0, Skipped: 0, Time elapsed: 0.397 sec
Running org.apache.kahadb.journal.JournalTest
Tests run: 5, Failures: 0, Errors: 0, Skipped: 0, Time elapsed: 0.232 sec
Running org.apache.kahadb.index.BTreeIndexTest
Tests run: 4, Failures: 0, Errors: 0, Skipped: 0, Time elapsed: 1.562 sec
Running org.apache.kahadb.index.HashIndexTest
Tests run: 1, Failures: 0, Errors: 0, Skipped: 0, Time elapsed: 7.469 sec

Results :

Tests run: 13, Failures: 0, Errors: 0, Skipped: 0

[locks-and-latches] Releasing all the locks
[locks-and-latches] All the locks released
ERROR: Failed to parse POMs
hudson.util.IOException2: Failed to join the process
	at hudson.Proc$RemoteProc.join(Proc.java:312)
	at hudson.maven.ProcessCache$MavenProcess.call(ProcessCache.java:164)
	at hudson.maven.MavenModuleSetBuild$RunnerImpl.doRun(MavenModuleSetBuild.java:480)
	at hudson.model.AbstractBuild$AbstractRunner.run(AbstractBuild.java:416)
	at hudson.model.Run.run(Run.java:1243)
	at hudson.maven.MavenModuleSetBuild.run(MavenModuleSetBuild.java:304)
	at hudson.model.ResourceController.execute(ResourceController.java:88)
	at hudson.model.Executor.run(Executor.java:122)
Caused by: java.util.concurrent.ExecutionException: hudson.remoting.RequestAbortedException:
java.io.EOFException
	at hudson.remoting.Request$1.get(Request.java:218)
	at hudson.remoting.Request$1.get(Request.java:172)
	at hudson.remoting.FutureAdapter.get(FutureAdapter.java:55)
	at hudson.Proc$RemoteProc.join(Proc.java:304)
	... 7 more
Caused by: hudson.remoting.RequestAbortedException: java.io.EOFException
	at hudson.remoting.Request.abort(Request.java:257)
	at hudson.remoting.Channel.terminate(Channel.java:598)
	at hudson.remoting.Channel$ReaderThread.run(Channel.java:876)
Caused by: java.io.EOFException
	at java.io.ObjectInputStream$BlockDataInputStream.peekByte(ObjectInputStream.java:2554)
	at java.io.ObjectInputStream.readObject0(ObjectInputStream.java:1297)
	at java.io.ObjectInputStream.readObject(ObjectInputStream.java:351)
	at hudson.remoting.Channel$ReaderThread.run(Channel.java:856)
FATAL: channel is already closed
hudson.remoting.ChannelClosedException: channel is already closed
	at hudson.remoting.Channel.send(Channel.java:412)
	at hudson.remoting.Request.call(Request.java:105)
	at hudson.remoting.Channel.call(Channel.java:551)
	at hudson.Launcher$RemoteLauncher.kill(Launcher.java:735)
	at hudson.model.AbstractBuild$AbstractRunner.run(AbstractBuild.java:421)
	at hudson.model.Run.run(Run.java:1243)
	at hudson.maven.MavenModuleSetBuild.run(MavenModuleSetBuild.java:304)
	at hudson.model.ResourceController.execute(ResourceController.java:88)
	at hudson.model.Executor.run(Executor.java:122)


Mime
View raw message