activemq-dev mailing list archives

Site index · List index
Message view « Date » · « Thread »
Top « Date » · « Thread »
From Apache Hudson Server <hud...@hudson.zones.apache.org>
Subject Build failed in Hudson: ActiveMQ-Trunk-Deploy #67
Date Sat, 05 Jun 2010 03:56:02 GMT
See <http://hudson.zones.apache.org/hudson/job/ActiveMQ-Trunk-Deploy/67/changes>

Changes:

[dejanb] https://issues.apache.org/activemq/browse/AMQ-2744 - turn auth to false by default

------------------------------------------
[...truncated 15954 lines...]
Downloading: https://repository.apache.org/content/repositories/snapshots//org/codehaus/plexus/plexus-interpolation/1.7/plexus-interpolation-1.7.pom
Downloading: http://repo1.maven.org/maven2/org/codehaus/plexus/plexus-interpolation/1.7/plexus-interpolation-1.7.pom
Downloading: https://repository.apache.org/content/repositories/snapshots//org/codehaus/plexus/plexus-active-collections/1.0-beta-2/plexus-active-collections-1.0-beta-2.pom
Downloading: http://repo1.maven.org/maven2/org/codehaus/plexus/plexus-active-collections/1.0-beta-2/plexus-active-collections-1.0-beta-2.pom
Downloading: https://repository.apache.org/content/repositories/snapshots//org/codehaus/plexus/plexus-container-default/1.0-alpha-22/plexus-container-default-1.0-alpha-22.pom
Downloading: http://download.java.net/maven/2/org/codehaus/plexus/plexus-container-default/1.0-alpha-22/plexus-container-default-1.0-alpha-22.pom
Downloading: http://repository.springsource.com/maven/bundles/external/org/codehaus/plexus/plexus-container-default/1.0-alpha-22/plexus-container-default-1.0-alpha-22.pom
Downloading: http://repo1.maven.org/maven2/org/codehaus/plexus/plexus-container-default/1.0-alpha-22/plexus-container-default-1.0-alpha-22.pom
Downloading: https://repository.apache.org/content/repositories/snapshots//org/codehaus/plexus/plexus-containers/1.0-alpha-22/plexus-containers-1.0-alpha-22.pom
Downloading: http://download.java.net/maven/2/org/codehaus/plexus/plexus-containers/1.0-alpha-22/plexus-containers-1.0-alpha-22.pom
Downloading: http://repository.springsource.com/maven/bundles/external/org/codehaus/plexus/plexus-containers/1.0-alpha-22/plexus-containers-1.0-alpha-22.pom
Downloading: http://repo1.maven.org/maven2/org/codehaus/plexus/plexus-containers/1.0-alpha-22/plexus-containers-1.0-alpha-22.pom
Downloading: https://repository.apache.org/content/repositories/snapshots//org/apache/maven/shared/maven-repository-builder/1.0-alpha-2/maven-repository-builder-1.0-alpha-2.pom
Downloading: http://repo1.maven.org/maven2/org/apache/maven/shared/maven-repository-builder/1.0-alpha-2/maven-repository-builder-1.0-alpha-2.pom
Downloading: https://repository.apache.org/content/repositories/snapshots//org/apache/maven/shared/maven-common-artifact-filters/1.0-alpha-1/maven-common-artifact-filters-1.0-alpha-1.pom
Downloading: http://download.java.net/maven/2/org/apache/maven/shared/maven-common-artifact-filters/1.0-alpha-1/maven-common-artifact-filters-1.0-alpha-1.pom
Downloading: http://repository.springsource.com/maven/bundles/external/org/apache/maven/shared/maven-common-artifact-filters/1.0-alpha-1/maven-common-artifact-filters-1.0-alpha-1.pom
Downloading: http://repo1.maven.org/maven2/org/apache/maven/shared/maven-common-artifact-filters/1.0-alpha-1/maven-common-artifact-filters-1.0-alpha-1.pom
Downloading: https://repository.apache.org/content/repositories/snapshots//org/apache/maven/shared/maven-shared-components/6/maven-shared-components-6.pom
Downloading: http://download.java.net/maven/2/org/apache/maven/shared/maven-shared-components/6/maven-shared-components-6.pom
Downloading: http://repository.springsource.com/maven/bundles/external/org/apache/maven/shared/maven-shared-components/6/maven-shared-components-6.pom
Downloading: http://repo1.maven.org/maven2/org/apache/maven/shared/maven-shared-components/6/maven-shared-components-6.pom
Downloading: https://repository.apache.org/content/repositories/snapshots//org/apache/maven/shared/maven-common-artifact-filters/1.1/maven-common-artifact-filters-1.1.jar
Downloading: http://repo1.maven.org/maven2/org/apache/maven/shared/maven-common-artifact-filters/1.1/maven-common-artifact-filters-1.1.jar
Downloading: https://repository.apache.org/content/repositories/snapshots//org/codehaus/plexus/plexus-interpolation/1.7/plexus-interpolation-1.7.jar
Downloading: http://repo1.maven.org/maven2/org/codehaus/plexus/plexus-interpolation/1.7/plexus-interpolation-1.7.jar
Downloading: https://repository.apache.org/content/repositories/snapshots//org/codehaus/plexus/plexus-active-collections/1.0-beta-2/plexus-active-collections-1.0-beta-2.jar
Downloading: http://repo1.maven.org/maven2/org/codehaus/plexus/plexus-active-collections/1.0-beta-2/plexus-active-collections-1.0-beta-2.jar
Downloading: https://repository.apache.org/content/repositories/snapshots//org/apache/maven/shared/maven-repository-builder/1.0-alpha-2/maven-repository-builder-1.0-alpha-2.jar
Downloading: http://repo1.maven.org/maven2/org/apache/maven/shared/maven-repository-builder/1.0-alpha-2/maven-repository-builder-1.0-alpha-2.jar
[INFO] [assembly:attached {execution: unix-bin}]
[INFO] Reading assembly descriptor: src/main/descriptors/unix-bin.xml
[WARNING] Cannot include project artifact: org.apache.activemq:apache-activemq:pom:5.4-SNAPSHOT;
it doesn't have an associated file or directory.
[WARNING] Cannot include project artifact: org.apache.activemq:apache-activemq:pom:5.4-SNAPSHOT;
it doesn't have an associated file or directory.
[WARNING] Cannot include project artifact: org.apache.activemq:apache-activemq:pom:5.4-SNAPSHOT;
it doesn't have an associated file or directory.
[WARNING] Cannot include project artifact: org.apache.activemq:apache-activemq:pom:5.4-SNAPSHOT;
it doesn't have an associated file or directory.
[WARNING] Cannot include project artifact: org.apache.activemq:apache-activemq:pom:5.4-SNAPSHOT;
it doesn't have an associated file or directory.
[WARNING] Cannot include project artifact: org.apache.activemq:apache-activemq:pom:5.4-SNAPSHOT;
it doesn't have an associated file or directory.
[WARNING] The following patterns were never triggered in this artifact inclusion filter:
o  'org.apache.ant:ant'

[INFO] apache-activemq-5.4-SNAPSHOT/webapps/admin/WEB-INF already added, skipping
[INFO] Building tar : <http://hudson.zones.apache.org/hudson/job/ActiveMQ-Trunk-Deploy/ws/trunk/assembly/target/apache-activemq-5.4-SNAPSHOT-bin.tar.gz>
[INFO] apache-activemq-5.4-SNAPSHOT/webapps/admin/WEB-INF already added, skipping
[INFO] [assembly:attached {execution: windows-bin}]
[INFO] Reading assembly descriptor: src/main/descriptors/windows-bin.xml
[WARNING] Cannot include project artifact: org.apache.activemq:apache-activemq:pom:5.4-SNAPSHOT;
it doesn't have an associated file or directory.
[WARNING] Cannot include project artifact: org.apache.activemq:apache-activemq:pom:5.4-SNAPSHOT;
it doesn't have an associated file or directory.
[WARNING] Cannot include project artifact: org.apache.activemq:apache-activemq:pom:5.4-SNAPSHOT;
it doesn't have an associated file or directory.
[WARNING] Cannot include project artifact: org.apache.activemq:apache-activemq:pom:5.4-SNAPSHOT;
it doesn't have an associated file or directory.
[WARNING] Cannot include project artifact: org.apache.activemq:apache-activemq:pom:5.4-SNAPSHOT;
it doesn't have an associated file or directory.
[WARNING] Cannot include project artifact: org.apache.activemq:apache-activemq:pom:5.4-SNAPSHOT;
it doesn't have an associated file or directory.
[WARNING] The following patterns were never triggered in this artifact inclusion filter:
o  'org.apache.ant:ant'

[INFO] apache-activemq-5.4-SNAPSHOT/webapps/admin/WEB-INF already added, skipping
[INFO] Building zip: <http://hudson.zones.apache.org/hudson/job/ActiveMQ-Trunk-Deploy/ws/trunk/assembly/target/apache-activemq-5.4-SNAPSHOT-bin.zip>
[INFO] apache-activemq-5.4-SNAPSHOT/webapps/admin/WEB-INF already added, skipping
[INFO] [ianal:verify-legal-files {execution: default}]
[INFO] Checking legal files in: apache-activemq-5.4-SNAPSHOT-bin.zip
[INFO] [install:install]
[INFO] Installing <http://hudson.zones.apache.org/hudson/job/ActiveMQ-Trunk-Deploy/ws/trunk/assembly/pom.xml>
to <http://hudson.zones.apache.org/hudson/job/ActiveMQ-Trunk-Deploy/ws/.repository/org/apache/activemq/apache-activemq/5.4-SNAPSHOT/apache-activemq-5.4-SNAPSHOT.pom>
[INFO] Installing <http://hudson.zones.apache.org/hudson/job/ActiveMQ-Trunk-Deploy/ws/trunk/assembly/target/apache-activemq-5.4-SNAPSHOT-bin.tar.gz>
to <http://hudson.zones.apache.org/hudson/job/ActiveMQ-Trunk-Deploy/ws/.repository/org/apache/activemq/apache-activemq/5.4-SNAPSHOT/apache-activemq-5.4-SNAPSHOT-bin.tar.gz>
[INFO] Installing <http://hudson.zones.apache.org/hudson/job/ActiveMQ-Trunk-Deploy/ws/trunk/assembly/target/apache-activemq-5.4-SNAPSHOT-bin.zip>
to <http://hudson.zones.apache.org/hudson/job/ActiveMQ-Trunk-Deploy/ws/.repository/org/apache/activemq/apache-activemq/5.4-SNAPSHOT/apache-activemq-5.4-SNAPSHOT-bin.zip>
[INFO] [deploy:deploy]
[INFO] Retrieving previous build number from apache.snapshots.https
Uploading: https://repository.apache.org/content/repositories/snapshots/org/apache/activemq/apache-activemq/5.4-SNAPSHOT/apache-activemq-5.4-SNAPSHOT.pom
14K uploaded
[INFO] Retrieving previous metadata from apache.snapshots.https
[INFO] Uploading repository metadata for: 'snapshot org.apache.activemq:apache-activemq:5.4-SNAPSHOT'
[INFO] Retrieving previous metadata from apache.snapshots.https
[INFO] Uploading repository metadata for: 'artifact org.apache.activemq:apache-activemq'
[INFO] Retrieving previous build number from apache.snapshots.https
Uploading: https://repository.apache.org/content/repositories/snapshots/org/apache/activemq/apache-activemq/5.4-SNAPSHOT/apache-activemq-5.4-SNAPSHOT-bin.tar.gz
35235K uploaded
[INFO] Retrieving previous build number from apache.snapshots.https
Uploading: https://repository.apache.org/content/repositories/snapshots/org/apache/activemq/apache-activemq/5.4-SNAPSHOT/apache-activemq-5.4-SNAPSHOT-bin.zip
35412K uploaded
[HUDSON] Archiving <http://hudson.zones.apache.org/hudson/job/ActiveMQ-Trunk-Deploy/ws/trunk/assembly/target/apache-activemq-5.4-SNAPSHOT-bin.tar.gz>
to /export/home/hudson/hudson/jobs/ActiveMQ-Trunk-Deploy/modules/org.apache.activemq$apache-activemq/builds/2010-06-05_03-02-55/archive/org.apache.activemq/apache-activemq/5.4-SNAPSHOT/apache-activemq-5.4-SNAPSHOT-bin.tar.gz
[HUDSON] Archiving <http://hudson.zones.apache.org/hudson/job/ActiveMQ-Trunk-Deploy/ws/trunk/assembly/target/apache-activemq-5.4-SNAPSHOT-bin.zip>
to /export/home/hudson/hudson/jobs/ActiveMQ-Trunk-Deploy/modules/org.apache.activemq$apache-activemq/builds/2010-06-05_03-02-55/archive/org.apache.activemq/apache-activemq/5.4-SNAPSHOT/apache-activemq-5.4-SNAPSHOT-bin.zip
[INFO] 
[INFO] 
[INFO] ------------------------------------------------------------------------
[INFO] Reactor Summary:
[INFO] ------------------------------------------------------------------------
[INFO] ActiveMQ .............................................. SUCCESS [7:08.225s]
[INFO] ActiveMQ :: KahaDB .................................... SUCCESS [54.041s]
[INFO] ActiveMQ :: JAAS ...................................... SUCCESS [2:01.956s]
[INFO] Openwire Generator .................................... SUCCESS [39.170s]
[INFO] ActiveMQ :: jmdns 1.0 ................................. SUCCESS [18.920s]
[INFO] ActiveMQ :: Core ...................................... SUCCESS [7:09.591s]
[INFO] ActiveMQ :: RA ........................................ SUCCESS [59.474s]
[INFO] ActiveMQ :: Pool ...................................... SUCCESS [37.505s]
[INFO] ActiveMQ :: Camel ..................................... SUCCESS [1:27.411s]
[INFO] ActiveMQ :: Console ................................... SUCCESS [31.597s]
[INFO] ActiveMQ :: Optional .................................. SUCCESS [2:07.457s]
[INFO] ActiveMQ :: Jar Bundle ................................ SUCCESS [27.132s]
[INFO] ActiveMQ :: File Server ............................... SUCCESS [37.464s]
[INFO] ActiveMQ :: Blueprint ................................. FAILED [11.527s]
[INFO] ActiveMQ :: Apache Karaf .............................. SUCCESS [20.615s]
[INFO] ActiveMQ :: RAR ....................................... SUCCESS [2:12.847s]
[INFO] ActiveMQ :: Run Jar ................................... SUCCESS [15.226s]
[INFO] ActiveMQ :: Spring .................................... SUCCESS [21.016s]
[INFO] ActiveMQ Tooling ...................................... SUCCESS [4.756s]
[INFO] ActiveMQ :: Memory Usage Test Plugin .................. SUCCESS [53.455s]
[INFO] ActiveMQ :: Performance Test Plugin ................... SUCCESS [20.029s]
[INFO] ActiveMQ :: StartUp Plugin ............................ SUCCESS [23.321s]
[INFO] ActiveMQ :: Web ....................................... SUCCESS [50.386s]
[INFO] ActiveMQ :: Web Demo .................................. SUCCESS [1:50.645s]
[INFO] ActiveMQ :: XMPP ...................................... SUCCESS [54.266s]
[INFO] ActiveMQ :: Web Console ............................... SUCCESS [2:51.345s]
[INFO] ActiveMQ :: Assembly .................................. SUCCESS [5:13.574s]
[INFO] ------------------------------------------------------------------------
[INFO] Error for project: ActiveMQ :: Blueprint (during deploy)
[INFO] ------------------------------------------------------------------------
[INFO] Failed to resolve artifact.

Missing:
----------
1) org.apache.xbean:xbean-blueprint:jar:3.8-SNAPSHOT

  Try downloading the file manually from the project website.

  Then, install it using the command: 
      mvn install:install-file -DgroupId=org.apache.xbean -DartifactId=xbean-blueprint -Dversion=3.8-SNAPSHOT
-Dpackaging=jar -Dfile=/path/to/file

  Alternatively, if you host your own repository you can deploy the file there: 
      mvn deploy:deploy-file -DgroupId=org.apache.xbean -DartifactId=xbean-blueprint -Dversion=3.8-SNAPSHOT
-Dpackaging=jar -Dfile=/path/to/file -Durl=[url] -DrepositoryId=[id]

  Path to dependency: 
  	1) org.apache.activemq:activemq-blueprint:bundle:5.4-SNAPSHOT
  	2) org.apache.xbean:xbean-blueprint:jar:3.8-SNAPSHOT

----------
1 required artifact is missing.

for artifact: 
  org.apache.activemq:activemq-blueprint:bundle:5.4-SNAPSHOT

from the specified remote repositories:
  central (http://repo1.maven.org/maven2),
  apache.snapshots (https://repository.apache.org/content/repositories/snapshots/),
  com.springsource.repository.bundles.external (http://repository.springsource.com/maven/bundles/external)



[INFO] ------------------------------------------------------------------------
[INFO] Trace
org.apache.maven.lifecycle.LifecycleExecutionException: Missing:
----------
1) org.apache.xbean:xbean-blueprint:jar:3.8-SNAPSHOT

  Try downloading the file manually from the project website.

  Then, install it using the command: 
      mvn install:install-file -DgroupId=org.apache.xbean -DartifactId=xbean-blueprint -Dversion=3.8-SNAPSHOT
-Dpackaging=jar -Dfile=/path/to/file

  Alternatively, if you host your own repository you can deploy the file there: 
      mvn deploy:deploy-file -DgroupId=org.apache.xbean -DartifactId=xbean-blueprint -Dversion=3.8-SNAPSHOT
-Dpackaging=jar -Dfile=/path/to/file -Durl=[url] -DrepositoryId=[id]

  Path to dependency: 
  	1) org.apache.activemq:activemq-blueprint:bundle:5.4-SNAPSHOT
  	2) org.apache.xbean:xbean-blueprint:jar:3.8-SNAPSHOT

----------
1 required artifact is missing.

for artifact: 
  org.apache.activemq:activemq-blueprint:bundle:5.4-SNAPSHOT

from the specified remote repositories:
  central (http://repo1.maven.org/maven2),
  apache.snapshots (https://repository.apache.org/content/repositories/snapshots/),
  com.springsource.repository.bundles.external (http://repository.springsource.com/maven/bundles/external)


	at org.apache.maven.lifecycle.DefaultLifecycleExecutor.executeGoals(DefaultLifecycleExecutor.java:576)
	at org.apache.maven.lifecycle.DefaultLifecycleExecutor.executeGoalWithLifecycle(DefaultLifecycleExecutor.java:500)
	at org.apache.maven.lifecycle.DefaultLifecycleExecutor.executeGoal(DefaultLifecycleExecutor.java:479)
	at org.apache.maven.lifecycle.DefaultLifecycleExecutor.executeGoalAndHandleFailures(DefaultLifecycleExecutor.java:331)
	at org.apache.maven.lifecycle.DefaultLifecycleExecutor.executeTaskSegments(DefaultLifecycleExecutor.java:292)
	at org.apache.maven.lifecycle.DefaultLifecycleExecutor.execute(DefaultLifecycleExecutor.java:142)
	at org.apache.maven.lifecycle.LifecycleExecutorInterceptor.execute(LifecycleExecutorInterceptor.java:65)
	at org.apache.maven.DefaultMaven.doExecute(DefaultMaven.java:336)
	at org.apache.maven.DefaultMaven.execute(DefaultMaven.java:129)
	at org.apache.maven.cli.MavenCli.main(MavenCli.java:301)
	at sun.reflect.NativeMethodAccessorImpl.invoke0(Native Method)
	at sun.reflect.NativeMethodAccessorImpl.invoke(NativeMethodAccessorImpl.java:39)
	at sun.reflect.DelegatingMethodAccessorImpl.invoke(DelegatingMethodAccessorImpl.java:25)
	at java.lang.reflect.Method.invoke(Method.java:592)
	at org.codehaus.classworlds.Launcher.launchEnhanced(Launcher.java:315)
	at org.codehaus.classworlds.Launcher.launch(Launcher.java:255)
	at hudson.maven.agent.Main.launch(Main.java:165)
	at hudson.maven.MavenBuilder.call(MavenBuilder.java:159)
	at hudson.maven.MavenModuleSetBuild$Builder.call(MavenModuleSetBuild.java:688)
	at hudson.maven.MavenModuleSetBuild$Builder.call(MavenModuleSetBuild.java:632)
	at hudson.remoting.UserRequest.perform(UserRequest.java:114)
	at hudson.remoting.UserRequest.perform(UserRequest.java:48)
	at hudson.remoting.Request$2.run(Request.java:270)
	at java.util.concurrent.Executors$RunnableAdapter.call(Executors.java:417)
	at java.util.concurrent.FutureTask$Sync.innerRun(FutureTask.java:269)
	at java.util.concurrent.FutureTask.run(FutureTask.java:123)
	at java.util.concurrent.ThreadPoolExecutor$Worker.runTask(ThreadPoolExecutor.java:651)
	at java.util.concurrent.ThreadPoolExecutor$Worker.run(ThreadPoolExecutor.java:676)
	at java.lang.Thread.run(Thread.java:595)
Caused by: org.apache.maven.artifact.resolver.MultipleArtifactsNotFoundException: Missing:
----------
1) org.apache.xbean:xbean-blueprint:jar:3.8-SNAPSHOT

  Try downloading the file manually from the project website.

  Then, install it using the command: 
      mvn install:install-file -DgroupId=org.apache.xbean -DartifactId=xbean-blueprint -Dversion=3.8-SNAPSHOT
-Dpackaging=jar -Dfile=/path/to/file

  Alternatively, if you host your own repository you can deploy the file there: 
      mvn deploy:deploy-file -DgroupId=org.apache.xbean -DartifactId=xbean-blueprint -Dversion=3.8-SNAPSHOT
-Dpackaging=jar -Dfile=/path/to/file -Durl=[url] -DrepositoryId=[id]

  Path to dependency: 
  	1) org.apache.activemq:activemq-blueprint:bundle:5.4-SNAPSHOT
  	2) org.apache.xbean:xbean-blueprint:jar:3.8-SNAPSHOT

----------
1 required artifact is missing.

for artifact: 
  org.apache.activemq:activemq-blueprint:bundle:5.4-SNAPSHOT

from the specified remote repositories:
  central (http://repo1.maven.org/maven2),
  apache.snapshots (https://repository.apache.org/content/repositories/snapshots/),
  com.springsource.repository.bundles.external (http://repository.springsource.com/maven/bundles/external)


	at org.apache.maven.artifact.resolver.DefaultArtifactResolver.resolveTransitively(DefaultArtifactResolver.java:324)
	at org.apache.maven.artifact.resolver.DefaultArtifactResolver.resolveTransitively(DefaultArtifactResolver.java:288)
	at org.apache.maven.plugin.DefaultPluginManager.resolveTransitiveDependencies(DefaultPluginManager.java:1417)
	at org.apache.maven.plugin.DefaultPluginManager.executeMojo(DefaultPluginManager.java:407)
	at hudson.maven.agent.PluginManagerInterceptor.executeMojo(PluginManagerInterceptor.java:182)
	at org.apache.maven.lifecycle.DefaultLifecycleExecutor.executeGoals(DefaultLifecycleExecutor.java:559)
	... 28 more
[INFO] ------------------------------------------------------------------------
[INFO] BUILD ERRORS
[INFO] ------------------------------------------------------------------------
[INFO] Total time: 51 minutes 
[INFO] Finished at: Sat Jun 05 03:54:03 UTC 2010
[INFO] Final Memory: 91M/1958M
[INFO] ------------------------------------------------------------------------
Waiting for Hudson to finish collecting data
channel stopped


Mime
View raw message