activemq-dev mailing list archives

Site index · List index
Message view « Date » · « Thread »
Top « Date » · « Thread »
From Apache Hudson Server <hud...@hudson.zones.apache.org>
Subject Build failed in Hudson: ActiveMQ #393
Date Wed, 30 Jun 2010 05:19:33 GMT
See <http://hudson.zones.apache.org/hudson/job/ActiveMQ/393/changes>

Changes:

[dejanb] https://issues.apache.org/activemq/browse/AMQ-2453 - some improvements to unix start
script

[gtully] even more input to doc comment re pooling: https://issues.apache.org/activemq/browse/AMQ-2806

[gtully] more input to doc comment re pooling: https://issues.apache.org/activemq/browse/AMQ-2806

------------------------------------------
[...truncated 6246 lines...]
Tests run: 131, Failures: 0, Errors: 0, Skipped: 0, Time elapsed: 686.783 sec
Running org.apache.activemq.openwire.v2.ConnectionErrorTest
Tests run: 1, Failures: 0, Errors: 0, Skipped: 0, Time elapsed: 0.176 sec
Running org.apache.activemq.usecases.StartAndStopClientAndBrokerDoesNotLeaveThreadsRunningTest
Tests run: 1, Failures: 0, Errors: 0, Skipped: 0, Time elapsed: 2.666 sec
Running org.apache.activemq.openwire.v2.ResponseTest
Tests run: 1, Failures: 0, Errors: 0, Skipped: 0, Time elapsed: 0.175 sec
Running org.apache.activemq.broker.region.cursors.StoreQueueCursorKahaDBNoDuplicateTest
Tests run: 1, Failures: 0, Errors: 0, Skipped: 0, Time elapsed: 0.843 sec
Running org.apache.activemq.test.message.NestedMapAndListPropertyTest
Tests run: 1, Failures: 0, Errors: 1, Skipped: 0, Time elapsed: 1.969 sec <<< FAILURE!
Running org.apache.activemq.OnePrefetchAsyncConsumerTest
Tests run: 1, Failures: 0, Errors: 0, Skipped: 0, Time elapsed: 6.586 sec
Running org.apache.activemq.network.DemandForwardingBridgeTest
Tests run: 6, Failures: 0, Errors: 0, Skipped: 0, Time elapsed: 4.558 sec
Running org.apache.activemq.broker.scheduler.JobSchedulerStoreTest
Tests run: 1, Failures: 0, Errors: 0, Skipped: 0, Time elapsed: 2.112 sec
Running org.apache.activemq.command.MessageSendTest
Tests run: 2, Failures: 0, Errors: 0, Skipped: 0, Time elapsed: 0.208 sec
Running org.apache.activemq.openwire.v5.RemoveSubscriptionInfoTest
Tests run: 1, Failures: 0, Errors: 0, Skipped: 0, Time elapsed: 0.171 sec
Running org.apache.activemq.JmsClientAckListenerTest
Tests run: 2, Failures: 0, Errors: 0, Skipped: 0, Time elapsed: 21.871 sec
Running org.apache.activemq.bugs.AMQ2314Test
Tests run: 2, Failures: 0, Errors: 0, Skipped: 0, Time elapsed: 55.13 sec
Running org.apache.activemq.broker.DoubleSubscriptionTest
Tests run: 1, Failures: 0, Errors: 0, Skipped: 0, Time elapsed: 2.683 sec
Running org.apache.activemq.thread.TaskRunnerTest
Tests run: 2, Failures: 0, Errors: 0, Skipped: 0, Time elapsed: 0.544 sec
Running org.apache.activemq.openwire.v6.JournalQueueAckTest
Tests run: 1, Failures: 0, Errors: 0, Skipped: 0, Time elapsed: 0.192 sec
Running org.apache.activemq.JmsQueueCompositeSendReceiveTest
Tests run: 2, Failures: 0, Errors: 0, Skipped: 0, Time elapsed: 2.18 sec
Running org.apache.activemq.memory.buffer.SizeBasedMessageBufferTest
Tests run: 1, Failures: 0, Errors: 0, Skipped: 0, Time elapsed: 0.125 sec
Running org.apache.activemq.openwire.v2.ProducerInfoTest
Tests run: 1, Failures: 0, Errors: 0, Skipped: 0, Time elapsed: 0.195 sec
Running org.apache.activemq.openwire.v3.ConsumerControlTest
Tests run: 1, Failures: 0, Errors: 0, Skipped: 0, Time elapsed: 0.175 sec
Running org.apache.activemq.advisory.TempQueueMemoryTest
Tests run: 2, Failures: 0, Errors: 0, Skipped: 0, Time elapsed: 34.826 sec
Running org.apache.activemq.openwire.v3.JournalQueueAckTest
Tests run: 1, Failures: 0, Errors: 0, Skipped: 0, Time elapsed: 0.207 sec
Running org.apache.activemq.test.message.NestedMapMessageTest
Tests run: 1, Failures: 0, Errors: 0, Skipped: 0, Time elapsed: 3.9 sec
Running org.apache.activemq.openwire.v4.MessageDispatchTest
Tests run: 1, Failures: 0, Errors: 0, Skipped: 0, Time elapsed: 0.217 sec
Running org.apache.activemq.broker.policy.DestinationCursorConfigTest
Tests run: 2, Failures: 0, Errors: 0, Skipped: 0, Time elapsed: 1.628 sec
Running org.apache.activemq.transport.tcp.InactivityMonitorTest
Tests run: 3, Failures: 0, Errors: 0, Skipped: 0, Time elapsed: 14.267 sec
Running org.apache.activemq.ActiveMQConnectionFactoryTest
Tests run: 12, Failures: 0, Errors: 0, Skipped: 0, Time elapsed: 7.676 sec
Running org.apache.activemq.openwire.v1.ShutdownInfoTest
Tests run: 1, Failures: 0, Errors: 0, Skipped: 0, Time elapsed: 0.174 sec
Running org.apache.activemq.openwire.v2.MessageDispatchTest
Tests run: 1, Failures: 0, Errors: 0, Skipped: 0, Time elapsed: 0.218 sec
Running org.apache.activemq.usecases.StartAndStopBrokerTest
Tests run: 1, Failures: 0, Errors: 0, Skipped: 0, Time elapsed: 6.51 sec
Running org.apache.activemq.openwire.v3.MessageAckTest
Tests run: 1, Failures: 0, Errors: 0, Skipped: 0, Time elapsed: 0.194 sec
Running org.apache.activemq.store.kahadb.KahaDBStoreOrderTest
Tests run: 1, Failures: 0, Errors: 0, Skipped: 0, Time elapsed: 2.666 sec
Running org.apache.activemq.filter.DestinationFilterTest
Tests run: 3, Failures: 0, Errors: 0, Skipped: 0, Time elapsed: 0.061 sec
Running org.apache.activemq.broker.ft.JDBCQueueMasterSlaveTest
Tests run: 1, Failures: 0, Errors: 0, Skipped: 0, Time elapsed: 23.503 sec
Running org.apache.activemq.openwire.v1.RemoveInfoTest
Tests run: 1, Failures: 0, Errors: 0, Skipped: 0, Time elapsed: 0.185 sec
Running org.apache.activemq.openwire.v3.TransactionInfoTest
Tests run: 1, Failures: 0, Errors: 0, Skipped: 0, Time elapsed: 0.179 sec
Running org.apache.activemq.usecases.ThreeBrokerQueueNetworkTest
Tests run: 13, Failures: 0, Errors: 0, Skipped: 0, Time elapsed: 184.756 sec
Running org.apache.activemq.bugs.ConnectionPerMessageTest
Tests run: 1, Failures: 0, Errors: 0, Skipped: 0, Time elapsed: 18.659 sec
Running org.apache.activemq.command.ActiveMQStreamMessageTest
Tests run: 18, Failures: 0, Errors: 0, Skipped: 0, Time elapsed: 0.493 sec
Running org.apache.activemq.openwire.v5.RemoveInfoTest
Tests run: 1, Failures: 0, Errors: 0, Skipped: 0, Time elapsed: 0.192 sec
Running org.apache.activemq.usecases.TwoMulticastDiscoveryBrokerTopicSendReceiveTest
Tests run: 1, Failures: 0, Errors: 0, Skipped: 0, Time elapsed: 20.217 sec
Running org.apache.activemq.broker.policy.StrictOrderDispatchPolicyTest
Tests run: 8, Failures: 0, Errors: 0, Skipped: 0, Time elapsed: 7.103 sec
Running org.apache.activemq.broker.virtual.VirtualTopicPubSubUsingXBeanTest
Tests run: 2, Failures: 0, Errors: 0, Skipped: 0, Time elapsed: 0.92 sec
Running org.apache.activemq.openwire.v3.DiscoveryEventTest
Tests run: 1, Failures: 0, Errors: 0, Skipped: 0, Time elapsed: 0.167 sec
Running org.apache.activemq.openwire.v3.DataResponseTest
Tests run: 1, Failures: 0, Errors: 0, Skipped: 0, Time elapsed: 0.188 sec
Running org.apache.activemq.broker.region.QueuePurgeTest
Tests run: 4, Failures: 0, Errors: 0, Skipped: 0, Time elapsed: 339.253 sec
Running org.apache.activemq.JMSDurableTopicRedeliverTest
Tests run: 2, Failures: 0, Errors: 0, Skipped: 0, Time elapsed: 1.807 sec
Running org.apache.activemq.MessageEvictionTest
Tests run: 3, Failures: 0, Errors: 0, Skipped: 0, Time elapsed: 118.983 sec
Running org.apache.activemq.xbean.ConnectorXBeanConfigTest
Tests run: 3, Failures: 0, Errors: 0, Skipped: 0, Time elapsed: 14.995 sec
Running org.apache.activemq.openwire.v3.PartialCommandTest
Tests run: 1, Failures: 0, Errors: 0, Skipped: 0, Time elapsed: 0.167 sec
Running org.apache.activemq.RemoveDestinationTest
Tests run: 2, Failures: 0, Errors: 0, Skipped: 0, Time elapsed: 20.096 sec
Running org.apache.activemq.config.BrokerPropertiesTest
Tests run: 1, Failures: 0, Errors: 0, Skipped: 0, Time elapsed: 0.226 sec
Running org.apache.activemq.openwire.v6.FlushCommandTest
Tests run: 1, Failures: 0, Errors: 0, Skipped: 0, Time elapsed: 0.185 sec
Running org.apache.activemq.openwire.v4.ConsumerControlTest
Tests run: 1, Failures: 0, Errors: 0, Skipped: 0, Time elapsed: 0.183 sec
Running org.apache.activemq.network.DemandForwardingBridgeFilterTest
Tests run: 5, Failures: 0, Errors: 0, Skipped: 0, Time elapsed: 24.823 sec
Running org.apache.activemq.bugs.AMQ2356Test
Tests run: 1, Failures: 0, Errors: 0, Skipped: 0, Time elapsed: 18.694 sec
Running org.apache.activemq.JmsQueueBrowserTest
Tests run: 3, Failures: 0, Errors: 0, Skipped: 0, Time elapsed: 2.292 sec
Running org.apache.activemq.command.ActiveMQObjectMessageTest
Tests run: 5, Failures: 0, Errors: 0, Skipped: 0, Time elapsed: 0.074 sec
Running org.apache.activemq.bugs.AMQ2084Test
Tests run: 2, Failures: 0, Errors: 0, Skipped: 0, Time elapsed: 8.913 sec
Running org.apache.activemq.openwire.v6.SessionIdTest
Tests run: 1, Failures: 0, Errors: 0, Skipped: 0, Time elapsed: 0.182 sec
Running org.apache.activemq.openwire.v2.MessageIdTest
Tests run: 1, Failures: 0, Errors: 0, Skipped: 0, Time elapsed: 0.191 sec
Running org.apache.activemq.xbean.JDBCPersistenceXBeanConfigTest
Tests run: 1, Failures: 0, Errors: 0, Skipped: 0, Time elapsed: 2.994 sec
Running org.apache.activemq.openwire.v1.RemoveSubscriptionInfoTest
Tests run: 1, Failures: 0, Errors: 0, Skipped: 0, Time elapsed: 0.195 sec
Running org.apache.activemq.transport.failover.FailoverTimeoutTest
Tests run: 1, Failures: 0, Errors: 0, Skipped: 0, Time elapsed: 7.401 sec
Running org.apache.activemq.JmsQueueTransactionTest
Tests run: 17, Failures: 0, Errors: 0, Skipped: 0, Time elapsed: 12.603 sec
Running org.apache.activemq.JmsTopicWildcardSendReceiveTest
Tests run: 4, Failures: 0, Errors: 0, Skipped: 0, Time elapsed: 2.104 sec
Running org.apache.activemq.test.JmsTopicSendReceiveWithTwoConnectionsTest
Tests run: 1, Failures: 0, Errors: 0, Skipped: 0, Time elapsed: 1.817 sec
Running org.apache.activemq.openwire.v6.ConsumerInfoTest
Tests run: 1, Failures: 0, Errors: 0, Skipped: 0, Time elapsed: 0.206 sec
Running org.apache.activemq.JmsAutoAckTest
Tests run: 1, Failures: 0, Errors: 0, Skipped: 0, Time elapsed: 1.852 sec
Running org.apache.activemq.usecases.ObjectMessageNotSerializableTest
Tests run: 1, Failures: 0, Errors: 0, Skipped: 0, Time elapsed: 1.502 sec
Running org.apache.activemq.openwire.v6.ProducerInfoTest
Tests run: 1, Failures: 0, Errors: 0, Skipped: 0, Time elapsed: 0.185 sec
Running org.apache.activemq.usecases.UnlimitedEnqueueTest
Tests run: 1, Failures: 0, Errors: 0, Skipped: 0, Time elapsed: 55.753 sec
Running org.apache.activemq.xbean.MultipleTestsWithEmbeddedBrokerTest
Tests run: 2, Failures: 0, Errors: 0, Skipped: 0, Time elapsed: 0.735 sec
Running org.apache.activemq.management.BoundaryStatisticTest
Tests run: 1, Failures: 0, Errors: 0, Skipped: 0, Time elapsed: 0.134 sec
Running org.apache.activemq.openwire.v3.ProducerAckTest
Tests run: 1, Failures: 0, Errors: 0, Skipped: 0, Time elapsed: 0.193 sec
Running org.apache.activemq.transport.vm.VMTransportEmbeddedBrokerTest
Tests run: 1, Failures: 0, Errors: 0, Skipped: 0, Time elapsed: 0.627 sec
Running org.apache.activemq.openwire.v5.LastPartialCommandTest
Tests run: 1, Failures: 0, Errors: 0, Skipped: 0, Time elapsed: 0.166 sec
Running org.apache.activemq.test.JmsTopicSendReceiveWithTwoConnectionsAndByteSelectorTest
Tests run: 1, Failures: 0, Errors: 0, Skipped: 0, Time elapsed: 1.764 sec
Running org.apache.activemq.broker.ReconnectWithJMXEnabledTest
Tests run: 1, Failures: 0, Errors: 0, Skipped: 0, Time elapsed: 4.611 sec
Running org.apache.activemq.xbean.XBeanConfigTest
Tests run: 1, Failures: 0, Errors: 0, Skipped: 0, Time elapsed: 1.506 sec
Running org.apache.activemq.util.BitArrayBinTest
Tests run: 3, Failures: 0, Errors: 0, Skipped: 0, Time elapsed: 0.218 sec
Running org.apache.activemq.openwire.v3.ConsumerInfoTest
Tests run: 1, Failures: 0, Errors: 0, Skipped: 0, Time elapsed: 0.203 sec
Running org.apache.activemq.broker.region.cursors.NegativeQueueTest
Tests run: 7, Failures: 0, Errors: 0, Skipped: 0, Time elapsed: 303.784 sec
Running org.apache.activemq.openwire.v1.MessageAckTest
Tests run: 1, Failures: 0, Errors: 0, Skipped: 0, Time elapsed: 0.196 sec
Running org.apache.activemq.JmsSessionRecoverTest
Tests run: 6, Failures: 0, Errors: 0, Skipped: 0, Time elapsed: 1.038 sec
Running org.apache.activemq.openwire.v2.ConnectionInfoTest
Tests run: 1, Failures: 0, Errors: 0, Skipped: 0, Time elapsed: 0.172 sec
Running org.apache.activemq.broker.scheduler.JmsSchedulerTest
Tests run: 4, Failures: 0, Errors: 0, Skipped: 0, Time elapsed: 82.318 sec
Running org.apache.activemq.openwire.v6.ConnectionControlTest
Tests run: 1, Failures: 0, Errors: 0, Skipped: 0, Time elapsed: 0.17 sec
Running org.apache.activemq.broker.region.cursors.StoreQueueCursorNoDuplicateTest
Tests run: 1, Failures: 0, Errors: 0, Skipped: 0, Time elapsed: 1.519 sec
Running org.apache.activemq.openwire.v3.JournalTransactionTest
Tests run: 1, Failures: 0, Errors: 0, Skipped: 0, Time elapsed: 0.168 sec
Running org.apache.activemq.openwire.v3.ResponseTest
Tests run: 1, Failures: 0, Errors: 0, Skipped: 0, Time elapsed: 0.179 sec
Running org.apache.activemq.usecases.MessageGroupNewConsumerTest
Tests run: 1, Failures: 0, Errors: 0, Skipped: 0, Time elapsed: 4.128 sec
Running org.apache.activemq.openwire.v1.ConsumerControlTest
Tests run: 1, Failures: 0, Errors: 0, Skipped: 0, Time elapsed: 0.181 sec
Running org.apache.activemq.openwire.v4.MessageAckTest
Tests run: 1, Failures: 0, Errors: 0, Skipped: 0, Time elapsed: 0.193 sec
Running org.apache.activemq.openwire.v4.ProducerIdTest
Tests run: 1, Failures: 0, Errors: 0, Skipped: 0, Time elapsed: 0.186 sec
Running org.apache.activemq.JmsQueueTopicCompositeSendReceiveTest
Tests run: 1, Failures: 0, Errors: 0, Skipped: 0, Time elapsed: 1.788 sec
Running org.apache.activemq.transport.discovery.DiscoveryNetworkReconnectTest
Tests run: 2, Failures: 0, Errors: 0, Skipped: 0, Time elapsed: 37.199 sec
Running org.apache.activemq.bugs.AMQ2102Test
Tests run: 2, Failures: 0, Errors: 0, Skipped: 0, Time elapsed: 250.066 sec
Running org.apache.activemq.broker.BrokerServiceTest
Tests run: 5, Failures: 0, Errors: 0, Skipped: 0, Time elapsed: 4.604 sec
Running org.apache.activemq.ProducerFlowControlSendFailTest
Tests run: 7, Failures: 0, Errors: 0, Skipped: 0, Time elapsed: 14.557 sec
Running org.apache.activemq.ProducerFlowControlTest
Tests run: 6, Failures: 0, Errors: 0, Skipped: 0, Time elapsed: 25.688 sec
Running org.apache.activemq.broker.virtual.VirtualTopicsAndDurableSubsTest
Tests run: 7, Failures: 0, Errors: 0, Skipped: 0, Time elapsed: 14.75 sec
Running org.apache.activemq.openwire.v5.MessageDispatchTest
Tests run: 1, Failures: 0, Errors: 0, Skipped: 0, Time elapsed: 0.207 sec
Running org.apache.activemq.network.DuplexNetworkMBeanTest
Tests run: 2, Failures: 0, Errors: 0, Skipped: 0, Time elapsed: 23.746 sec
Running org.apache.activemq.openwire.v1.JournalTransactionTest
Tests run: 1, Failures: 0, Errors: 0, Skipped: 0, Time elapsed: 0.179 sec
Running org.apache.activemq.management.BoundedRangeStatisticTest
Tests run: 1, Failures: 0, Errors: 0, Skipped: 0, Time elapsed: 0.619 sec
Running org.apache.activemq.JmsSendReceiveWithMessageExpirationTest
Tests run: 4, Failures: 0, Errors: 0, Skipped: 0, Time elapsed: 15.069 sec
Running org.apache.activemq.transport.TopicClusterTest
Build timed out. Aborting
[locks-and-latches] Releasing all the locks
[locks-and-latches] All the locks released
ERROR: Failed to parse POMs
hudson.remoting.ChannelClosedException: channel is already closed
	at hudson.remoting.Channel.send(Channel.java:412)
	at hudson.remoting.ProxyOutputStream.write(ProxyOutputStream.java:112)
	at hudson.remoting.ProxyOutputStream.write(ProxyOutputStream.java:100)
	at hudson.remoting.RemoteOutputStream.write(RemoteOutputStream.java:110)
	at java.io.BufferedOutputStream.flushBuffer(BufferedOutputStream.java:65)
	at java.io.BufferedOutputStream.flush(BufferedOutputStream.java:123)
	at java.io.BufferedOutputStream.flush(BufferedOutputStream.java:124)
	at java.io.ObjectOutputStream$BlockDataOutputStream.flush(ObjectOutputStream.java:1784)
	at java.io.ObjectOutputStream.flush(ObjectOutputStream.java:691)
	at hudson.remoting.Channel.send(Channel.java:418)
	at hudson.remoting.Request.call(Request.java:149)
	at hudson.remoting.Channel.call(Channel.java:551)
	at hudson.maven.ProcessCache$MavenProcess.call(ProcessCache.java:156)
	at hudson.maven.MavenModuleSetBuild$RunnerImpl.doRun(MavenModuleSetBuild.java:480)
	at hudson.model.AbstractBuild$AbstractRunner.run(AbstractBuild.java:416)
	at hudson.model.Run.run(Run.java:1243)
	at hudson.maven.MavenModuleSetBuild.run(MavenModuleSetBuild.java:304)
	at hudson.model.ResourceController.execute(ResourceController.java:88)
	at hudson.model.Executor.run(Executor.java:122)
FATAL: channel is already closed
hudson.remoting.ChannelClosedException: channel is already closed
	at hudson.remoting.Channel.send(Channel.java:412)
	at hudson.remoting.Request.call(Request.java:105)
	at hudson.remoting.Channel.call(Channel.java:551)
	at hudson.Launcher$RemoteLauncher.kill(Launcher.java:735)
	at hudson.model.AbstractBuild$AbstractRunner.run(AbstractBuild.java:421)
	at hudson.model.Run.run(Run.java:1243)
	at hudson.maven.MavenModuleSetBuild.run(MavenModuleSetBuild.java:304)
	at hudson.model.ResourceController.execute(ResourceController.java:88)
	at hudson.model.Executor.run(Executor.java:122)


Mime
View raw message