activemq-dev mailing list archives

Site index · List index
Message view « Date » · « Thread »
Top « Date » · « Thread »
From Apache Hudson Server <hud...@hudson.zones.apache.org>
Subject Build failed in Hudson: ActiveMQ #371
Date Fri, 11 Jun 2010 05:36:37 GMT
See <http://hudson.zones.apache.org/hudson/job/ActiveMQ/371/changes>

Changes:

[dejanb] first stab at resolving https://issues.apache.org/activemq/browse/AMQ-2695

[dejanb] https://issues.apache.org/activemq/browse/AMQ-2665 - additional fix

------------------------------------------
[...truncated 6073 lines...]
Running org.apache.activemq.openwire.v4.BrokerInfoTest
Tests run: 1, Failures: 0, Errors: 0, Skipped: 0, Time elapsed: 0.173 sec
Running org.apache.activemq.store.kahadb.plist.PListTest
Tests run: 7, Failures: 0, Errors: 0, Skipped: 0, Time elapsed: 6.414 sec
Running org.apache.activemq.JmsClientAckTest
Tests run: 3, Failures: 0, Errors: 0, Skipped: 0, Time elapsed: 2.899 sec
Running org.apache.activemq.openwire.v4.ConnectionControlTest
Tests run: 1, Failures: 0, Errors: 0, Skipped: 0, Time elapsed: 0.171 sec
Running org.apache.activemq.openwire.v3.RemoveSubscriptionInfoTest
Tests run: 1, Failures: 0, Errors: 0, Skipped: 0, Time elapsed: 0.183 sec
Running org.apache.activemq.usecases.TransactionTest
Tests run: 1, Failures: 0, Errors: 0, Skipped: 0, Time elapsed: 0.686 sec
Running org.apache.activemq.usecases.MessageGroupDelayedTest
Tests run: 6, Failures: 0, Errors: 0, Skipped: 0, Time elapsed: 30.663 sec
Running org.apache.activemq.broker.region.cursors.StoreQueueCursorMemoryNoDuplicateTest
Tests run: 1, Failures: 0, Errors: 0, Skipped: 0, Time elapsed: 0.376 sec
Running org.apache.activemq.JmsQueueSelectorTest
Tests run: 2, Failures: 0, Errors: 0, Skipped: 0, Time elapsed: 2.825 sec
Running org.apache.activemq.util.DataByteArrayOutputStreamTest
Tests run: 1, Failures: 0, Errors: 0, Skipped: 0, Time elapsed: 0.04 sec
Running org.apache.activemq.PerDestinationStoreLimitTest
Running org.apache.activemq.command.ActiveMQMessageTest
Tests run: 49, Failures: 0, Errors: 0, Skipped: 0, Time elapsed: 0.261 sec
Running org.apache.activemq.thread.PooledTaskRunnerTest
Tests run: 3, Failures: 0, Errors: 0, Skipped: 0, Time elapsed: 0.229 sec
Running org.apache.activemq.ActiveMQInputStreamTest
Tests run: 1, Failures: 0, Errors: 1, Skipped: 0, Time elapsed: 0.197 sec <<< FAILURE!
Running org.apache.activemq.JmsQueueSendReceiveUsingTwoSessionsTest
Tests run: 1, Failures: 0, Errors: 0, Skipped: 0, Time elapsed: 1.792 sec
Running org.apache.activemq.transport.fanout.FanoutTransportBrokerTest
Tests run: 6, Failures: 0, Errors: 6, Skipped: 0, Time elapsed: 0.234 sec <<< FAILURE!
Running org.apache.activemq.openwire.v2.ControlCommandTest
Tests run: 1, Failures: 0, Errors: 0, Skipped: 0, Time elapsed: 0.183 sec
Running org.apache.activemq.bugs.AMQ2413Test
Tests run: 8, Failures: 0, Errors: 2, Skipped: 0, Time elapsed: 295.025 sec <<< FAILURE!
Running org.apache.activemq.transport.failover.FailoverUriTest
Tests run: 13, Failures: 0, Errors: 13, Skipped: 0, Time elapsed: 0.212 sec <<< FAILURE!
Running org.apache.activemq.JmsRedeliveredTest
Tests run: 18, Failures: 0, Errors: 0, Skipped: 0, Time elapsed: 2.681 sec
Running org.apache.activemq.spring.Spring2XmlNamespacesWithoutRemoteSchemaTest
Tests run: 1, Failures: 0, Errors: 0, Skipped: 0, Time elapsed: 5.25 sec
Running org.apache.activemq.openwire.v2.ActiveMQMessageTest
Tests run: 1, Failures: 0, Errors: 0, Skipped: 0, Time elapsed: 0.222 sec
Running org.apache.activemq.broker.virtual.FilteredQueueTest
Tests run: 1, Failures: 0, Errors: 0, Skipped: 0, Time elapsed: 4.208 sec
Running org.apache.activemq.bugs.AMQ2571Test
Tests run: 1, Failures: 0, Errors: 0, Skipped: 0, Time elapsed: 0.518 sec
Running org.apache.activemq.transport.vm.VMTransportWaitForTest
Tests run: 1, Failures: 0, Errors: 1, Skipped: 0, Time elapsed: 2.198 sec <<< FAILURE!
Running org.apache.activemq.usecases.MessageReroutingTest
Tests run: 2, Failures: 0, Errors: 2, Skipped: 0, Time elapsed: 2.104 sec <<< FAILURE!
Running org.apache.activemq.openwire.v1.FlushCommandTest
Tests run: 1, Failures: 0, Errors: 0, Skipped: 0, Time elapsed: 0.172 sec
Running org.apache.activemq.openwire.v1.DataArrayResponseTest
Tests run: 1, Failures: 0, Errors: 0, Skipped: 0, Time elapsed: 0.179 sec
Running org.apache.activemq.openwire.v6.ConsumerControlTest
Tests run: 1, Failures: 0, Errors: 0, Skipped: 0, Time elapsed: 0.19 sec
Running org.apache.activemq.openwire.v3.XATransactionIdTest
Tests run: 1, Failures: 0, Errors: 0, Skipped: 0, Time elapsed: 0.172 sec
Running org.apache.activemq.openwire.v3.MessagePullTest
Tests run: 1, Failures: 0, Errors: 0, Skipped: 0, Time elapsed: 0.2 sec
Running org.apache.activemq.blob.FTPBlobDownloadStrategyTest
Tests run: 3, Failures: 0, Errors: 0, Skipped: 0, Time elapsed: 1.99 sec
Running org.apache.activemq.usecases.PublishOnTemporaryQueueConsumedMessageTest
Tests run: 1, Failures: 0, Errors: 0, Skipped: 0, Time elapsed: 1.738 sec
Running org.apache.activemq.transport.reliable.ReliableTransportTest
Tests run: 7, Failures: 0, Errors: 0, Skipped: 0, Time elapsed: 0.204 sec
Running org.apache.activemq.openwire.v5.ConnectionControlTest
Tests run: 1, Failures: 0, Errors: 0, Skipped: 0, Time elapsed: 0.172 sec
Running org.apache.activemq.openwire.v3.MessageDispatchNotificationTest
Tests run: 1, Failures: 0, Errors: 0, Skipped: 0, Time elapsed: 0.201 sec
Running org.apache.activemq.broker.message.security.MessageAuthenticationTest
Tests run: 1, Failures: 0, Errors: 0, Skipped: 0, Time elapsed: 0.796 sec
Running org.apache.activemq.network.NetworkRemovesSubscriptionsTest
Tests run: 5, Failures: 0, Errors: 5, Skipped: 0, Time elapsed: 0.259 sec <<< FAILURE!
Running org.apache.activemq.xbean.ApplicationContextAwareTest
Tests run: 3, Failures: 0, Errors: 0, Skipped: 0, Time elapsed: 9.494 sec
Running org.apache.activemq.usecases.DurableSubscriptionReactivationTest
Tests run: 2, Failures: 0, Errors: 0, Skipped: 0, Time elapsed: 0.933 sec
Running org.apache.activemq.broker.ft.MasterSlaveSlaveDieTest
Tests run: 1, Failures: 0, Errors: 0, Skipped: 0, Time elapsed: 2.504 sec
Running org.apache.activemq.network.NetworkBrokerDetachTest
Tests run: 2, Failures: 2, Errors: 0, Skipped: 0, Time elapsed: 69.735 sec <<< FAILURE!
Running org.apache.activemq.openwire.v2.JournalTopicAckTest
Tests run: 1, Failures: 0, Errors: 0, Skipped: 0, Time elapsed: 0.194 sec
Running org.apache.activemq.openwire.v1.ProducerInfoTest
Tests run: 1, Failures: 0, Errors: 0, Skipped: 0, Time elapsed: 0.195 sec
Running org.apache.activemq.transport.stomp.StompTest
Tests run: 41, Failures: 0, Errors: 0, Skipped: 0, Time elapsed: 116.485 sec
Running org.apache.activemq.test.TemporaryDestinationToFromNameTest
Tests run: 2, Failures: 0, Errors: 0, Skipped: 0, Time elapsed: 0.708 sec
Running org.apache.activemq.openwire.v3.ExceptionResponseTest
Tests run: 1, Failures: 0, Errors: 0, Skipped: 0, Time elapsed: 0.178 sec
Running org.apache.activemq.ExclusiveConsumerTest
Tests run: 6, Failures: 0, Errors: 0, Skipped: 0, Time elapsed: 2.825 sec
Running org.apache.activemq.store.kahadb.KahaDBTest
Tests run: 4, Failures: 0, Errors: 0, Skipped: 0, Time elapsed: 9.491 sec
Running org.apache.activemq.broker.region.group.MessageGroupMapTest
Tests run: 2, Failures: 0, Errors: 0, Skipped: 0, Time elapsed: 0.061 sec
Running org.apache.activemq.transport.tcp.SslTransportFactoryTest
Tests run: 2, Failures: 1, Errors: 0, Skipped: 0, Time elapsed: 0.483 sec <<< FAILURE!
Running org.apache.activemq.store.jdbc.JDBCNegativeQueueTest
Tests run: 7, Failures: 0, Errors: 0, Skipped: 0, Time elapsed: 305.699 sec
Running org.apache.activemq.JMSQueueRedeliverTest
Tests run: 1, Failures: 0, Errors: 0, Skipped: 0, Time elapsed: 0.695 sec
Running org.apache.activemq.filter.BadDummyPolicyConfigTest
Tests run: 3, Failures: 0, Errors: 0, Skipped: 0, Time elapsed: 0.174 sec
Running org.apache.activemq.store.jdbc.JDBCPersistenceAdapterTest
Tests run: 2, Failures: 0, Errors: 0, Skipped: 0, Time elapsed: 3.232 sec
Running org.apache.activemq.bugs.MessageExpirationReaperTest
Tests run: 2, Failures: 0, Errors: 2, Skipped: 0, Time elapsed: 0.196 sec <<< FAILURE!
Running org.apache.activemq.openwire.v1.ActiveMQStreamMessageTest
Tests run: 1, Failures: 0, Errors: 0, Skipped: 0, Time elapsed: 0.222 sec
Running org.apache.activemq.security.AuthorizationMapTest
Tests run: 2, Failures: 0, Errors: 0, Skipped: 0, Time elapsed: 0.056 sec
Running org.apache.activemq.openwire.v5.ConnectionIdTest
Tests run: 1, Failures: 0, Errors: 0, Skipped: 0, Time elapsed: 0.177 sec
Running org.apache.activemq.broker.SpringTest
Tests run: 1, Failures: 0, Errors: 1, Skipped: 0, Time elapsed: 0.471 sec <<< FAILURE!
Running org.apache.activemq.openwire.v2.ActiveMQTempQueueTest
Tests run: 1, Failures: 0, Errors: 0, Skipped: 0, Time elapsed: 0.172 sec
Running org.apache.activemq.CreateConsumerButDontStartConnectionWarningTest
Tests run: 1, Failures: 0, Errors: 0, Skipped: 0, Time elapsed: 2.721 sec
Running org.apache.activemq.broker.CreateDestinationsOnStartupViaXBeanTest
Tests run: 1, Failures: 0, Errors: 0, Skipped: 0, Time elapsed: 3.365 sec
Running org.apache.activemq.usecases.NoDuplicateOnTopicNetworkTest
Tests run: 4, Failures: 0, Errors: 0, Skipped: 0, Time elapsed: 66.929 sec
Running org.apache.activemq.usecases.JDBCDurableSubscriptionTest
Tests run: 9, Failures: 1, Errors: 0, Skipped: 0, Time elapsed: 18.228 sec <<< FAILURE!
Running org.apache.activemq.usecases.CompositePublishTest
Tests run: 1, Failures: 0, Errors: 0, Skipped: 0, Time elapsed: 63.506 sec
Running org.apache.activemq.openwire.v1.ActiveMQTempQueueTest
Tests run: 1, Failures: 0, Errors: 0, Skipped: 0, Time elapsed: 0.182 sec
Running org.apache.activemq.command.MessageTest
Tests run: 6, Failures: 0, Errors: 0, Skipped: 0, Time elapsed: 0.209 sec
Running org.apache.activemq.usage.MemoryUsageTest
Tests run: 2, Failures: 0, Errors: 0, Skipped: 0, Time elapsed: 0.165 sec
Running org.apache.activemq.test.rollback.CloseRollbackRedeliveryQueueTest
Tests run: 3, Failures: 0, Errors: 0, Skipped: 0, Time elapsed: 0.97 sec
Running org.apache.activemq.transport.tcp.SslBrokerServiceTest
Tests run: 131, Failures: 0, Errors: 0, Skipped: 0, Time elapsed: 657.471 sec
Running org.apache.activemq.openwire.v2.ConnectionErrorTest
Tests run: 1, Failures: 0, Errors: 0, Skipped: 0, Time elapsed: 0.179 sec
Running org.apache.activemq.usecases.StartAndStopClientAndBrokerDoesNotLeaveThreadsRunningTest
Tests run: 1, Failures: 0, Errors: 0, Skipped: 0, Time elapsed: 2.7 sec
Running org.apache.activemq.openwire.v2.ResponseTest
Tests run: 1, Failures: 0, Errors: 0, Skipped: 0, Time elapsed: 0.178 sec
Running org.apache.activemq.broker.region.cursors.StoreQueueCursorKahaDBNoDuplicateTest
Tests run: 1, Failures: 0, Errors: 0, Skipped: 0, Time elapsed: 0.838 sec
Running org.apache.activemq.test.message.NestedMapAndListPropertyTest
Tests run: 1, Failures: 0, Errors: 1, Skipped: 0, Time elapsed: 0.164 sec <<< FAILURE!
Running org.apache.activemq.OnePrefetchAsyncConsumerTest
Tests run: 1, Failures: 0, Errors: 1, Skipped: 0, Time elapsed: 0.184 sec <<< FAILURE!
Running org.apache.activemq.network.DemandForwardingBridgeTest
Tests run: 6, Failures: 0, Errors: 0, Skipped: 0, Time elapsed: 4.59 sec
Running org.apache.activemq.broker.scheduler.JobSchedulerStoreTest
Tests run: 1, Failures: 0, Errors: 0, Skipped: 0, Time elapsed: 1.712 sec
Running org.apache.activemq.command.MessageSendTest
Tests run: 2, Failures: 0, Errors: 0, Skipped: 0, Time elapsed: 0.199 sec
Running org.apache.activemq.openwire.v5.RemoveSubscriptionInfoTest
Tests run: 1, Failures: 0, Errors: 0, Skipped: 0, Time elapsed: 0.179 sec
Running org.apache.activemq.JmsClientAckListenerTest
Tests run: 2, Failures: 0, Errors: 0, Skipped: 0, Time elapsed: 21.816 sec
Running org.apache.activemq.bugs.AMQ2314Test
Tests run: 2, Failures: 0, Errors: 2, Skipped: 0, Time elapsed: 0.186 sec <<< FAILURE!
Running org.apache.activemq.broker.DoubleSubscriptionTest
Tests run: 1, Failures: 0, Errors: 0, Skipped: 0, Time elapsed: 2.57 sec
Running org.apache.activemq.thread.TaskRunnerTest
Tests run: 2, Failures: 0, Errors: 0, Skipped: 0, Time elapsed: 0.541 sec
Running org.apache.activemq.openwire.v6.JournalQueueAckTest
Tests run: 1, Failures: 0, Errors: 0, Skipped: 0, Time elapsed: 0.203 sec
Running org.apache.activemq.JmsQueueCompositeSendReceiveTest
Tests run: 2, Failures: 0, Errors: 0, Skipped: 0, Time elapsed: 2.065 sec
Running org.apache.activemq.memory.buffer.SizeBasedMessageBufferTest
Tests run: 1, Failures: 0, Errors: 0, Skipped: 0, Time elapsed: 0.14 sec
Running org.apache.activemq.openwire.v2.ProducerInfoTest
Tests run: 1, Failures: 0, Errors: 0, Skipped: 0, Time elapsed: 0.194 sec
Running org.apache.activemq.openwire.v3.ConsumerControlTest
Tests run: 1, Failures: 0, Errors: 0, Skipped: 0, Time elapsed: 0.176 sec
Running org.apache.activemq.advisory.TempQueueMemoryTest
Tests run: 2, Failures: 0, Errors: 0, Skipped: 0, Time elapsed: 34.036 sec
Running org.apache.activemq.openwire.v3.JournalQueueAckTest
Tests run: 1, Failures: 0, Errors: 0, Skipped: 0, Time elapsed: 0.206 sec
Running org.apache.activemq.test.message.NestedMapMessageTest
Tests run: 1, Failures: 0, Errors: 1, Skipped: 0, Time elapsed: 0.172 sec <<< FAILURE!
Running org.apache.activemq.openwire.v4.MessageDispatchTest
Tests run: 1, Failures: 0, Errors: 0, Skipped: 0, Time elapsed: 0.254 sec
Running org.apache.activemq.broker.policy.DestinationCursorConfigTest
Tests run: 2, Failures: 0, Errors: 0, Skipped: 0, Time elapsed: 1.779 sec
Running org.apache.activemq.transport.tcp.InactivityMonitorTest
Tests run: 3, Failures: 0, Errors: 2, Skipped: 0, Time elapsed: 0.432 sec <<< FAILURE!
Running org.apache.activemq.ActiveMQConnectionFactoryTest
Tests run: 12, Failures: 0, Errors: 0, Skipped: 0, Time elapsed: 10.565 sec
Running org.apache.activemq.openwire.v1.ShutdownInfoTest
Tests run: 1, Failures: 0, Errors: 0, Skipped: 0, Time elapsed: 0.185 sec
Running org.apache.activemq.openwire.v2.MessageDispatchTest
Tests run: 1, Failures: 0, Errors: 0, Skipped: 0, Time elapsed: 0.207 sec
Running org.apache.activemq.usecases.StartAndStopBrokerTest
Tests run: 1, Failures: 0, Errors: 0, Skipped: 0, Time elapsed: 8.095 sec
Running org.apache.activemq.openwire.v3.MessageAckTest
Tests run: 1, Failures: 0, Errors: 0, Skipped: 0, Time elapsed: 0.195 sec
Running org.apache.activemq.store.kahadb.KahaDBStoreOrderTest
Tests run: 1, Failures: 0, Errors: 0, Skipped: 0, Time elapsed: 3.272 sec
Running org.apache.activemq.filter.DestinationFilterTest
Tests run: 3, Failures: 0, Errors: 0, Skipped: 0, Time elapsed: 0.073 sec
Running org.apache.activemq.broker.ft.JDBCQueueMasterSlaveTest
Tests run: 1, Failures: 0, Errors: 0, Skipped: 0, Time elapsed: 33.654 sec
Running org.apache.activemq.openwire.v1.RemoveInfoTest
Tests run: 1, Failures: 0, Errors: 0, Skipped: 0, Time elapsed: 0.231 sec
Running org.apache.activemq.openwire.v3.TransactionInfoTest
Tests run: 1, Failures: 0, Errors: 0, Skipped: 0, Time elapsed: 0.181 sec
Running org.apache.activemq.usecases.ThreeBrokerQueueNetworkTest
Tests run: 13, Failures: 0, Errors: 13, Skipped: 0, Time elapsed: 0.277 sec <<< FAILURE!
Running org.apache.activemq.bugs.ConnectionPerMessageTest
Build timed out. Aborting
[locks-and-latches] Releasing all the locks
[locks-and-latches] All the locks released
ERROR: Failed to parse POMs
hudson.remoting.ChannelClosedException: channel is already closed
	at hudson.remoting.Channel.send(Channel.java:412)
	at hudson.remoting.ProxyOutputStream.write(ProxyOutputStream.java:112)
	at hudson.remoting.ProxyOutputStream.write(ProxyOutputStream.java:100)
	at hudson.remoting.RemoteOutputStream.write(RemoteOutputStream.java:110)
	at java.io.BufferedOutputStream.flushBuffer(BufferedOutputStream.java:65)
	at java.io.BufferedOutputStream.flush(BufferedOutputStream.java:123)
	at java.io.BufferedOutputStream.flush(BufferedOutputStream.java:124)
	at java.io.ObjectOutputStream$BlockDataOutputStream.flush(ObjectOutputStream.java:1784)
	at java.io.ObjectOutputStream.flush(ObjectOutputStream.java:691)
	at hudson.remoting.Channel.send(Channel.java:418)
	at hudson.remoting.Request.call(Request.java:149)
	at hudson.remoting.Channel.call(Channel.java:551)
	at hudson.maven.ProcessCache$MavenProcess.call(ProcessCache.java:156)
	at hudson.maven.MavenModuleSetBuild$RunnerImpl.doRun(MavenModuleSetBuild.java:480)
	at hudson.model.AbstractBuild$AbstractRunner.run(AbstractBuild.java:416)
	at hudson.model.Run.run(Run.java:1243)
	at hudson.maven.MavenModuleSetBuild.run(MavenModuleSetBuild.java:304)
	at hudson.model.ResourceController.execute(ResourceController.java:88)
	at hudson.model.Executor.run(Executor.java:122)
FATAL: channel is already closed
hudson.remoting.ChannelClosedException: channel is already closed
	at hudson.remoting.Channel.send(Channel.java:412)
	at hudson.remoting.Request.call(Request.java:105)
	at hudson.remoting.Channel.call(Channel.java:551)
	at hudson.Launcher$RemoteLauncher.kill(Launcher.java:735)
	at hudson.model.AbstractBuild$AbstractRunner.run(AbstractBuild.java:421)
	at hudson.model.Run.run(Run.java:1243)
	at hudson.maven.MavenModuleSetBuild.run(MavenModuleSetBuild.java:304)
	at hudson.model.ResourceController.execute(ResourceController.java:88)
	at hudson.model.Executor.run(Executor.java:122)


Mime
View raw message