activemq-dev mailing list archives

Site index · List index
Message view « Date » · « Thread »
Top « Date » · « Thread »
From Apache Hudson Server <hud...@hudson.zones.apache.org>
Subject Build failed in Hudson: ActiveMQ #378
Date Thu, 17 Jun 2010 17:01:59 GMT
See <http://hudson.zones.apache.org/hudson/job/ActiveMQ/378/changes>

Changes:

[dejanb] https://issues.apache.org/activemq/browse/AMQ-2782 - test case

[rajdavies] Fix for https://issues.apache.org/activemq/browse/AMQ-2475

------------------------------------------
[...truncated 5973 lines...]
Running org.apache.activemq.config.BrokerXmlConfigFromJNDITest
Tests run: 1, Failures: 0, Errors: 0, Skipped: 0, Time elapsed: 3.2 sec
Running org.apache.activemq.JmsDurableTopicSelectorTest
Tests run: 2, Failures: 0, Errors: 0, Skipped: 0, Time elapsed: 7.752 sec
Running org.apache.activemq.usecases.ExpiredMessagesWithNoConsumerTest
Tests run: 7, Failures: 0, Errors: 7, Skipped: 0, Time elapsed: 0.194 sec <<< FAILURE!
Running org.apache.activemq.filter.DestinationMapMemoryTest
Tests run: 2, Failures: 0, Errors: 0, Skipped: 0, Time elapsed: 0.091 sec
Running org.apache.activemq.openwire.v2.ConsumerInfoTest
Tests run: 1, Failures: 0, Errors: 0, Skipped: 0, Time elapsed: 0.2 sec
Running org.apache.activemq.openwire.v5.KeepAliveInfoTest
Tests run: 1, Failures: 0, Errors: 0, Skipped: 0, Time elapsed: 0.17 sec
Running org.apache.activemq.broker.policy.NoConsumerDeadLetterTest
Tests run: 5, Failures: 0, Errors: 0, Skipped: 0, Time elapsed: 1.939 sec
Running org.apache.activemq.usecases.ExceptionListenerTest
Tests run: 1, Failures: 0, Errors: 0, Skipped: 0, Time elapsed: 0.046 sec
Running org.apache.activemq.transport.SoWriteTimeoutTest
Tests run: 3, Failures: 1, Errors: 0, Skipped: 0, Time elapsed: 21.25 sec <<< FAILURE!
Running org.apache.activemq.test.retroactive.RetroactiveConsumerWithMessageQueryTest
Tests run: 1, Failures: 0, Errors: 0, Skipped: 0, Time elapsed: 1.459 sec
Running org.apache.activemq.usecases.ExpiredMessagesTest
Tests run: 3, Failures: 0, Errors: 3, Skipped: 0, Time elapsed: 0.234 sec <<< FAILURE!
Running org.apache.activemq.openwire.v3.ConsumerIdTest
Tests run: 1, Failures: 0, Errors: 0, Skipped: 0, Time elapsed: 0.173 sec
Running org.apache.activemq.transport.tcp.TransportUriTest
Tests run: 8, Failures: 0, Errors: 8, Skipped: 0, Time elapsed: 0.198 sec <<< FAILURE!
Running org.apache.activemq.network.jms.TopicBridgeXBeanTest
Tests run: 1, Failures: 0, Errors: 0, Skipped: 0, Time elapsed: 1.197 sec
Running org.apache.activemq.advisory.TempDestDeleteTest
Tests run: 2, Failures: 0, Errors: 0, Skipped: 0, Time elapsed: 0.849 sec
Running org.apache.activemq.JmsTopicRedeliverTest
Tests run: 1, Failures: 0, Errors: 0, Skipped: 0, Time elapsed: 0.649 sec
Running org.apache.activemq.transport.fanout.FanoutTest
Tests run: 1, Failures: 0, Errors: 1, Skipped: 0, Time elapsed: 0.185 sec <<< FAILURE!
Running org.apache.activemq.usecases.MultiBrokersMultiClientsTest
Tests run: 2, Failures: 0, Errors: 0, Skipped: 0, Time elapsed: 31.406 sec
Running org.apache.activemq.openwire.v4.FlushCommandTest
Tests run: 1, Failures: 0, Errors: 0, Skipped: 0, Time elapsed: 0.173 sec
Running org.apache.activemq.broker.util.PluginBrokerTest
Tests run: 1, Failures: 0, Errors: 0, Skipped: 0, Time elapsed: 2.442 sec
Running org.apache.activemq.openwire.v1.ResponseTest
Tests run: 1, Failures: 0, Errors: 0, Skipped: 0, Time elapsed: 0.169 sec
Running org.apache.activemq.openwire.v2.TransactionInfoTest
Tests run: 1, Failures: 0, Errors: 0, Skipped: 0, Time elapsed: 0.173 sec
Running org.apache.activemq.usecases.PublishOnQueueConsumedMessageUsingActivemqXMLTest
Tests run: 1, Failures: 0, Errors: 1, Skipped: 0, Time elapsed: 2.604 sec <<< FAILURE!
Running org.apache.activemq.openwire.v2.ActiveMQBytesMessageTest
Tests run: 1, Failures: 0, Errors: 0, Skipped: 0, Time elapsed: 0.267 sec
Running org.apache.activemq.jndi.CustomConnectionFactoryNameTest
Tests run: 4, Failures: 0, Errors: 0, Skipped: 0, Time elapsed: 0.162 sec
Running org.apache.activemq.openwire.v6.DestinationInfoTest
Tests run: 1, Failures: 0, Errors: 0, Skipped: 0, Time elapsed: 0.187 sec
Running org.apache.activemq.openwire.v3.LastPartialCommandTest
Tests run: 1, Failures: 0, Errors: 0, Skipped: 0, Time elapsed: 0.173 sec
Running org.apache.activemq.openwire.v3.ReplayCommandTest
Tests run: 1, Failures: 0, Errors: 0, Skipped: 0, Time elapsed: 0.174 sec
Running org.apache.activemq.management.RangeStatisticTest
Tests run: 1, Failures: 0, Errors: 0, Skipped: 0, Time elapsed: 0.61 sec
Running org.apache.activemq.bugs.JmsTimeoutTest
Tests run: 1, Failures: 0, Errors: 1, Skipped: 0, Time elapsed: 0.182 sec <<< FAILURE!
Running org.apache.activemq.openwire.v4.JournalTopicAckTest
Tests run: 1, Failures: 0, Errors: 0, Skipped: 0, Time elapsed: 0.191 sec
Running org.apache.activemq.broker.store.DefaultStoreRecoveryBrokerTest
Tests run: 9, Failures: 0, Errors: 0, Skipped: 0, Time elapsed: 37.633 sec
Running org.apache.activemq.kaha.VolumeTest
Tests run: 1, Failures: 0, Errors: 0, Skipped: 0, Time elapsed: 0.205 sec
Running org.apache.activemq.openwire.v6.KeepAliveInfoTest
Tests run: 1, Failures: 0, Errors: 0, Skipped: 0, Time elapsed: 0.17 sec
Running org.apache.activemq.transport.failover.SlowConnectionTest
Tests run: 1, Failures: 0, Errors: 0, Skipped: 0, Time elapsed: 5.292 sec
Running org.apache.activemq.openwire.v4.MessageIdTest
Tests run: 1, Failures: 0, Errors: 0, Skipped: 0, Time elapsed: 0.171 sec
Running org.apache.activemq.openwire.v2.ActiveMQStreamMessageTest
Tests run: 1, Failures: 0, Errors: 0, Skipped: 0, Time elapsed: 0.247 sec
Running org.apache.activemq.JmsAutoAckListenerTest
Tests run: 1, Failures: 0, Errors: 0, Skipped: 0, Time elapsed: 11.682 sec
Running org.apache.activemq.openwire.v1.ConsumerInfoTest
Tests run: 1, Failures: 0, Errors: 0, Skipped: 0, Time elapsed: 0.207 sec
Running org.apache.activemq.openwire.v3.MessageIdTest
Tests run: 1, Failures: 0, Errors: 0, Skipped: 0, Time elapsed: 0.177 sec
Running org.apache.activemq.openwire.v6.ConsumerIdTest
Tests run: 1, Failures: 0, Errors: 0, Skipped: 0, Time elapsed: 0.176 sec
Running org.apache.activemq.openwire.v1.DataResponseTest
Tests run: 1, Failures: 0, Errors: 0, Skipped: 0, Time elapsed: 0.182 sec
Running org.apache.activemq.openwire.v5.XATransactionIdTest
Tests run: 1, Failures: 0, Errors: 0, Skipped: 0, Time elapsed: 0.174 sec
Running org.apache.activemq.openwire.v6.IntegerResponseTest
Tests run: 1, Failures: 0, Errors: 0, Skipped: 0, Time elapsed: 0.184 sec
Running org.apache.activemq.kaha.impl.async.NioDataFileAppenderTest
Tests run: 5, Failures: 0, Errors: 0, Skipped: 0, Time elapsed: 0.21 sec
Running org.apache.activemq.usecases.ChangeSessionDeliveryModeTest
Tests run: 1, Failures: 0, Errors: 0, Skipped: 0, Time elapsed: 0.646 sec
Running org.apache.activemq.openwire.v4.ExceptionResponseTest
Tests run: 1, Failures: 0, Errors: 0, Skipped: 0, Time elapsed: 0.183 sec
Running org.apache.activemq.kaha.LoadTest
Tests run: 1, Failures: 0, Errors: 0, Skipped: 0, Time elapsed: 12.177 sec
Running org.apache.activemq.openwire.v3.RemoveInfoTest
Tests run: 1, Failures: 0, Errors: 0, Skipped: 0, Time elapsed: 0.188 sec
Running org.apache.activemq.openwire.v4.TransactionInfoTest
Tests run: 1, Failures: 0, Errors: 0, Skipped: 0, Time elapsed: 0.174 sec
Running org.apache.activemq.openwire.v1.MessageDispatchNotificationTest
Tests run: 1, Failures: 0, Errors: 0, Skipped: 0, Time elapsed: 0.186 sec
Running org.apache.activemq.openwire.NumberRangesWhileMarshallingTest
Tests run: 1, Failures: 0, Errors: 0, Skipped: 0, Time elapsed: 0.199 sec
Running org.apache.activemq.openwire.v6.MessageDispatchNotificationTest
Tests run: 1, Failures: 0, Errors: 0, Skipped: 0, Time elapsed: 0.189 sec
Running org.apache.activemq.transport.tcp.SslTransportTest
Tests run: 1, Failures: 0, Errors: 0, Skipped: 0, Time elapsed: 0.134 sec
Running org.apache.activemq.command.MessageCompressionTest
Tests run: 1, Failures: 0, Errors: 0, Skipped: 0, Time elapsed: 4.193 sec
Running org.apache.activemq.openwire.v4.BrokerInfoTest
Tests run: 1, Failures: 0, Errors: 0, Skipped: 0, Time elapsed: 0.173 sec
Running org.apache.activemq.store.kahadb.plist.PListTest
Tests run: 7, Failures: 0, Errors: 0, Skipped: 0, Time elapsed: 10.945 sec
Running org.apache.activemq.JmsClientAckTest
Tests run: 3, Failures: 0, Errors: 0, Skipped: 0, Time elapsed: 2.886 sec
Running org.apache.activemq.openwire.v4.ConnectionControlTest
Tests run: 1, Failures: 0, Errors: 0, Skipped: 0, Time elapsed: 0.183 sec
Running org.apache.activemq.openwire.v3.RemoveSubscriptionInfoTest
Tests run: 1, Failures: 0, Errors: 0, Skipped: 0, Time elapsed: 0.177 sec
Running org.apache.activemq.usecases.KahaDBDurableSubscriptionSelectorTest
Tests run: 1, Failures: 0, Errors: 0, Skipped: 0, Time elapsed: 10.755 sec
Running org.apache.activemq.usecases.TransactionTest
Tests run: 1, Failures: 0, Errors: 0, Skipped: 0, Time elapsed: 0.677 sec
Running org.apache.activemq.usecases.MessageGroupDelayedTest
Tests run: 6, Failures: 0, Errors: 0, Skipped: 0, Time elapsed: 30.668 sec
Running org.apache.activemq.broker.region.cursors.StoreQueueCursorMemoryNoDuplicateTest
Tests run: 1, Failures: 0, Errors: 0, Skipped: 0, Time elapsed: 0.381 sec
Running org.apache.activemq.JmsQueueSelectorTest
Tests run: 2, Failures: 0, Errors: 0, Skipped: 0, Time elapsed: 2.81 sec
Running org.apache.activemq.util.DataByteArrayOutputStreamTest
Tests run: 1, Failures: 0, Errors: 0, Skipped: 0, Time elapsed: 0.043 sec
Running org.apache.activemq.PerDestinationStoreLimitTest
Running org.apache.activemq.command.ActiveMQMessageTest
Tests run: 49, Failures: 0, Errors: 0, Skipped: 0, Time elapsed: 0.227 sec
Running org.apache.activemq.thread.PooledTaskRunnerTest
Tests run: 3, Failures: 0, Errors: 0, Skipped: 0, Time elapsed: 0.204 sec
Running org.apache.activemq.ActiveMQInputStreamTest
Tests run: 1, Failures: 0, Errors: 1, Skipped: 0, Time elapsed: 0.191 sec <<< FAILURE!
Running org.apache.activemq.JmsQueueSendReceiveUsingTwoSessionsTest
Tests run: 1, Failures: 0, Errors: 0, Skipped: 0, Time elapsed: 1.711 sec
Running org.apache.activemq.transport.fanout.FanoutTransportBrokerTest
Tests run: 6, Failures: 0, Errors: 6, Skipped: 0, Time elapsed: 0.203 sec <<< FAILURE!
Running org.apache.activemq.openwire.v2.ControlCommandTest
Tests run: 1, Failures: 0, Errors: 0, Skipped: 0, Time elapsed: 0.186 sec
Running org.apache.activemq.bugs.AMQ2413Test
Tests run: 8, Failures: 0, Errors: 0, Skipped: 0, Time elapsed: 297.955 sec
Running org.apache.activemq.transport.failover.FailoverUriTest
Tests run: 13, Failures: 0, Errors: 13, Skipped: 0, Time elapsed: 0.213 sec <<< FAILURE!
Running org.apache.activemq.JmsRedeliveredTest
Tests run: 18, Failures: 0, Errors: 0, Skipped: 0, Time elapsed: 1.642 sec
Running org.apache.activemq.spring.Spring2XmlNamespacesWithoutRemoteSchemaTest
Tests run: 1, Failures: 0, Errors: 0, Skipped: 0, Time elapsed: 3.204 sec
Running org.apache.activemq.openwire.v2.ActiveMQMessageTest
Tests run: 1, Failures: 0, Errors: 0, Skipped: 0, Time elapsed: 0.211 sec
Running org.apache.activemq.broker.virtual.FilteredQueueTest
Tests run: 1, Failures: 0, Errors: 1, Skipped: 0, Time elapsed: 2.437 sec <<< FAILURE!
Running org.apache.activemq.bugs.AMQ2571Test
Tests run: 1, Failures: 0, Errors: 0, Skipped: 0, Time elapsed: 0.541 sec
Running org.apache.activemq.transport.vm.VMTransportWaitForTest
Tests run: 1, Failures: 0, Errors: 1, Skipped: 0, Time elapsed: 2.175 sec <<< FAILURE!
Running org.apache.activemq.usecases.MessageReroutingTest
Tests run: 2, Failures: 0, Errors: 2, Skipped: 0, Time elapsed: 1.955 sec <<< FAILURE!
Running org.apache.activemq.openwire.v1.FlushCommandTest
Tests run: 1, Failures: 0, Errors: 0, Skipped: 0, Time elapsed: 0.176 sec
Running org.apache.activemq.openwire.v1.DataArrayResponseTest
Tests run: 1, Failures: 0, Errors: 0, Skipped: 0, Time elapsed: 0.194 sec
Running org.apache.activemq.openwire.v6.ConsumerControlTest
Tests run: 1, Failures: 0, Errors: 0, Skipped: 0, Time elapsed: 0.192 sec
Running org.apache.activemq.openwire.v3.XATransactionIdTest
Tests run: 1, Failures: 0, Errors: 0, Skipped: 0, Time elapsed: 0.177 sec
Running org.apache.activemq.openwire.v3.MessagePullTest
Tests run: 1, Failures: 0, Errors: 0, Skipped: 0, Time elapsed: 0.182 sec
Running org.apache.activemq.blob.FTPBlobDownloadStrategyTest
Tests run: 3, Failures: 0, Errors: 0, Skipped: 0, Time elapsed: 1.979 sec
Running org.apache.activemq.usecases.PublishOnTemporaryQueueConsumedMessageTest
Tests run: 1, Failures: 0, Errors: 0, Skipped: 0, Time elapsed: 1.736 sec
Running org.apache.activemq.transport.reliable.ReliableTransportTest
Tests run: 7, Failures: 0, Errors: 0, Skipped: 0, Time elapsed: 0.159 sec
Running org.apache.activemq.openwire.v5.ConnectionControlTest
Tests run: 1, Failures: 0, Errors: 0, Skipped: 0, Time elapsed: 0.177 sec
Running org.apache.activemq.openwire.v3.MessageDispatchNotificationTest
Tests run: 1, Failures: 0, Errors: 0, Skipped: 0, Time elapsed: 0.188 sec
Running org.apache.activemq.broker.message.security.MessageAuthenticationTest
Tests run: 1, Failures: 0, Errors: 0, Skipped: 0, Time elapsed: 0.684 sec
Running org.apache.activemq.network.NetworkRemovesSubscriptionsTest
Tests run: 5, Failures: 0, Errors: 5, Skipped: 0, Time elapsed: 0.248 sec <<< FAILURE!
Running org.apache.activemq.xbean.ApplicationContextAwareTest
Tests run: 3, Failures: 0, Errors: 0, Skipped: 0, Time elapsed: 9.321 sec
Running org.apache.activemq.usecases.DurableSubscriptionReactivationTest
Tests run: 2, Failures: 0, Errors: 0, Skipped: 0, Time elapsed: 0.812 sec
Running org.apache.activemq.broker.ft.MasterSlaveSlaveDieTest
Tests run: 1, Failures: 0, Errors: 0, Skipped: 0, Time elapsed: 2.451 sec
Running org.apache.activemq.network.NetworkBrokerDetachTest
Tests run: 2, Failures: 2, Errors: 0, Skipped: 0, Time elapsed: 69.581 sec <<< FAILURE!
Running org.apache.activemq.openwire.v2.JournalTopicAckTest
Tests run: 1, Failures: 0, Errors: 0, Skipped: 0, Time elapsed: 0.181 sec
Running org.apache.activemq.openwire.v1.ProducerInfoTest
Tests run: 1, Failures: 0, Errors: 0, Skipped: 0, Time elapsed: 0.19 sec
Running org.apache.activemq.transport.stomp.StompTest
Tests run: 41, Failures: 0, Errors: 0, Skipped: 0, Time elapsed: 114.765 sec
Running org.apache.activemq.test.TemporaryDestinationToFromNameTest
Tests run: 2, Failures: 0, Errors: 0, Skipped: 0, Time elapsed: 0.729 sec
Running org.apache.activemq.openwire.v3.ExceptionResponseTest
Tests run: 1, Failures: 0, Errors: 0, Skipped: 0, Time elapsed: 0.178 sec
Running org.apache.activemq.ExclusiveConsumerTest
Tests run: 6, Failures: 0, Errors: 0, Skipped: 0, Time elapsed: 2.754 sec
Running org.apache.activemq.store.kahadb.KahaDBTest
Tests run: 4, Failures: 0, Errors: 0, Skipped: 0, Time elapsed: 13.122 sec
Running org.apache.activemq.broker.region.group.MessageGroupMapTest
Tests run: 2, Failures: 0, Errors: 0, Skipped: 0, Time elapsed: 0.07 sec
Running org.apache.activemq.transport.tcp.SslTransportFactoryTest
Tests run: 2, Failures: 1, Errors: 0, Skipped: 0, Time elapsed: 0.44 sec <<< FAILURE!
Running org.apache.activemq.store.jdbc.JDBCNegativeQueueTest
Build timed out. Aborting
[locks-and-latches] Releasing all the locks
[locks-and-latches] All the locks released
ERROR: Failed to parse POMs
hudson.remoting.ChannelClosedException: channel is already closed
	at hudson.remoting.Channel.send(Channel.java:412)
	at hudson.remoting.ProxyOutputStream.write(ProxyOutputStream.java:112)
	at hudson.remoting.ProxyOutputStream.write(ProxyOutputStream.java:100)
	at hudson.remoting.RemoteOutputStream.write(RemoteOutputStream.java:110)
	at java.io.BufferedOutputStream.flushBuffer(BufferedOutputStream.java:65)
	at java.io.BufferedOutputStream.flush(BufferedOutputStream.java:123)
	at java.io.BufferedOutputStream.flush(BufferedOutputStream.java:124)
	at java.io.ObjectOutputStream$BlockDataOutputStream.flush(ObjectOutputStream.java:1784)
	at java.io.ObjectOutputStream.flush(ObjectOutputStream.java:691)
	at hudson.remoting.Channel.send(Channel.java:418)
	at hudson.remoting.Request.call(Request.java:149)
	at hudson.remoting.Channel.call(Channel.java:551)
	at hudson.maven.ProcessCache$MavenProcess.call(ProcessCache.java:156)
	at hudson.maven.MavenModuleSetBuild$RunnerImpl.doRun(MavenModuleSetBuild.java:480)
	at hudson.model.AbstractBuild$AbstractRunner.run(AbstractBuild.java:416)
	at hudson.model.Run.run(Run.java:1243)
	at hudson.maven.MavenModuleSetBuild.run(MavenModuleSetBuild.java:304)
	at hudson.model.ResourceController.execute(ResourceController.java:88)
	at hudson.model.Executor.run(Executor.java:122)
FATAL: channel is already closed
hudson.remoting.ChannelClosedException: channel is already closed
	at hudson.remoting.Channel.send(Channel.java:412)
	at hudson.remoting.Request.call(Request.java:105)
	at hudson.remoting.Channel.call(Channel.java:551)
	at hudson.Launcher$RemoteLauncher.kill(Launcher.java:735)
	at hudson.model.AbstractBuild$AbstractRunner.run(AbstractBuild.java:421)
	at hudson.model.Run.run(Run.java:1243)
	at hudson.maven.MavenModuleSetBuild.run(MavenModuleSetBuild.java:304)
	at hudson.model.ResourceController.execute(ResourceController.java:88)
	at hudson.model.Executor.run(Executor.java:122)


Mime
View raw message