activemq-dev mailing list archives

Site index · List index
Message view « Date » · « Thread »
Top « Date » · « Thread »
From Apache Hudson Server <hud...@hudson.zones.apache.org>
Subject Build failed in Hudson: ActiveMQ-Trunk-Deploy #66
Date Fri, 04 Jun 2010 04:17:56 GMT
See <http://hudson.zones.apache.org/hudson/job/ActiveMQ-Trunk-Deploy/66/changes>

Changes:

[dejanb] https://issues.apache.org/activemq/browse/AMQ-2753 - additional test

[gnodet] AMQ-2762: Support for blueprint as a custom namespace handler

[gtully] include license text in new files, http://svn.apache.org/viewvc?rev=950515&view=rev

[gtully] add test to veriry loadbalance across network, effect of prefetch on vm client vs
nework consumer, allowed prefetch to be configured via xml property (ie string in schema)
for xml config

------------------------------------------
[...truncated 14670 lines...]
1) org.apache.xbean:xbean-blueprint:jar:3.8-SNAPSHOT

  Try downloading the file manually from the project website.

  Then, install it using the command: 
      mvn install:install-file -DgroupId=org.apache.xbean -DartifactId=xbean-blueprint -Dversion=3.8-SNAPSHOT
-Dpackaging=jar -Dfile=/path/to/file

  Alternatively, if you host your own repository you can deploy the file there: 
      mvn deploy:deploy-file -DgroupId=org.apache.xbean -DartifactId=xbean-blueprint -Dversion=3.8-SNAPSHOT
-Dpackaging=jar -Dfile=/path/to/file -Durl=[url] -DrepositoryId=[id]

  Path to dependency: 
  	1) org.apache.activemq:activemq-blueprint:bundle:5.4-SNAPSHOT
  	2) org.apache.xbean:xbean-blueprint:jar:3.8-SNAPSHOT

----------
1 required artifact is missing.

for artifact: 
  org.apache.activemq:activemq-blueprint:bundle:5.4-SNAPSHOT

from the specified remote repositories:
  central (http://repo1.maven.org/maven2),
  apache.snapshots (https://repository.apache.org/content/repositories/snapshots/),
  com.springsource.repository.bundles.external (http://repository.springsource.com/maven/bundles/external)



[INFO] ------------------------------------------------------------------------
[INFO] Trace
org.apache.maven.lifecycle.LifecycleExecutionException: Missing:
----------
1) org.apache.xbean:xbean-blueprint:jar:3.8-SNAPSHOT

  Try downloading the file manually from the project website.

  Then, install it using the command: 
      mvn install:install-file -DgroupId=org.apache.xbean -DartifactId=xbean-blueprint -Dversion=3.8-SNAPSHOT
-Dpackaging=jar -Dfile=/path/to/file

  Alternatively, if you host your own repository you can deploy the file there: 
      mvn deploy:deploy-file -DgroupId=org.apache.xbean -DartifactId=xbean-blueprint -Dversion=3.8-SNAPSHOT
-Dpackaging=jar -Dfile=/path/to/file -Durl=[url] -DrepositoryId=[id]

  Path to dependency: 
  	1) org.apache.activemq:activemq-blueprint:bundle:5.4-SNAPSHOT
  	2) org.apache.xbean:xbean-blueprint:jar:3.8-SNAPSHOT

----------
1 required artifact is missing.

for artifact: 
  org.apache.activemq:activemq-blueprint:bundle:5.4-SNAPSHOT

from the specified remote repositories:
  central (http://repo1.maven.org/maven2),
  apache.snapshots (https://repository.apache.org/content/repositories/snapshots/),
  com.springsource.repository.bundles.external (http://repository.springsource.com/maven/bundles/external)


	at org.apache.maven.lifecycle.DefaultLifecycleExecutor.executeGoals(DefaultLifecycleExecutor.java:576)
	at org.apache.maven.lifecycle.DefaultLifecycleExecutor.executeGoalWithLifecycle(DefaultLifecycleExecutor.java:500)
	at org.apache.maven.lifecycle.DefaultLifecycleExecutor.executeGoal(DefaultLifecycleExecutor.java:479)
	at org.apache.maven.lifecycle.DefaultLifecycleExecutor.executeGoalAndHandleFailures(DefaultLifecycleExecutor.java:331)
	at org.apache.maven.lifecycle.DefaultLifecycleExecutor.executeTaskSegments(DefaultLifecycleExecutor.java:292)
	at org.apache.maven.lifecycle.DefaultLifecycleExecutor.execute(DefaultLifecycleExecutor.java:142)
	at org.apache.maven.lifecycle.LifecycleExecutorInterceptor.execute(LifecycleExecutorInterceptor.java:65)
	at org.apache.maven.DefaultMaven.doExecute(DefaultMaven.java:336)
	at org.apache.maven.DefaultMaven.execute(DefaultMaven.java:129)
	at org.apache.maven.cli.MavenCli.main(MavenCli.java:301)
	at sun.reflect.NativeMethodAccessorImpl.invoke0(Native Method)
	at sun.reflect.NativeMethodAccessorImpl.invoke(NativeMethodAccessorImpl.java:39)
	at sun.reflect.DelegatingMethodAccessorImpl.invoke(DelegatingMethodAccessorImpl.java:25)
	at java.lang.reflect.Method.invoke(Method.java:592)
	at org.codehaus.classworlds.Launcher.launchEnhanced(Launcher.java:315)
	at org.codehaus.classworlds.Launcher.launch(Launcher.java:255)
	at hudson.maven.agent.Main.launch(Main.java:165)
	at hudson.maven.MavenBuilder.call(MavenBuilder.java:159)
	at hudson.maven.MavenModuleSetBuild$Builder.call(MavenModuleSetBuild.java:688)
	at hudson.maven.MavenModuleSetBuild$Builder.call(MavenModuleSetBuild.java:632)
	at hudson.remoting.UserRequest.perform(UserRequest.java:114)
	at hudson.remoting.UserRequest.perform(UserRequest.java:48)
	at hudson.remoting.Request$2.run(Request.java:270)
	at java.util.concurrent.Executors$RunnableAdapter.call(Executors.java:417)
	at java.util.concurrent.FutureTask$Sync.innerRun(FutureTask.java:269)
	at java.util.concurrent.FutureTask.run(FutureTask.java:123)
	at java.util.concurrent.ThreadPoolExecutor$Worker.runTask(ThreadPoolExecutor.java:651)
	at java.util.concurrent.ThreadPoolExecutor$Worker.run(ThreadPoolExecutor.java:676)
	at java.lang.Thread.run(Thread.java:595)
Caused by: org.apache.maven.artifact.resolver.MultipleArtifactsNotFoundException: Missing:
----------
1) org.apache.xbean:xbean-blueprint:jar:3.8-SNAPSHOT

  Try downloading the file manually from the project website.

  Then, install it using the command: 
      mvn install:install-file -DgroupId=org.apache.xbean -DartifactId=xbean-blueprint -Dversion=3.8-SNAPSHOT
-Dpackaging=jar -Dfile=/path/to/file

  Alternatively, if you host your own repository you can deploy the file there: 
      mvn deploy:deploy-file -DgroupId=org.apache.xbean -DartifactId=xbean-blueprint -Dversion=3.8-SNAPSHOT
-Dpackaging=jar -Dfile=/path/to/file -Durl=[url] -DrepositoryId=[id]

  Path to dependency: 
  	1) org.apache.activemq:activemq-blueprint:bundle:5.4-SNAPSHOT
  	2) org.apache.xbean:xbean-blueprint:jar:3.8-SNAPSHOT

----------
1 required artifact is missing.

for artifact: 
  org.apache.activemq:activemq-blueprint:bundle:5.4-SNAPSHOT

from the specified remote repositories:
  central (http://repo1.maven.org/maven2),
  apache.snapshots (https://repository.apache.org/content/repositories/snapshots/),
  com.springsource.repository.bundles.external (http://repository.springsource.com/maven/bundles/external)


	at org.apache.maven.artifact.resolver.DefaultArtifactResolver.resolveTransitively(DefaultArtifactResolver.java:324)
	at org.apache.maven.artifact.resolver.DefaultArtifactResolver.resolveTransitively(DefaultArtifactResolver.java:288)
	at org.apache.maven.plugin.DefaultPluginManager.resolveTransitiveDependencies(DefaultPluginManager.java:1417)
	at org.apache.maven.plugin.DefaultPluginManager.executeMojo(DefaultPluginManager.java:407)
	at hudson.maven.agent.PluginManagerInterceptor.executeMojo(PluginManagerInterceptor.java:182)
	at org.apache.maven.lifecycle.DefaultLifecycleExecutor.executeGoals(DefaultLifecycleExecutor.java:559)
	... 28 more
[INFO] ------------------------------------------------------------------------
[INFO] Error for project: ActiveMQ :: XMPP (during deploy)
[INFO] ------------------------------------------------------------------------
[INFO] Failed to resolve artifact.

GroupId: org.jvnet.jaxb2.maven2
ArtifactId: maven-jaxb2-plugin
Version: 0.7.2

Reason: Unable to download the artifact from any repository

  org.jvnet.jaxb2.maven2:maven-jaxb2-plugin:pom:0.7.2

from the specified remote repositories:
  central (http://repo1.maven.org/maven2),
  apache.snapshots (https://repository.apache.org/content/repositories/snapshots/),
  com.springsource.repository.bundles.external (http://repository.springsource.com/maven/bundles/external),
  maven2-repository.dev.java.net (http://download.java.net/maven/2),
  maven-repository.dev.java.net (http://download.java.net/maven/1)



[INFO] ------------------------------------------------------------------------
[INFO] Trace
org.apache.maven.lifecycle.LifecycleExecutionException: Unable to build project for plugin
'org.jvnet.jaxb2.maven2:maven-jaxb2-plugin': POM 'org.jvnet.jaxb2.maven2:maven-jaxb2-plugin'
not found in repository: Unable to download the artifact from any repository

  org.jvnet.jaxb2.maven2:maven-jaxb2-plugin:pom:0.7.2

from the specified remote repositories:
  central (http://repo1.maven.org/maven2),
  apache.snapshots (https://repository.apache.org/content/repositories/snapshots/),
  com.springsource.repository.bundles.external (http://repository.springsource.com/maven/bundles/external),
  maven2-repository.dev.java.net (http://download.java.net/maven/2),
  maven-repository.dev.java.net (http://download.java.net/maven/1)

 for project org.jvnet.jaxb2.maven2:maven-jaxb2-plugin
	at org.apache.maven.lifecycle.DefaultLifecycleExecutor.verifyPlugin(DefaultLifecycleExecutor.java:1292)
	at org.apache.maven.lifecycle.DefaultLifecycleExecutor.bindPluginToLifecycle(DefaultLifecycleExecutor.java:1239)
	at org.apache.maven.lifecycle.DefaultLifecycleExecutor.constructLifecycleMappings(DefaultLifecycleExecutor.java:1005)
	at org.apache.maven.lifecycle.DefaultLifecycleExecutor.executeGoal(DefaultLifecycleExecutor.java:478)
	at org.apache.maven.lifecycle.DefaultLifecycleExecutor.executeGoalAndHandleFailures(DefaultLifecycleExecutor.java:331)
	at org.apache.maven.lifecycle.DefaultLifecycleExecutor.executeTaskSegments(DefaultLifecycleExecutor.java:292)
	at org.apache.maven.lifecycle.DefaultLifecycleExecutor.execute(DefaultLifecycleExecutor.java:142)
	at org.apache.maven.lifecycle.LifecycleExecutorInterceptor.execute(LifecycleExecutorInterceptor.java:65)
	at org.apache.maven.DefaultMaven.doExecute(DefaultMaven.java:336)
	at org.apache.maven.DefaultMaven.execute(DefaultMaven.java:129)
	at org.apache.maven.cli.MavenCli.main(MavenCli.java:301)
	at sun.reflect.NativeMethodAccessorImpl.invoke0(Native Method)
	at sun.reflect.NativeMethodAccessorImpl.invoke(NativeMethodAccessorImpl.java:39)
	at sun.reflect.DelegatingMethodAccessorImpl.invoke(DelegatingMethodAccessorImpl.java:25)
	at java.lang.reflect.Method.invoke(Method.java:592)
	at org.codehaus.classworlds.Launcher.launchEnhanced(Launcher.java:315)
	at org.codehaus.classworlds.Launcher.launch(Launcher.java:255)
	at hudson.maven.agent.Main.launch(Main.java:165)
	at hudson.maven.MavenBuilder.call(MavenBuilder.java:159)
	at hudson.maven.MavenModuleSetBuild$Builder.call(MavenModuleSetBuild.java:688)
	at hudson.maven.MavenModuleSetBuild$Builder.call(MavenModuleSetBuild.java:632)
	at hudson.remoting.UserRequest.perform(UserRequest.java:114)
	at hudson.remoting.UserRequest.perform(UserRequest.java:48)
	at hudson.remoting.Request$2.run(Request.java:270)
	at java.util.concurrent.Executors$RunnableAdapter.call(Executors.java:417)
	at java.util.concurrent.FutureTask$Sync.innerRun(FutureTask.java:269)
	at java.util.concurrent.FutureTask.run(FutureTask.java:123)
	at java.util.concurrent.ThreadPoolExecutor$Worker.runTask(ThreadPoolExecutor.java:651)
	at java.util.concurrent.ThreadPoolExecutor$Worker.run(ThreadPoolExecutor.java:676)
	at java.lang.Thread.run(Thread.java:595)
Caused by: org.apache.maven.plugin.InvalidPluginException: Unable to build project for plugin
'org.jvnet.jaxb2.maven2:maven-jaxb2-plugin': POM 'org.jvnet.jaxb2.maven2:maven-jaxb2-plugin'
not found in repository: Unable to download the artifact from any repository

  org.jvnet.jaxb2.maven2:maven-jaxb2-plugin:pom:0.7.2

from the specified remote repositories:
  central (http://repo1.maven.org/maven2),
  apache.snapshots (https://repository.apache.org/content/repositories/snapshots/),
  com.springsource.repository.bundles.external (http://repository.springsource.com/maven/bundles/external),
  maven2-repository.dev.java.net (http://download.java.net/maven/2),
  maven-repository.dev.java.net (http://download.java.net/maven/1)

 for project org.jvnet.jaxb2.maven2:maven-jaxb2-plugin
	at org.apache.maven.plugin.DefaultPluginManager.checkRequiredMavenVersion(DefaultPluginManager.java:281)
	at org.apache.maven.plugin.DefaultPluginManager.verifyVersionedPlugin(DefaultPluginManager.java:197)
	at org.apache.maven.plugin.DefaultPluginManager.verifyPlugin(DefaultPluginManager.java:176)
	at org.apache.maven.lifecycle.DefaultLifecycleExecutor.verifyPlugin(DefaultLifecycleExecutor.java:1275)
	... 29 more
Caused by: org.apache.maven.project.ProjectBuildingException: POM 'org.jvnet.jaxb2.maven2:maven-jaxb2-plugin'
not found in repository: Unable to download the artifact from any repository

  org.jvnet.jaxb2.maven2:maven-jaxb2-plugin:pom:0.7.2

from the specified remote repositories:
  central (http://repo1.maven.org/maven2),
  apache.snapshots (https://repository.apache.org/content/repositories/snapshots/),
  com.springsource.repository.bundles.external (http://repository.springsource.com/maven/bundles/external),
  maven2-repository.dev.java.net (http://download.java.net/maven/2),
  maven-repository.dev.java.net (http://download.java.net/maven/1)

 for project org.jvnet.jaxb2.maven2:maven-jaxb2-plugin
	at org.apache.maven.project.DefaultMavenProjectBuilder.findModelFromRepository(DefaultMavenProjectBuilder.java:602)
	at org.apache.maven.project.DefaultMavenProjectBuilder.buildFromRepository(DefaultMavenProjectBuilder.java:248)
	at org.apache.maven.plugin.DefaultPluginManager.checkRequiredMavenVersion(DefaultPluginManager.java:265)
	... 32 more
Caused by: org.apache.maven.artifact.resolver.ArtifactNotFoundException: Unable to download
the artifact from any repository

  org.jvnet.jaxb2.maven2:maven-jaxb2-plugin:pom:0.7.2

from the specified remote repositories:
  central (http://repo1.maven.org/maven2),
  apache.snapshots (https://repository.apache.org/content/repositories/snapshots/),
  com.springsource.repository.bundles.external (http://repository.springsource.com/maven/bundles/external),
  maven2-repository.dev.java.net (http://download.java.net/maven/2),
  maven-repository.dev.java.net (http://download.java.net/maven/1)


	at org.apache.maven.artifact.resolver.DefaultArtifactResolver.resolve(DefaultArtifactResolver.java:212)
	at org.apache.maven.artifact.resolver.DefaultArtifactResolver.resolve(DefaultArtifactResolver.java:74)
	at org.apache.maven.project.DefaultMavenProjectBuilder.findModelFromRepository(DefaultMavenProjectBuilder.java:555)
	... 34 more
Caused by: org.apache.maven.wagon.ResourceDoesNotExistException: Unable to download the artifact
from any repository
	at org.apache.maven.artifact.manager.DefaultWagonManager.getArtifact(DefaultWagonManager.java:332)
	at org.apache.maven.artifact.resolver.DefaultArtifactResolver.resolve(DefaultArtifactResolver.java:200)
	... 36 more
[INFO] ------------------------------------------------------------------------
[INFO] BUILD ERRORS
[INFO] ------------------------------------------------------------------------
[INFO] Total time: 73 minutes 54 seconds
[INFO] Finished at: Fri Jun 04 04:17:36 UTC 2010
[INFO] Final Memory: 88M/1064M
[INFO] ------------------------------------------------------------------------
Waiting for Hudson to finish collecting data
channel stopped


Mime
View raw message