activemq-dev mailing list archives

Site index · List index
Message view « Date » · « Thread »
Top « Date » · « Thread »
From Apache Hudson Server <hud...@hudson.zones.apache.org>
Subject Build failed in Hudson: ActiveMQ #361
Date Thu, 27 May 2010 05:38:32 GMT
See <http://hudson.zones.apache.org/hudson/job/ActiveMQ/361/changes>

Changes:

[gtully] help in diagnosis of https://issues.apache.org/activemq/browse/AMQ-2749 - provide
log message when waiting for space to free up

[gtully] resolve https://issues.apache.org/activemq/browse/AMQ-2751 - duplicate suppression
over eager with listener, session.recover from a message listener when default delayed redelivery
is in place

------------------------------------------
[...truncated 5827 lines...]
Tests run: 27, Failures: 0, Errors: 0, Skipped: 0, Time elapsed: 11.293 sec
Running org.apache.activemq.openwire.v1.ActiveMQTextMessageTest
Tests run: 1, Failures: 0, Errors: 0, Skipped: 0, Time elapsed: 0.231 sec
Running org.apache.activemq.openwire.v6.TransactionInfoTest
Tests run: 1, Failures: 0, Errors: 0, Skipped: 0, Time elapsed: 0.183 sec
Running org.apache.activemq.JmsTopicSendReceiveWithTwoConnectionsTest
Tests run: 1, Failures: 0, Errors: 0, Skipped: 0, Time elapsed: 0.728 sec
Running org.apache.activemq.transport.tcp.SslContextNBrokerServiceTest
Tests run: 1, Failures: 0, Errors: 0, Skipped: 0, Time elapsed: 13.163 sec
Running org.apache.activemq.openwire.v6.JournalTopicAckTest
Tests run: 1, Failures: 0, Errors: 0, Skipped: 0, Time elapsed: 0.198 sec
Running org.apache.activemq.bugs.AMQ2751Test
Tests run: 1, Failures: 0, Errors: 0, Skipped: 0, Time elapsed: 6.59 sec
Running org.apache.activemq.broker.store.DefaultStoreXARecoveryBrokerTest
Tests run: 5, Failures: 0, Errors: 0, Skipped: 0, Time elapsed: 17.288 sec
Running org.apache.activemq.broker.scheduler.CronParserTest
Tests run: 8, Failures: 0, Errors: 0, Skipped: 0, Time elapsed: 0.097 sec
Running org.apache.activemq.openwire.v4.ConnectionErrorTest
Tests run: 1, Failures: 0, Errors: 0, Skipped: 0, Time elapsed: 0.183 sec
Running org.apache.activemq.usecases.PublishOnDurableTopicConsumedMessageTest
Tests run: 1, Failures: 0, Errors: 0, Skipped: 0, Time elapsed: 1.705 sec
Running org.apache.activemq.openwire.v1.ActiveMQMessageTest
Tests run: 1, Failures: 0, Errors: 0, Skipped: 0, Time elapsed: 0.215 sec
Running org.apache.activemq.openwire.v3.NetworkBridgeFilterTest
Tests run: 1, Failures: 0, Errors: 0, Skipped: 0, Time elapsed: 0.179 sec
Running org.apache.activemq.broker.DedicatedTaskRunnerBrokerTest
Tests run: 129, Failures: 0, Errors: 0, Skipped: 0, Time elapsed: 24.994 sec
Running org.apache.activemq.openwire.v4.ResponseTest
Tests run: 1, Failures: 0, Errors: 0, Skipped: 0, Time elapsed: 0.168 sec
Running org.apache.activemq.JMSMessageTest
Tests run: 28, Failures: 0, Errors: 0, Skipped: 0, Time elapsed: 2.047 sec
Running org.apache.activemq.openwire.v6.MessagePullTest
Tests run: 1, Failures: 0, Errors: 0, Skipped: 0, Time elapsed: 0.193 sec
Running org.apache.activemq.memory.MemoryPropertyTest
Tests run: 1, Failures: 0, Errors: 0, Skipped: 0, Time elapsed: 1.207 sec
Running org.apache.activemq.filter.DummyPolicyTest
Tests run: 1, Failures: 0, Errors: 0, Skipped: 0, Time elapsed: 0.373 sec
Running org.apache.activemq.openwire.v3.SessionIdTest
Tests run: 1, Failures: 0, Errors: 0, Skipped: 0, Time elapsed: 0.176 sec
Running org.apache.activemq.broker.region.cursors.CursorDurableTest
Tests run: 2, Failures: 0, Errors: 0, Skipped: 0, Time elapsed: 4.984 sec
Running org.apache.activemq.openwire.v5.MessageIdTest
Tests run: 1, Failures: 0, Errors: 0, Skipped: 0, Time elapsed: 0.178 sec
Running org.apache.activemq.openwire.v1.SessionInfoTest
Tests run: 1, Failures: 0, Errors: 0, Skipped: 0, Time elapsed: 0.189 sec
Running org.apache.activemq.openwire.v2.JournalQueueAckTest
Tests run: 1, Failures: 0, Errors: 0, Skipped: 0, Time elapsed: 0.203 sec
Running org.apache.activemq.openwire.v6.ConnectionIdTest
Tests run: 1, Failures: 0, Errors: 0, Skipped: 0, Time elapsed: 0.163 sec
Running org.apache.activemq.kaha.impl.index.tree.TreeTest
Tests run: 2, Failures: 0, Errors: 0, Skipped: 0, Time elapsed: 0.155 sec
Running org.apache.activemq.JmsCreateConsumerInOnMessageTest
Tests run: 1, Failures: 0, Errors: 0, Skipped: 0, Time elapsed: 0.666 sec
Running org.apache.activemq.usecases.PublishOnQueueConsumedMessageTest
Tests run: 1, Failures: 0, Errors: 0, Skipped: 0, Time elapsed: 1.758 sec
Running org.apache.activemq.usecases.CompositeConsumeTest
Tests run: 1, Failures: 0, Errors: 0, Skipped: 0, Time elapsed: 0.714 sec
Running org.apache.activemq.openwire.v4.ConnectionInfoTest
Tests run: 1, Failures: 0, Errors: 0, Skipped: 0, Time elapsed: 0.18 sec
Running org.apache.activemq.management.CountStatisticTest
Tests run: 1, Failures: 0, Errors: 0, Skipped: 0, Time elapsed: 0.617 sec
Running org.apache.activemq.broker.advisory.AdvisoryBrokerTest
Tests run: 6, Failures: 0, Errors: 0, Skipped: 0, Time elapsed: 0.896 sec
Running org.apache.activemq.transport.vm.VMTransportBrokerNameTest
Tests run: 1, Failures: 0, Errors: 0, Skipped: 0, Time elapsed: 2.519 sec
Running org.apache.activemq.broker.policy.NoRetryDeadLetterTest
Tests run: 4, Failures: 0, Errors: 0, Skipped: 0, Time elapsed: 1.119 sec
Running org.apache.activemq.transport.tcp.SslContextBrokerServiceTest
Tests run: 1, Failures: 0, Errors: 0, Skipped: 0, Time elapsed: 3.712 sec
Running org.apache.activemq.openwire.v6.ResponseTest
Tests run: 1, Failures: 0, Errors: 0, Skipped: 0, Time elapsed: 0.176 sec
Running org.apache.activemq.openwire.v6.ShutdownInfoTest
Tests run: 1, Failures: 0, Errors: 0, Skipped: 0, Time elapsed: 0.179 sec
Running org.apache.activemq.usecases.TwoBrokerTopicSendReceiveUsingTcpTest
Tests run: 1, Failures: 0, Errors: 0, Skipped: 0, Time elapsed: 10.505 sec
Running org.apache.activemq.test.retroactive.RetroactiveConsumerTestWithDestinationBasedBufferTest
Tests run: 1, Failures: 0, Errors: 0, Skipped: 0, Time elapsed: 1.48 sec
Running org.apache.activemq.openwire.v5.ConsumerInfoTest
Tests run: 1, Failures: 0, Errors: 0, Skipped: 0, Time elapsed: 0.193 sec
Running org.apache.activemq.openwire.v2.ConsumerControlTest
Tests run: 1, Failures: 0, Errors: 0, Skipped: 0, Time elapsed: 0.175 sec
Running org.apache.activemq.openwire.v5.BrokerIdTest
Tests run: 1, Failures: 0, Errors: 0, Skipped: 0, Time elapsed: 0.175 sec
Running org.apache.activemq.config.BrokerXmlConfigFromJNDITest
Tests run: 1, Failures: 0, Errors: 0, Skipped: 0, Time elapsed: 3.193 sec
Running org.apache.activemq.JmsDurableTopicSelectorTest
Tests run: 2, Failures: 0, Errors: 0, Skipped: 0, Time elapsed: 7.789 sec
Running org.apache.activemq.usecases.ExpiredMessagesWithNoConsumerTest
Tests run: 7, Failures: 0, Errors: 0, Skipped: 0, Time elapsed: 77.97 sec
Running org.apache.activemq.filter.DestinationMapMemoryTest
Tests run: 2, Failures: 0, Errors: 0, Skipped: 0, Time elapsed: 0.082 sec
Running org.apache.activemq.openwire.v2.ConsumerInfoTest
Tests run: 1, Failures: 0, Errors: 0, Skipped: 0, Time elapsed: 0.201 sec
Running org.apache.activemq.openwire.v5.KeepAliveInfoTest
Tests run: 1, Failures: 0, Errors: 0, Skipped: 0, Time elapsed: 0.174 sec
Running org.apache.activemq.broker.policy.NoConsumerDeadLetterTest
Tests run: 5, Failures: 0, Errors: 0, Skipped: 0, Time elapsed: 1.906 sec
Running org.apache.activemq.usecases.ExceptionListenerTest
Tests run: 1, Failures: 0, Errors: 0, Skipped: 0, Time elapsed: 0.04 sec
Running org.apache.activemq.transport.SoWriteTimeoutTest
Tests run: 3, Failures: 2, Errors: 0, Skipped: 0, Time elapsed: 21.346 sec <<< FAILURE!
Running org.apache.activemq.test.retroactive.RetroactiveConsumerWithMessageQueryTest
Tests run: 1, Failures: 0, Errors: 0, Skipped: 0, Time elapsed: 1.475 sec
Running org.apache.activemq.usecases.ExpiredMessagesTest
Tests run: 3, Failures: 0, Errors: 0, Skipped: 0, Time elapsed: 29.548 sec
Running org.apache.activemq.openwire.v3.ConsumerIdTest
Tests run: 1, Failures: 0, Errors: 0, Skipped: 0, Time elapsed: 0.174 sec
Running org.apache.activemq.transport.tcp.TransportUriTest
Tests run: 8, Failures: 0, Errors: 0, Skipped: 0, Time elapsed: 16.904 sec
Running org.apache.activemq.network.jms.TopicBridgeXBeanTest
Tests run: 1, Failures: 0, Errors: 0, Skipped: 0, Time elapsed: 1.196 sec
Running org.apache.activemq.advisory.TempDestDeleteTest
Tests run: 2, Failures: 0, Errors: 0, Skipped: 0, Time elapsed: 0.797 sec
Running org.apache.activemq.JmsTopicRedeliverTest
Tests run: 1, Failures: 0, Errors: 0, Skipped: 0, Time elapsed: 0.649 sec
Running org.apache.activemq.transport.fanout.FanoutTest
Tests run: 1, Failures: 0, Errors: 0, Skipped: 0, Time elapsed: 2.619 sec
Running org.apache.activemq.usecases.MultiBrokersMultiClientsTest
Tests run: 2, Failures: 0, Errors: 0, Skipped: 0, Time elapsed: 31.228 sec
Running org.apache.activemq.openwire.v4.FlushCommandTest
Tests run: 1, Failures: 0, Errors: 0, Skipped: 0, Time elapsed: 0.169 sec
Running org.apache.activemq.broker.util.PluginBrokerTest
Tests run: 1, Failures: 0, Errors: 0, Skipped: 0, Time elapsed: 2.46 sec
Running org.apache.activemq.openwire.v1.ResponseTest
Tests run: 1, Failures: 0, Errors: 0, Skipped: 0, Time elapsed: 0.18 sec
Running org.apache.activemq.openwire.v2.TransactionInfoTest
Tests run: 1, Failures: 0, Errors: 0, Skipped: 0, Time elapsed: 0.178 sec
Running org.apache.activemq.usecases.PublishOnQueueConsumedMessageUsingActivemqXMLTest
Tests run: 1, Failures: 0, Errors: 0, Skipped: 0, Time elapsed: 4.733 sec
Running org.apache.activemq.openwire.v2.ActiveMQBytesMessageTest
Tests run: 1, Failures: 0, Errors: 0, Skipped: 0, Time elapsed: 0.233 sec
Running org.apache.activemq.jndi.CustomConnectionFactoryNameTest
Tests run: 4, Failures: 0, Errors: 0, Skipped: 0, Time elapsed: 0.166 sec
Running org.apache.activemq.openwire.v6.DestinationInfoTest
Tests run: 1, Failures: 0, Errors: 0, Skipped: 0, Time elapsed: 0.18 sec
Running org.apache.activemq.openwire.v3.LastPartialCommandTest
Tests run: 1, Failures: 0, Errors: 0, Skipped: 0, Time elapsed: 0.175 sec
Running org.apache.activemq.openwire.v3.ReplayCommandTest
Tests run: 1, Failures: 0, Errors: 0, Skipped: 0, Time elapsed: 0.174 sec
Running org.apache.activemq.management.RangeStatisticTest
Tests run: 1, Failures: 0, Errors: 0, Skipped: 0, Time elapsed: 0.614 sec
Running org.apache.activemq.bugs.JmsTimeoutTest
Tests run: 1, Failures: 0, Errors: 0, Skipped: 0, Time elapsed: 6.581 sec
Running org.apache.activemq.openwire.v4.JournalTopicAckTest
Tests run: 1, Failures: 0, Errors: 0, Skipped: 0, Time elapsed: 0.191 sec
Running org.apache.activemq.broker.store.DefaultStoreRecoveryBrokerTest
Tests run: 9, Failures: 0, Errors: 0, Skipped: 0, Time elapsed: 33.112 sec
Running org.apache.activemq.kaha.VolumeTest
Tests run: 1, Failures: 0, Errors: 0, Skipped: 0, Time elapsed: 0.201 sec
Running org.apache.activemq.openwire.v6.KeepAliveInfoTest
Tests run: 1, Failures: 0, Errors: 0, Skipped: 0, Time elapsed: 0.178 sec
Running org.apache.activemq.transport.failover.SlowConnectionTest
Tests run: 1, Failures: 0, Errors: 0, Skipped: 0, Time elapsed: 5.687 sec
Running org.apache.activemq.openwire.v4.MessageIdTest
Tests run: 1, Failures: 0, Errors: 0, Skipped: 0, Time elapsed: 0.175 sec
Running org.apache.activemq.openwire.v2.ActiveMQStreamMessageTest
Tests run: 1, Failures: 0, Errors: 0, Skipped: 0, Time elapsed: 0.232 sec
Running org.apache.activemq.JmsAutoAckListenerTest
Tests run: 1, Failures: 0, Errors: 0, Skipped: 0, Time elapsed: 11.71 sec
Running org.apache.activemq.openwire.v1.ConsumerInfoTest
Tests run: 1, Failures: 0, Errors: 0, Skipped: 0, Time elapsed: 0.198 sec
Running org.apache.activemq.openwire.v3.MessageIdTest
Tests run: 1, Failures: 0, Errors: 0, Skipped: 0, Time elapsed: 0.177 sec
Running org.apache.activemq.openwire.v6.ConsumerIdTest
Tests run: 1, Failures: 0, Errors: 0, Skipped: 0, Time elapsed: 0.183 sec
Running org.apache.activemq.openwire.v1.DataResponseTest
Tests run: 1, Failures: 0, Errors: 0, Skipped: 0, Time elapsed: 0.184 sec
Running org.apache.activemq.openwire.v5.XATransactionIdTest
Tests run: 1, Failures: 0, Errors: 0, Skipped: 0, Time elapsed: 0.186 sec
Running org.apache.activemq.openwire.v6.IntegerResponseTest
Tests run: 1, Failures: 0, Errors: 0, Skipped: 0, Time elapsed: 0.172 sec
Running org.apache.activemq.kaha.impl.async.NioDataFileAppenderTest
Tests run: 5, Failures: 0, Errors: 0, Skipped: 0, Time elapsed: 0.227 sec
Running org.apache.activemq.usecases.ChangeSessionDeliveryModeTest
Tests run: 1, Failures: 0, Errors: 0, Skipped: 0, Time elapsed: 0.675 sec
Running org.apache.activemq.openwire.v4.ExceptionResponseTest
Tests run: 1, Failures: 0, Errors: 0, Skipped: 0, Time elapsed: 0.18 sec
Running org.apache.activemq.kaha.LoadTest
Tests run: 1, Failures: 0, Errors: 0, Skipped: 0, Time elapsed: 12.56 sec
Running org.apache.activemq.openwire.v3.RemoveInfoTest
Tests run: 1, Failures: 0, Errors: 0, Skipped: 0, Time elapsed: 0.185 sec
Running org.apache.activemq.openwire.v4.TransactionInfoTest
Tests run: 1, Failures: 0, Errors: 0, Skipped: 0, Time elapsed: 0.186 sec
Running org.apache.activemq.openwire.v1.MessageDispatchNotificationTest
Tests run: 1, Failures: 0, Errors: 0, Skipped: 0, Time elapsed: 0.207 sec
Running org.apache.activemq.openwire.NumberRangesWhileMarshallingTest
Tests run: 1, Failures: 0, Errors: 0, Skipped: 0, Time elapsed: 0.195 sec
Running org.apache.activemq.openwire.v6.MessageDispatchNotificationTest
Tests run: 1, Failures: 0, Errors: 0, Skipped: 0, Time elapsed: 0.185 sec
Running org.apache.activemq.transport.tcp.SslTransportTest
Tests run: 1, Failures: 0, Errors: 0, Skipped: 0, Time elapsed: 0.139 sec
Running org.apache.activemq.command.MessageCompressionTest
Tests run: 1, Failures: 0, Errors: 0, Skipped: 0, Time elapsed: 4.212 sec
Running org.apache.activemq.openwire.v4.BrokerInfoTest
Tests run: 1, Failures: 0, Errors: 0, Skipped: 0, Time elapsed: 0.182 sec
Running org.apache.activemq.store.kahadb.plist.PListTest
Tests run: 7, Failures: 0, Errors: 0, Skipped: 0, Time elapsed: 11.06 sec
Running org.apache.activemq.JmsClientAckTest
Tests run: 3, Failures: 0, Errors: 0, Skipped: 0, Time elapsed: 2.883 sec
Running org.apache.activemq.openwire.v3.RemoveSubscriptionInfoTest
Tests run: 1, Failures: 0, Errors: 0, Skipped: 0, Time elapsed: 0.186 sec
Running org.apache.activemq.openwire.v4.ConnectionControlTest
Tests run: 1, Failures: 0, Errors: 0, Skipped: 0, Time elapsed: 0.187 sec
Running org.apache.activemq.usecases.TransactionTest
Tests run: 1, Failures: 0, Errors: 0, Skipped: 0, Time elapsed: 0.701 sec
Running org.apache.activemq.usecases.MessageGroupDelayedTest
Tests run: 6, Failures: 0, Errors: 0, Skipped: 0, Time elapsed: 30.549 sec
Running org.apache.activemq.broker.region.cursors.StoreQueueCursorMemoryNoDuplicateTest
Tests run: 1, Failures: 0, Errors: 0, Skipped: 0, Time elapsed: 0.389 sec
Running org.apache.activemq.JmsQueueSelectorTest
Tests run: 2, Failures: 0, Errors: 0, Skipped: 0, Time elapsed: 2.751 sec
Running org.apache.activemq.util.DataByteArrayOutputStreamTest
Tests run: 1, Failures: 0, Errors: 0, Skipped: 0, Time elapsed: 0.04 sec
Running org.apache.activemq.PerDestinationStoreLimitTest
Build timed out. Aborting
[locks-and-latches] Releasing all the locks
[locks-and-latches] All the locks released
ERROR: Failed to parse POMs
hudson.remoting.ChannelClosedException: channel is already closed
	at hudson.remoting.Channel.send(Channel.java:412)
	at hudson.remoting.ProxyOutputStream.write(ProxyOutputStream.java:112)
	at hudson.remoting.ProxyOutputStream.write(ProxyOutputStream.java:100)
	at hudson.remoting.RemoteOutputStream.write(RemoteOutputStream.java:110)
	at java.io.BufferedOutputStream.flushBuffer(BufferedOutputStream.java:65)
	at java.io.BufferedOutputStream.flush(BufferedOutputStream.java:123)
	at java.io.BufferedOutputStream.flush(BufferedOutputStream.java:124)
	at java.io.ObjectOutputStream$BlockDataOutputStream.flush(ObjectOutputStream.java:1784)
	at java.io.ObjectOutputStream.flush(ObjectOutputStream.java:691)
	at hudson.remoting.Channel.send(Channel.java:418)
	at hudson.remoting.Request.call(Request.java:149)
	at hudson.remoting.Channel.call(Channel.java:551)
	at hudson.maven.ProcessCache$MavenProcess.call(ProcessCache.java:156)
	at hudson.maven.MavenModuleSetBuild$RunnerImpl.doRun(MavenModuleSetBuild.java:480)
	at hudson.model.AbstractBuild$AbstractRunner.run(AbstractBuild.java:416)
	at hudson.model.Run.run(Run.java:1243)
	at hudson.maven.MavenModuleSetBuild.run(MavenModuleSetBuild.java:304)
	at hudson.model.ResourceController.execute(ResourceController.java:88)
	at hudson.model.Executor.run(Executor.java:122)
FATAL: channel is already closed
hudson.remoting.ChannelClosedException: channel is already closed
	at hudson.remoting.Channel.send(Channel.java:412)
	at hudson.remoting.Request.call(Request.java:105)
	at hudson.remoting.Channel.call(Channel.java:551)
	at hudson.Launcher$RemoteLauncher.kill(Launcher.java:735)
	at hudson.model.AbstractBuild$AbstractRunner.run(AbstractBuild.java:421)
	at hudson.model.Run.run(Run.java:1243)
	at hudson.maven.MavenModuleSetBuild.run(MavenModuleSetBuild.java:304)
	at hudson.model.ResourceController.execute(ResourceController.java:88)
	at hudson.model.Executor.run(Executor.java:122)


Mime
View raw message