activemq-dev mailing list archives

Site index · List index
Message view « Date » · « Thread »
Top « Date » · « Thread »
From Apache Hudson Server <hud...@hudson.zones.apache.org>
Subject Build failed in Hudson: ActiveMQ #357
Date Mon, 24 May 2010 00:53:59 GMT
See <http://hudson.zones.apache.org/hudson/job/ActiveMQ/357/changes>

Changes:

[chirino] upgrade to activemq-protobuf-1.1-SNAPSHOT fixes one of the errors in the XARecoveryBrokerTest

------------------------------------------
[...truncated 5049 lines...]
Downloading: http://repository.springsource.com/maven/bundles/external/org/apache/maven/maven-profile/2.0.2/maven-profile-2.0.2.pom
Downloading: http://repo1.maven.org/maven2/org/apache/maven/maven-profile/2.0.2/maven-profile-2.0.2.pom
Downloading: http://repository.springsource.com/maven/bundles/external/org/apache/maven/maven-model/2.0.2/maven-model-2.0.2.pom
Downloading: http://repo1.maven.org/maven2/org/apache/maven/maven-model/2.0.2/maven-model-2.0.2.pom
Downloading: http://repository.springsource.com/maven/bundles/external/org/apache/maven/maven-repository-metadata/2.0.2/maven-repository-metadata-2.0.2.pom
Downloading: http://repo1.maven.org/maven2/org/apache/maven/maven-repository-metadata/2.0.2/maven-repository-metadata-2.0.2.pom
[INFO] [build-helper:attach-artifact {execution: attach-artifacts}]
[INFO] [ianal:verify-legal-files {execution: default}]
[INFO] Checking legal files in: activemq-karaf-5.4-SNAPSHOT.jar
[INFO] [install:install]
[INFO] Installing <http://hudson.zones.apache.org/hudson/job/ActiveMQ/ws/trunk/activemq-karaf/target/activemq-karaf-5.4-SNAPSHOT.jar>
to <http://hudson.zones.apache.org/hudson/job/ActiveMQ/ws/.repository/org/apache/activemq/activemq-karaf/5.4-SNAPSHOT/activemq-karaf-5.4-SNAPSHOT.jar>
[INFO] Installing <http://hudson.zones.apache.org/hudson/job/ActiveMQ/ws/trunk/activemq-karaf/target/classes/features.xml>
to <http://hudson.zones.apache.org/hudson/job/ActiveMQ/ws/.repository/org/apache/activemq/activemq-karaf/5.4-SNAPSHOT/activemq-karaf-5.4-SNAPSHOT-features.xml>
[INFO] Preparing source:jar
[HUDSON] Archiving <http://hudson.zones.apache.org/hudson/job/ActiveMQ/ws/trunk/activemq-karaf/pom.xml>
to /export/home/hudson/hudson/jobs/ActiveMQ/modules/org.apache.activemq$activemq-karaf/builds/2010-05-24_00-45-10/archive/org.apache.activemq/activemq-karaf/5.4-SNAPSHOT/pom.xml
[HUDSON] Archiving <http://hudson.zones.apache.org/hudson/job/ActiveMQ/ws/trunk/activemq-karaf/target/activemq-karaf-5.4-SNAPSHOT.jar>
to /export/home/hudson/hudson/jobs/ActiveMQ/modules/org.apache.activemq$activemq-karaf/builds/2010-05-24_00-45-10/archive/org.apache.activemq/activemq-karaf/5.4-SNAPSHOT/activemq-karaf-5.4-SNAPSHOT.jar
[HUDSON] Archiving <http://hudson.zones.apache.org/hudson/job/ActiveMQ/ws/trunk/activemq-karaf/target/classes/features.xml>
to /export/home/hudson/hudson/jobs/ActiveMQ/modules/org.apache.activemq$activemq-karaf/builds/2010-05-24_00-45-10/archive/org.apache.activemq/activemq-karaf/5.4-SNAPSHOT/features.xml
[INFO] [enforcer:enforce {execution: default}]
[INFO] [source:jar]
[INFO] Building jar: <http://hudson.zones.apache.org/hudson/job/ActiveMQ/ws/trunk/activemq-karaf/target/activemq-karaf-5.4-SNAPSHOT-sources.jar>
[HUDSON] Archiving <http://hudson.zones.apache.org/hudson/job/ActiveMQ/ws/trunk/activemq-karaf/target/activemq-karaf-5.4-SNAPSHOT-sources.jar>
to /export/home/hudson/hudson/jobs/ActiveMQ/modules/org.apache.activemq$activemq-karaf/builds/2010-05-24_00-45-10/archive/org.apache.activemq/activemq-karaf/5.4-SNAPSHOT/activemq-karaf-5.4-SNAPSHOT-sources.jar
[INFO] ------------------------------------------------------------------------
[INFO] SKIPPING ActiveMQ :: RAR
[INFO]    task-segment: [clean, install, source:jar]
[INFO] This project has been banned from further executions due to previous failures.
[INFO] ------------------------------------------------------------------------
[INFO] ------------------------------------------------------------------------
[INFO] SKIPPING ActiveMQ :: Run Jar
[INFO]    task-segment: [clean, install, source:jar]
[INFO] This project has been banned from further executions due to previous failures.
[INFO] ------------------------------------------------------------------------
[INFO] ------------------------------------------------------------------------
[INFO] SKIPPING ActiveMQ :: Spring
[INFO]    task-segment: [clean, install, source:jar]
[INFO] This project has been banned from further executions due to previous failures.
[INFO] ------------------------------------------------------------------------
[INFO] ------------------------------------------------------------------------
[INFO] Building ActiveMQ Tooling
[INFO]    task-segment: [clean, install, source:jar]
[INFO] ------------------------------------------------------------------------
[INFO] [clean:clean]
[INFO] [enforcer:enforce {execution: default}]
[INFO] [remote-resources:process {execution: default}]
[INFO] [site:attach-descriptor]
[INFO] [ianal:verify-legal-files {execution: default}]
[INFO] [install:install]
[INFO] Installing <http://hudson.zones.apache.org/hudson/job/ActiveMQ/ws/trunk/activemq-tooling/pom.xml>
to <http://hudson.zones.apache.org/hudson/job/ActiveMQ/ws/.repository/org/apache/activemq/tooling/activemq-tooling/5.4-SNAPSHOT/activemq-tooling-5.4-SNAPSHOT.pom>
[INFO] Preparing source:jar
[HUDSON] Archiving <http://hudson.zones.apache.org/hudson/job/ActiveMQ/ws/trunk/activemq-tooling/pom.xml>
to /export/home/hudson/hudson/jobs/ActiveMQ/modules/org.apache.activemq.tooling$activemq-tooling/builds/2010-05-24_00-45-10/archive/org.apache.activemq.tooling/activemq-tooling/5.4-SNAPSHOT/pom.xml
[INFO] [enforcer:enforce {execution: default}]
[INFO] [source:jar]
[INFO] ------------------------------------------------------------------------
[INFO] SKIPPING ActiveMQ :: Memory Usage Test Plugin
[INFO]    task-segment: [clean, install, source:jar]
[INFO] This project has been banned from further executions due to previous failures.
[INFO] ------------------------------------------------------------------------
[INFO] ------------------------------------------------------------------------
[INFO] SKIPPING ActiveMQ :: Performance Test Plugin
[INFO]    task-segment: [clean, install, source:jar]
[INFO] This project has been banned from further executions due to previous failures.
[INFO] ------------------------------------------------------------------------
[INFO] ------------------------------------------------------------------------
[INFO] SKIPPING ActiveMQ :: StartUp Plugin
[INFO]    task-segment: [clean, install, source:jar]
[INFO] This project has been banned from further executions due to previous failures.
[INFO] ------------------------------------------------------------------------
[INFO] ------------------------------------------------------------------------
[INFO] SKIPPING ActiveMQ :: Web
[INFO]    task-segment: [clean, install, source:jar]
[INFO] This project has been banned from further executions due to previous failures.
[INFO] ------------------------------------------------------------------------
[INFO] ------------------------------------------------------------------------
[INFO] SKIPPING ActiveMQ :: Web Demo
[INFO]    task-segment: [clean, install, source:jar]
[INFO] This project has been banned from further executions due to previous failures.
[INFO] ------------------------------------------------------------------------
[INFO] ------------------------------------------------------------------------
[INFO] SKIPPING ActiveMQ :: XMPP
[INFO]    task-segment: [clean, install, source:jar]
[INFO] This project has been banned from further executions due to previous failures.
[INFO] ------------------------------------------------------------------------
[INFO] ------------------------------------------------------------------------
[INFO] SKIPPING ActiveMQ :: Web Console
[INFO]    task-segment: [clean, install, source:jar]
[INFO] This project has been banned from further executions due to previous failures.
[INFO] ------------------------------------------------------------------------
[INFO] ------------------------------------------------------------------------
[INFO] SKIPPING ActiveMQ :: Assembly
[INFO]    task-segment: [clean, install, source:jar]
[INFO] This project has been banned from further executions due to previous failures.
[INFO] ------------------------------------------------------------------------
[INFO] 
[INFO] 
[INFO] ------------------------------------------------------------------------
[INFO] Reactor Summary:
[INFO] ------------------------------------------------------------------------
[INFO] ActiveMQ .............................................. SUCCESS [4:29.732s]
[INFO] ActiveMQ :: KahaDB .................................... SUCCESS [1:22.493s]
[INFO] ActiveMQ :: JAAS ...................................... SUCCESS [1:24.202s]
[INFO] Openwire Generator .................................... SUCCESS [19.337s]
[INFO] ActiveMQ :: jmdns 1.0 ................................. SUCCESS [3.155s]
[INFO] ActiveMQ :: Core ...................................... FAILED [10.253s]
[INFO] ActiveMQ :: RA ........................................ SKIPPED (dependency build failed
or was skipped)
[INFO] ActiveMQ :: Pool ...................................... SKIPPED (dependency build failed
or was skipped)
[INFO] ActiveMQ :: Camel ..................................... SKIPPED (dependency build failed
or was skipped)
[INFO] ActiveMQ :: Console ................................... SKIPPED (dependency build failed
or was skipped)
[INFO] ActiveMQ :: Optional .................................. SKIPPED (dependency build failed
or was skipped)
[INFO] ActiveMQ :: Jar Bundle ................................ SKIPPED (dependency build failed
or was skipped)
[INFO] ActiveMQ :: File Server ............................... SKIPPED (dependency build failed
or was skipped)
[INFO] ActiveMQ :: Apache Karaf .............................. SUCCESS [11.121s]
[INFO] ActiveMQ :: RAR ....................................... SKIPPED (dependency build failed
or was skipped)
[INFO] ActiveMQ :: Run Jar ................................... SKIPPED (dependency build failed
or was skipped)
[INFO] ActiveMQ :: Spring .................................... SKIPPED (dependency build failed
or was skipped)
[INFO] ActiveMQ Tooling ...................................... SUCCESS [1.419s]
[INFO] ActiveMQ :: Memory Usage Test Plugin .................. SKIPPED (dependency build failed
or was skipped)
[INFO] ActiveMQ :: Performance Test Plugin ................... SKIPPED (dependency build failed
or was skipped)
[INFO] ActiveMQ :: StartUp Plugin ............................ SKIPPED (dependency build failed
or was skipped)
[INFO] ActiveMQ :: Web ....................................... SKIPPED (dependency build failed
or was skipped)
[INFO] ActiveMQ :: Web Demo .................................. SKIPPED (dependency build failed
or was skipped)
[INFO] ActiveMQ :: XMPP ...................................... SKIPPED (dependency build failed
or was skipped)
[INFO] ActiveMQ :: Web Console ............................... SKIPPED (dependency build failed
or was skipped)
[INFO] ActiveMQ :: Assembly .................................. SKIPPED (dependency build failed
or was skipped)
[INFO] ------------------------------------------------------------------------
[INFO] Error for project: ActiveMQ :: Core (during source:jar)
[INFO] ------------------------------------------------------------------------
[INFO] A required plugin was not found: Plugin could not be found - check that the goal name
is correct: Unable to download the artifact from any repository

Try downloading the file manually from the project website.

Then, install it using the command: 
    mvn install:install-file -DgroupId=org.apache.activemq.protobuf -DartifactId=activemq-protobuf
-Dversion=1.1-SNAPSHOT -Dpackaging=maven-plugin -Dfile=/path/to/file

Alternatively, if you host your own repository you can deploy the file there: 
    mvn deploy:deploy-file -DgroupId=org.apache.activemq.protobuf -DartifactId=activemq-protobuf
-Dversion=1.1-SNAPSHOT -Dpackaging=maven-plugin -Dfile=/path/to/file -Durl=[url] -DrepositoryId=[id]


  org.apache.activemq.protobuf:activemq-protobuf:maven-plugin:1.1-SNAPSHOT

from the specified remote repositories:
  central (http://repo1.maven.org/maven2)


  org.apache.activemq.protobuf:activemq-protobuf:maven-plugin:1.1-SNAPSHOT

from the specified remote repositories:
  central (http://repo1.maven.org/maven2)


[INFO] ------------------------------------------------------------------------
[INFO] Trace
org.apache.maven.BuildFailureException: A required plugin was not found: Plugin could not
be found - check that the goal name is correct: Unable to download the artifact from any repository

Try downloading the file manually from the project website.

Then, install it using the command: 
    mvn install:install-file -DgroupId=org.apache.activemq.protobuf -DartifactId=activemq-protobuf
-Dversion=1.1-SNAPSHOT -Dpackaging=maven-plugin -Dfile=/path/to/file

Alternatively, if you host your own repository you can deploy the file there: 
    mvn deploy:deploy-file -DgroupId=org.apache.activemq.protobuf -DartifactId=activemq-protobuf
-Dversion=1.1-SNAPSHOT -Dpackaging=maven-plugin -Dfile=/path/to/file -Durl=[url] -DrepositoryId=[id]


  org.apache.activemq.protobuf:activemq-protobuf:maven-plugin:1.1-SNAPSHOT

from the specified remote repositories:
  central (http://repo1.maven.org/maven2)


  org.apache.activemq.protobuf:activemq-protobuf:maven-plugin:1.1-SNAPSHOT

from the specified remote repositories:
  central (http://repo1.maven.org/maven2)


	at org.apache.maven.lifecycle.DefaultLifecycleExecutor.executeGoal(DefaultLifecycleExecutor.java:488)
	at org.apache.maven.lifecycle.DefaultLifecycleExecutor.executeGoalAndHandleFailures(DefaultLifecycleExecutor.java:331)
	at org.apache.maven.lifecycle.DefaultLifecycleExecutor.executeTaskSegments(DefaultLifecycleExecutor.java:292)
	at org.apache.maven.lifecycle.DefaultLifecycleExecutor.execute(DefaultLifecycleExecutor.java:142)
	at org.apache.maven.lifecycle.LifecycleExecutorInterceptor.execute(LifecycleExecutorInterceptor.java:65)
	at org.apache.maven.DefaultMaven.doExecute(DefaultMaven.java:336)
	at org.apache.maven.DefaultMaven.execute(DefaultMaven.java:129)
	at org.apache.maven.cli.MavenCli.main(MavenCli.java:301)
	at sun.reflect.NativeMethodAccessorImpl.invoke0(Native Method)
	at sun.reflect.NativeMethodAccessorImpl.invoke(NativeMethodAccessorImpl.java:39)
	at sun.reflect.DelegatingMethodAccessorImpl.invoke(DelegatingMethodAccessorImpl.java:25)
	at java.lang.reflect.Method.invoke(Method.java:592)
	at org.codehaus.classworlds.Launcher.launchEnhanced(Launcher.java:315)
	at org.codehaus.classworlds.Launcher.launch(Launcher.java:255)
	at hudson.maven.agent.Main.launch(Main.java:165)
	at hudson.maven.MavenBuilder.call(MavenBuilder.java:159)
	at hudson.maven.MavenModuleSetBuild$Builder.call(MavenModuleSetBuild.java:688)
	at hudson.maven.MavenModuleSetBuild$Builder.call(MavenModuleSetBuild.java:632)
	at hudson.remoting.UserRequest.perform(UserRequest.java:114)
	at hudson.remoting.UserRequest.perform(UserRequest.java:48)
	at hudson.remoting.Request$2.run(Request.java:270)
	at java.util.concurrent.Executors$RunnableAdapter.call(Executors.java:417)
	at java.util.concurrent.FutureTask$Sync.innerRun(FutureTask.java:269)
	at java.util.concurrent.FutureTask.run(FutureTask.java:123)
	at java.util.concurrent.ThreadPoolExecutor$Worker.runTask(ThreadPoolExecutor.java:651)
	at java.util.concurrent.ThreadPoolExecutor$Worker.run(ThreadPoolExecutor.java:676)
	at java.lang.Thread.run(Thread.java:595)
Caused by: org.apache.maven.plugin.PluginNotFoundException: Plugin could not be found - check
that the goal name is correct: Unable to download the artifact from any repository

Try downloading the file manually from the project website.

Then, install it using the command: 
    mvn install:install-file -DgroupId=org.apache.activemq.protobuf -DartifactId=activemq-protobuf
-Dversion=1.1-SNAPSHOT -Dpackaging=maven-plugin -Dfile=/path/to/file

Alternatively, if you host your own repository you can deploy the file there: 
    mvn deploy:deploy-file -DgroupId=org.apache.activemq.protobuf -DartifactId=activemq-protobuf
-Dversion=1.1-SNAPSHOT -Dpackaging=maven-plugin -Dfile=/path/to/file -Durl=[url] -DrepositoryId=[id]


  org.apache.activemq.protobuf:activemq-protobuf:maven-plugin:1.1-SNAPSHOT

from the specified remote repositories:
  central (http://repo1.maven.org/maven2)


  org.apache.activemq.protobuf:activemq-protobuf:maven-plugin:1.1-SNAPSHOT

from the specified remote repositories:
  central (http://repo1.maven.org/maven2)


	at org.apache.maven.plugin.DefaultPluginManager.verifyVersionedPlugin(DefaultPluginManager.java:241)
	at org.apache.maven.plugin.DefaultPluginManager.verifyPlugin(DefaultPluginManager.java:176)
	at org.apache.maven.lifecycle.DefaultLifecycleExecutor.verifyPlugin(DefaultLifecycleExecutor.java:1275)
	at org.apache.maven.lifecycle.DefaultLifecycleExecutor.bindPluginToLifecycle(DefaultLifecycleExecutor.java:1239)
	at org.apache.maven.lifecycle.DefaultLifecycleExecutor.constructLifecycleMappings(DefaultLifecycleExecutor.java:1005)
	at org.apache.maven.lifecycle.DefaultLifecycleExecutor.forkProjectLifecycle(DefaultLifecycleExecutor.java:788)
	at org.apache.maven.lifecycle.DefaultLifecycleExecutor.forkLifecycle(DefaultLifecycleExecutor.java:768)
	at org.apache.maven.lifecycle.DefaultLifecycleExecutor.executeGoals(DefaultLifecycleExecutor.java:530)
	at org.apache.maven.lifecycle.DefaultLifecycleExecutor.executeStandaloneGoal(DefaultLifecycleExecutor.java:513)
	at org.apache.maven.lifecycle.DefaultLifecycleExecutor.executeGoal(DefaultLifecycleExecutor.java:483)
	... 26 more
Caused by: org.apache.maven.wagon.ResourceDoesNotExistException: Unable to download the artifact
from any repository
	at org.apache.maven.artifact.manager.DefaultWagonManager.getArtifact(DefaultWagonManager.java:332)
	at org.apache.maven.artifact.resolver.DefaultArtifactResolver.resolve(DefaultArtifactResolver.java:200)
	at org.apache.maven.artifact.resolver.DefaultArtifactResolver.resolve(DefaultArtifactResolver.java:74)
	at org.apache.maven.plugin.DefaultPluginManager.verifyVersionedPlugin(DefaultPluginManager.java:204)
	... 35 more
[INFO] ------------------------------------------------------------------------
[INFO] BUILD ERRORS
[INFO] ------------------------------------------------------------------------
[INFO] Total time: 8 minutes 21 seconds
[INFO] Finished at: Mon May 24 00:53:39 UTC 2010
[INFO] Final Memory: 50M/1098M
[INFO] ------------------------------------------------------------------------
channel stopped
[locks-and-latches] Releasing all the locks
[locks-and-latches] All the locks released


Mime
View raw message