activemq-dev mailing list archives

Site index · List index
Message view « Date » · « Thread »
Top « Date » · « Thread »
From Apache Hudson Server <hud...@hudson.zones.apache.org>
Subject Build failed in Hudson: ActiveMQ-5.3-Deploy #7
Date Wed, 03 Mar 2010 17:55:08 GMT
See <http://hudson.zones.apache.org/hudson/job/ActiveMQ-5.3-Deploy/7/>

------------------------------------------
[...truncated 16322 lines...]
Downloading: http://download.java.net/maven/2/org/apache/maven/maven-profile/2.0.4/maven-profile-2.0.4.pom
[INFO] Unable to find resource 'org.apache.maven:maven-profile:pom:2.0.4' in repository maven2-repository.dev.java.net
(http://download.java.net/maven/2)
Downloading: https://repository.apache.org/content/repositories/snapshots//org/apache/maven/maven-profile/2.0.4/maven-profile-2.0.4.pom
[INFO] Unable to find resource 'org.apache.maven:maven-profile:pom:2.0.4' in repository apache.snapshots
(https://repository.apache.org/content/repositories/snapshots/)
Downloading: https://maven-repository.dev.java.net/nonav/repository/org.apache.maven/poms/maven-profile-2.0.4.pom
366b downloaded  (maven-profile-2.0.4.pom)
[WARNING] *** CHECKSUM FAILED - Checksum failed on download: local = 'bb64cd1224f0b91ecd251d042820a69c2540b591';
remote = '<!DOCTYPE' - RETRYING
Downloading: https://maven-repository.dev.java.net/nonav/repository/org.apache.maven/poms/maven-profile-2.0.4.pom
366b downloaded  (maven-profile-2.0.4.pom)
[WARNING] *** CHECKSUM FAILED - Checksum failed on download: local = 'bb64cd1224f0b91ecd251d042820a69c2540b591';
remote = '<!DOCTYPE' - IGNORING
[WARNING] POM for 'org.apache.maven:maven-profile:pom:2.0.4:runtime' is invalid.

Its dependencies (if any) will NOT be available to the current build.
Downloading: http://download.java.net/maven/2/org/apache/maven/maven-model/2.0.4/maven-model-2.0.4.pom
[INFO] Unable to find resource 'org.apache.maven:maven-model:pom:2.0.4' in repository maven2-repository.dev.java.net
(http://download.java.net/maven/2)
Downloading: https://repository.apache.org/content/repositories/snapshots//org/apache/maven/maven-model/2.0.4/maven-model-2.0.4.pom
[INFO] Unable to find resource 'org.apache.maven:maven-model:pom:2.0.4' in repository apache.snapshots
(https://repository.apache.org/content/repositories/snapshots/)
Downloading: https://maven-repository.dev.java.net/nonav/repository/org.apache.maven/poms/maven-model-2.0.4.pom
364b downloaded  (maven-model-2.0.4.pom)
[WARNING] *** CHECKSUM FAILED - Checksum failed on download: local = 'ca59f379d1b1f9c332921331db086fa357d1acd9';
remote = '<!DOCTYPE' - RETRYING
Downloading: https://maven-repository.dev.java.net/nonav/repository/org.apache.maven/poms/maven-model-2.0.4.pom
364b downloaded  (maven-model-2.0.4.pom)
[WARNING] *** CHECKSUM FAILED - Checksum failed on download: local = 'ca59f379d1b1f9c332921331db086fa357d1acd9';
remote = '<!DOCTYPE' - IGNORING
[WARNING] POM for 'org.apache.maven:maven-model:pom:2.0.4:runtime' is invalid.

Its dependencies (if any) will NOT be available to the current build.
Downloading: http://download.java.net/maven/2/org/apache/maven/maven-artifact-manager/2.0.4/maven-artifact-manager-2.0.4.pom
[INFO] Unable to find resource 'org.apache.maven:maven-artifact-manager:pom:2.0.4' in repository
maven2-repository.dev.java.net (http://download.java.net/maven/2)
Downloading: https://repository.apache.org/content/repositories/snapshots//org/apache/maven/maven-artifact-manager/2.0.4/maven-artifact-manager-2.0.4.pom
[INFO] Unable to find resource 'org.apache.maven:maven-artifact-manager:pom:2.0.4' in repository
apache.snapshots (https://repository.apache.org/content/repositories/snapshots/)
Downloading: https://maven-repository.dev.java.net/nonav/repository/org.apache.maven/poms/maven-artifact-manager-2.0.4.pom
375b downloaded  (maven-artifact-manager-2.0.4.pom)
[WARNING] *** CHECKSUM FAILED - Checksum failed on download: local = '7f9f1a7a1979d721c645aabd45aa08cc659f2f31';
remote = '<!DOCTYPE' - RETRYING
Downloading: https://maven-repository.dev.java.net/nonav/repository/org.apache.maven/poms/maven-artifact-manager-2.0.4.pom
375b downloaded  (maven-artifact-manager-2.0.4.pom)
[WARNING] *** CHECKSUM FAILED - Checksum failed on download: local = '7f9f1a7a1979d721c645aabd45aa08cc659f2f31';
remote = '<!DOCTYPE' - IGNORING
[WARNING] POM for 'org.apache.maven:maven-artifact-manager:pom:2.0.4:runtime' is invalid.

Its dependencies (if any) will NOT be available to the current build.
Downloading: http://download.java.net/maven/2/com/sun/xml/bind/jaxb-impl/2.0.2/jaxb-impl-2.0.2.pom
[INFO] Unable to find resource 'com.sun.xml.bind:jaxb-impl:pom:2.0.2' in repository maven2-repository.dev.java.net
(http://download.java.net/maven/2)
Downloading: https://repository.apache.org/content/repositories/snapshots//com/sun/xml/bind/jaxb-impl/2.0.2/jaxb-impl-2.0.2.pom
[INFO] Unable to find resource 'com.sun.xml.bind:jaxb-impl:pom:2.0.2' in repository apache.snapshots
(https://repository.apache.org/content/repositories/snapshots/)
Downloading: https://maven-repository.dev.java.net/nonav/repository/com.sun.xml.bind/poms/jaxb-impl-2.0.2.pom
362b downloaded  (jaxb-impl-2.0.2.pom)
[WARNING] *** CHECKSUM FAILED - Checksum failed on download: local = '769ae6c9dafd6130220a06e5beee91705e5b7bde';
remote = '<!DOCTYPE' - RETRYING
Downloading: https://maven-repository.dev.java.net/nonav/repository/com.sun.xml.bind/poms/jaxb-impl-2.0.2.pom
362b downloaded  (jaxb-impl-2.0.2.pom)
[WARNING] *** CHECKSUM FAILED - Checksum failed on download: local = '769ae6c9dafd6130220a06e5beee91705e5b7bde';
remote = '<!DOCTYPE' - IGNORING
[WARNING] POM for 'com.sun.xml.bind:jaxb-impl:pom:2.0.2:runtime' is invalid.

Its dependencies (if any) will NOT be available to the current build.
Downloading: http://download.java.net/maven/2/com/sun/xml/bind/jaxb-xjc/2.0.2/jaxb-xjc-2.0.2.pom
[INFO] Unable to find resource 'com.sun.xml.bind:jaxb-xjc:pom:2.0.2' in repository maven2-repository.dev.java.net
(http://download.java.net/maven/2)
Downloading: https://repository.apache.org/content/repositories/snapshots//com/sun/xml/bind/jaxb-xjc/2.0.2/jaxb-xjc-2.0.2.pom
[INFO] Unable to find resource 'com.sun.xml.bind:jaxb-xjc:pom:2.0.2' in repository apache.snapshots
(https://repository.apache.org/content/repositories/snapshots/)
Downloading: https://maven-repository.dev.java.net/nonav/repository/com.sun.xml.bind/poms/jaxb-xjc-2.0.2.pom
361b downloaded  (jaxb-xjc-2.0.2.pom)
[WARNING] *** CHECKSUM FAILED - Checksum failed on download: local = 'b59d620e249524c9168efc526bff841fd6e4a7dd';
remote = '<!DOCTYPE' - RETRYING
Downloading: https://maven-repository.dev.java.net/nonav/repository/com.sun.xml.bind/poms/jaxb-xjc-2.0.2.pom
361b downloaded  (jaxb-xjc-2.0.2.pom)
[WARNING] *** CHECKSUM FAILED - Checksum failed on download: local = 'b59d620e249524c9168efc526bff841fd6e4a7dd';
remote = '<!DOCTYPE' - IGNORING
[WARNING] POM for 'com.sun.xml.bind:jaxb-xjc:pom:2.0.2:runtime' is invalid.

Its dependencies (if any) will NOT be available to the current build.
Downloading: http://download.java.net/maven/2/com/sun/xml/bind/jaxb-impl/2.0.2/jaxb-impl-2.0.2.jar
[INFO] Unable to find resource 'com.sun.xml.bind:jaxb-impl:jar:2.0.2' in repository maven2-repository.dev.java.net
(http://download.java.net/maven/2)
Downloading: https://repository.apache.org/content/repositories/snapshots//com/sun/xml/bind/jaxb-impl/2.0.2/jaxb-impl-2.0.2.jar
[INFO] Unable to find resource 'com.sun.xml.bind:jaxb-impl:jar:2.0.2' in repository apache.snapshots
(https://repository.apache.org/content/repositories/snapshots/)
Downloading: https://maven-repository.dev.java.net/nonav/repository/com.sun.xml.bind/jars/jaxb-impl-2.0.2.jar
362b downloaded  (jaxb-impl-2.0.2.jar)
[WARNING] *** CHECKSUM FAILED - Checksum failed on download: local = '2c455eda9365334ca48dd448b2795e4526c40197';
remote = '<!DOCTYPE' - RETRYING
Downloading: https://maven-repository.dev.java.net/nonav/repository/com.sun.xml.bind/jars/jaxb-impl-2.0.2.jar
362b downloaded  (jaxb-impl-2.0.2.jar)
[WARNING] *** CHECKSUM FAILED - Checksum failed on download: local = '2c455eda9365334ca48dd448b2795e4526c40197';
remote = '<!DOCTYPE' - IGNORING
Downloading: http://download.java.net/maven/2/com/sun/xml/bind/jaxb-xjc/2.0.2/jaxb-xjc-2.0.2.jar
[INFO] Unable to find resource 'com.sun.xml.bind:jaxb-xjc:jar:2.0.2' in repository maven2-repository.dev.java.net
(http://download.java.net/maven/2)
Downloading: https://repository.apache.org/content/repositories/snapshots//com/sun/xml/bind/jaxb-xjc/2.0.2/jaxb-xjc-2.0.2.jar
[INFO] Unable to find resource 'com.sun.xml.bind:jaxb-xjc:jar:2.0.2' in repository apache.snapshots
(https://repository.apache.org/content/repositories/snapshots/)
Downloading: https://maven-repository.dev.java.net/nonav/repository/com.sun.xml.bind/jars/jaxb-xjc-2.0.2.jar
361b downloaded  (jaxb-xjc-2.0.2.jar)
[WARNING] *** CHECKSUM FAILED - Checksum failed on download: local = '8f853df57fc28590177eacae7a020c2e3c1a686a';
remote = '<!DOCTYPE' - RETRYING
Downloading: https://maven-repository.dev.java.net/nonav/repository/com.sun.xml.bind/jars/jaxb-xjc-2.0.2.jar
361b downloaded  (jaxb-xjc-2.0.2.jar)
[WARNING] *** CHECKSUM FAILED - Checksum failed on download: local = '8f853df57fc28590177eacae7a020c2e3c1a686a';
remote = '<!DOCTYPE' - IGNORING
-----------------------------------------------------
this realm = app0.child-container[org.jvnet.jaxb2.maven2:maven-jaxb2-plugin:0.1]
urls[0] = <http://hudson.zones.apache.org/hudson/job/ActiveMQ-5.3-Deploy/ws/.repository/org/jvnet/jaxb2/maven2/maven-jaxb2-plugin/0.1/maven-jaxb2-plugin-0.1.jar>
urls[1] = <http://hudson.zones.apache.org/hudson/job/ActiveMQ-5.3-Deploy/ws/.repository/org/codehaus/plexus/plexus-utils/1.1/plexus-utils-1.1.jar>
urls[2] = <http://hudson.zones.apache.org/hudson/job/ActiveMQ-5.3-Deploy/ws/.repository/com/sun/xml/bind/jaxb-impl/2.0.2/jaxb-impl-2.0.2.jar>
urls[3] = <http://hudson.zones.apache.org/hudson/job/ActiveMQ-5.3-Deploy/ws/.repository/com/sun/xml/bind/jaxb-xjc/2.0.2/jaxb-xjc-2.0.2.jar>
Number of imports: 10
import: org.codehaus.classworlds.Entry@a6c57a42
import: org.codehaus.classworlds.Entry@12f43f3b
import: org.codehaus.classworlds.Entry@20025374
import: org.codehaus.classworlds.Entry@f8e44ca4
import: org.codehaus.classworlds.Entry@92758522
import: org.codehaus.classworlds.Entry@ebf2705b
import: org.codehaus.classworlds.Entry@bb25e54
import: org.codehaus.classworlds.Entry@bece5185
import: org.codehaus.classworlds.Entry@3fee8e37
import: org.codehaus.classworlds.Entry@3fee19d8


this realm = plexus.core.maven
Number of imports: 10
import: org.codehaus.classworlds.Entry@a6c57a42
import: org.codehaus.classworlds.Entry@12f43f3b
import: org.codehaus.classworlds.Entry@20025374
import: org.codehaus.classworlds.Entry@f8e44ca4
import: org.codehaus.classworlds.Entry@92758522
import: org.codehaus.classworlds.Entry@ebf2705b
import: org.codehaus.classworlds.Entry@bb25e54
import: org.codehaus.classworlds.Entry@bece5185
import: org.codehaus.classworlds.Entry@3fee8e37
import: org.codehaus.classworlds.Entry@3fee19d8


this realm = plexus.core
urls[0] = file:/home/hudson/hudson-slave/maven2.1-interceptor.jar
urls[1] = file:/home/hudson/hudson-slave/maven-interceptor.jar
urls[2] = file:/home/hudson/tools/maven/apache-maven-2.2.1/lib/maven-2.2.1-uber.jar
Number of imports: 10
import: org.codehaus.classworlds.Entry@a6c57a42
import: org.codehaus.classworlds.Entry@12f43f3b
import: org.codehaus.classworlds.Entry@20025374
import: org.codehaus.classworlds.Entry@f8e44ca4
import: org.codehaus.classworlds.Entry@92758522
import: org.codehaus.classworlds.Entry@ebf2705b
import: org.codehaus.classworlds.Entry@bb25e54
import: org.codehaus.classworlds.Entry@bece5185
import: org.codehaus.classworlds.Entry@3fee8e37
import: org.codehaus.classworlds.Entry@3fee19d8
-----------------------------------------------------
[HUDSON] Archiving <http://hudson.zones.apache.org/hudson/job/ActiveMQ-5.3-Deploy/ws/trunk/activemq-xmpp/pom.xml>
to /export/home/hudson/hudson/jobs/ActiveMQ-5.3-Deploy/modules/org.apache.activemq$activemq-xmpp/builds/2010-03-03_17-24-50/archive/org.apache.activemq/activemq-xmpp/5.3.1-SNAPSHOT/pom.xml
[INFO] ------------------------------------------------------------------------
[INFO] SKIPPING ActiveMQ :: Web Console
[INFO]    task-segment: [clean, deploy]
[INFO] This project has been banned from further executions due to previous failures.
[INFO] ------------------------------------------------------------------------
[INFO] ------------------------------------------------------------------------
[INFO] SKIPPING ActiveMQ :: Assembly
[INFO]    task-segment: [clean, deploy]
[INFO] This project has been banned from further executions due to previous failures.
[INFO] ------------------------------------------------------------------------
[INFO] 
[INFO] 
[INFO] ------------------------------------------------------------------------
[INFO] Reactor Summary:
[INFO] ------------------------------------------------------------------------
[INFO] ActiveMQ .............................................. SUCCESS [5:14.987s]
[INFO] ActiveMQ :: KahaDB .................................... SUCCESS [59.245s]
[INFO] ActiveMQ :: JAAS ...................................... SUCCESS [1:31.029s]
[INFO] Openwire Generator .................................... SUCCESS [28.907s]
[INFO] ActiveMQ :: jmdns 1.0 ................................. SUCCESS [18.335s]
[INFO] ActiveMQ :: Core ...................................... SUCCESS [4:48.519s]
[INFO] ActiveMQ :: RA ........................................ SUCCESS [37.185s]
[INFO] ActiveMQ :: Pool ...................................... SUCCESS [34.222s]
[INFO] ActiveMQ :: Camel ..................................... SUCCESS [1:07.811s]
[INFO] ActiveMQ :: Console ................................... SUCCESS [24.707s]
[INFO] ActiveMQ :: Optional .................................. SUCCESS [48.983s]
[INFO] ActiveMQ :: Jar Bundle ................................ SUCCESS [21.152s]
[INFO] ActiveMQ :: File Server ............................... SUCCESS [1:06.522s]
[INFO] ActiveMQ :: Apache Karaf .............................. SUCCESS [7.525s]
[INFO] ActiveMQ :: RAR ....................................... SUCCESS [54.206s]
[INFO] ActiveMQ :: Run Jar ................................... SUCCESS [8.112s]
[INFO] ActiveMQ Tooling ...................................... SUCCESS [3.394s]
[INFO] ActiveMQ :: Memory Usage Test Plugin .................. SUCCESS [1:02.590s]
[INFO] ActiveMQ :: Performance Test Plugin ................... SUCCESS [20.950s]
[INFO] ActiveMQ :: StartUp Plugin ............................ SUCCESS [27.242s]
[INFO] ActiveMQ :: Web ....................................... SUCCESS [55.778s]
[INFO] ActiveMQ :: Web Demo .................................. SUCCESS [3:12.473s]
[INFO] ActiveMQ :: XMPP ...................................... FAILED [11.901s]
[INFO] ActiveMQ :: Web Console ............................... SKIPPED (dependency build failed
or was skipped)
[INFO] ActiveMQ :: Assembly .................................. SKIPPED (dependency build failed
or was skipped)
[INFO] ------------------------------------------------------------------------
[INFO] Error for project: ActiveMQ :: XMPP (during deploy)
[INFO] ------------------------------------------------------------------------
[INFO] Internal error in the plugin manager executing goal 'org.jvnet.jaxb2.maven2:maven-jaxb2-plugin:0.1:generate':
Unable to load the mojo 'org.jvnet.jaxb2.maven2:maven-jaxb2-plugin:0.1:generate' in the plugin
'org.jvnet.jaxb2.maven2:maven-jaxb2-plugin'. A required class is missing: com/sun/tools/xjc/ErrorReceiver
[INFO] ------------------------------------------------------------------------
[INFO] Trace
org.apache.maven.lifecycle.LifecycleExecutionException: Internal error in the plugin manager
executing goal 'org.jvnet.jaxb2.maven2:maven-jaxb2-plugin:0.1:generate': Unable to load the
mojo 'org.jvnet.jaxb2.maven2:maven-jaxb2-plugin:0.1:generate' in the plugin 'org.jvnet.jaxb2.maven2:maven-jaxb2-plugin'.
A required class is missing: com/sun/tools/xjc/ErrorReceiver
	at org.apache.maven.lifecycle.DefaultLifecycleExecutor.executeGoals(DefaultLifecycleExecutor.java:698)
	at org.apache.maven.lifecycle.DefaultLifecycleExecutor.executeGoalWithLifecycle(DefaultLifecycleExecutor.java:556)
	at org.apache.maven.lifecycle.DefaultLifecycleExecutor.executeGoal(DefaultLifecycleExecutor.java:535)
	at org.apache.maven.lifecycle.DefaultLifecycleExecutor.executeGoalAndHandleFailures(DefaultLifecycleExecutor.java:387)
	at org.apache.maven.lifecycle.DefaultLifecycleExecutor.executeTaskSegments(DefaultLifecycleExecutor.java:348)
	at org.apache.maven.lifecycle.DefaultLifecycleExecutor.execute(DefaultLifecycleExecutor.java:180)
	at org.apache.maven.lifecycle.LifecycleExecutorInterceptor.execute(LifecycleExecutorInterceptor.java:65)
	at org.apache.maven.DefaultMaven.doExecute(DefaultMaven.java:328)
	at org.apache.maven.DefaultMaven.execute(DefaultMaven.java:138)
	at org.apache.maven.cli.MavenCli.main(MavenCli.java:362)
	at sun.reflect.NativeMethodAccessorImpl.invoke0(Native Method)
	at sun.reflect.NativeMethodAccessorImpl.invoke(NativeMethodAccessorImpl.java:39)
	at sun.reflect.DelegatingMethodAccessorImpl.invoke(DelegatingMethodAccessorImpl.java:25)
	at java.lang.reflect.Method.invoke(Method.java:592)
	at org.codehaus.classworlds.Launcher.launchEnhanced(Launcher.java:315)
	at org.codehaus.classworlds.Launcher.launch(Launcher.java:255)
	at hudson.maven.agent.Main.launch(Main.java:165)
	at hudson.maven.MavenBuilder.call(MavenBuilder.java:159)
	at hudson.maven.MavenModuleSetBuild$Builder.call(MavenModuleSetBuild.java:688)
	at hudson.maven.MavenModuleSetBuild$Builder.call(MavenModuleSetBuild.java:632)
	at hudson.remoting.UserRequest.perform(UserRequest.java:104)
	at hudson.remoting.UserRequest.perform(UserRequest.java:48)
	at hudson.remoting.Request$2.run(Request.java:236)
	at java.util.concurrent.Executors$RunnableAdapter.call(Executors.java:417)
	at java.util.concurrent.FutureTask$Sync.innerRun(FutureTask.java:269)
	at java.util.concurrent.FutureTask.run(FutureTask.java:123)
	at java.util.concurrent.ThreadPoolExecutor$Worker.runTask(ThreadPoolExecutor.java:651)
	at java.util.concurrent.ThreadPoolExecutor$Worker.run(ThreadPoolExecutor.java:676)
	at java.lang.Thread.run(Thread.java:595)
Caused by: org.apache.maven.plugin.PluginManagerException: Unable to load the mojo 'org.jvnet.jaxb2.maven2:maven-jaxb2-plugin:0.1:generate'
in the plugin 'org.jvnet.jaxb2.maven2:maven-jaxb2-plugin'. A required class is missing: com/sun/tools/xjc/ErrorReceiver
	at org.apache.maven.plugin.DefaultPluginManager.getConfiguredMojo(DefaultPluginManager.java:669)
	at org.apache.maven.plugin.DefaultPluginManager.executeMojo(DefaultPluginManager.java:468)
	at hudson.maven.agent.PluginManagerInterceptor.executeMojo(PluginManagerInterceptor.java:182)
	at org.apache.maven.lifecycle.DefaultLifecycleExecutor.executeGoals(DefaultLifecycleExecutor.java:694)
	... 28 more
Caused by: org.codehaus.plexus.component.repository.exception.ComponentLookupException: Unable
to lookup component 'org.apache.maven.plugin.Mojoorg.jvnet.jaxb2.maven2:maven-jaxb2-plugin:0.1:generate',
it could not be created
	at org.codehaus.plexus.DefaultPlexusContainer.lookup(DefaultPlexusContainer.java:335)
	at org.codehaus.plexus.DefaultPlexusContainer.lookup(DefaultPlexusContainer.java:440)
	at hudson.maven.agent.ContainerFilter.lookup(ContainerFilter.java:89)
	at hudson.maven.agent.PluginManagerInterceptor$1$1.lookup(PluginManagerInterceptor.java:95)
	at org.apache.maven.plugin.DefaultPluginManager.getConfiguredMojo(DefaultPluginManager.java:652)
	... 31 more
Caused by: org.codehaus.plexus.component.factory.ComponentInstantiationException: Could not
instanciate component: role: 'null', implementation: 'org.jvnet.jaxb2.maven2.XJC2Mojo'
	at org.codehaus.plexus.component.factory.java.JavaComponentFactory.makeException(JavaComponentFactory.java:77)
	at org.codehaus.plexus.component.factory.java.JavaComponentFactory.newInstance(JavaComponentFactory.java:62)
	at org.codehaus.plexus.DefaultPlexusContainer.createComponentInstance(DefaultPlexusContainer.java:1464)
	at org.codehaus.plexus.component.manager.AbstractComponentManager.createComponentInstance(AbstractComponentManager.java:93)
	at org.codehaus.plexus.component.manager.PerLookupComponentManager.getComponent(PerLookupComponentManager.java:48)
	at org.codehaus.plexus.DefaultPlexusContainer.lookup(DefaultPlexusContainer.java:331)
	... 35 more
Caused by: java.lang.NoClassDefFoundError: com/sun/tools/xjc/ErrorReceiver
	at java.lang.Class.getDeclaredConstructors0(Native Method)
	at java.lang.Class.privateGetDeclaredConstructors(Class.java:2357)
	at java.lang.Class.getConstructor0(Class.java:2671)
	at java.lang.Class.newInstance0(Class.java:321)
	at java.lang.Class.newInstance(Class.java:303)
	at org.codehaus.plexus.component.factory.java.JavaComponentFactory.newInstance(JavaComponentFactory.java:44)
	... 39 more
[INFO] ------------------------------------------------------------------------
[INFO] BUILD ERRORS
[INFO] ------------------------------------------------------------------------
[INFO] Total time: 29 minutes 44 seconds
[INFO] Finished at: Wed Mar 03 17:54:54 UTC 2010
[INFO] Final Memory: 95M/1075M
[INFO] ------------------------------------------------------------------------
Waiting for Hudson to finish collecting data
channel stopped


Mime
View raw message